[
    {
      "id":1,
      "img":"https://a0.muscache.com/im/pictures/0d597528-9d39-4d7d-8654-c74420651836.jpg?im_w=1200",
      "name": "Estúdio Cascata",
      "city":"Porto",
      "country":"Portugal",
      "info":"3 hóspedes 1 quarto 2 camas 1 casa de banho",
      "reviews":"4.99",
      "price":105
    },

    {
        "id":2,
        "img":"https://a0.muscache.com/im/pictures/02f5e199-b11a-44c4-962a-c47d4979e82a.jpg?im_w=960",
        "name": "Quinta miminel cottage t1 jacuzzi privé",
        "city":"Braga",
        "country":"Portugal",
        "info":"3 hóspedes1 quarto1 cama1 casa de banho",
        "reviews":"5.0",
        "price":100
      },
      {
        "id":3,
        "img":"https://a0.muscache.com/im/pictures/9fd01261-359b-43d6-9d54-b35b0c4e028c.jpg?im_w=960",
        "name": "Cozy modern tiny house with riverview in the woods",
        "city":"Coimbra",
        "country":"Portugal",
        "info":"2 hóspedes 2 camas 1 casa de banho",
        "reviews":"4.90",
        "price":62
      },
      {
        "id":4,
        "img":"https://a0.muscache.com/im/pictures/5f7a44df-80d0-4f2a-9761-9e488bf0fa20.jpg?im_w=960",
        "name": "Lagares Douro Villas V1",
        "city":"Bragança",
        "country":"Portugal",
        "info":"3 hóspedes 1 quarto 2 camas 1 casa de banho",
        "reviews":"4,99",
        "price":130
      },
      {
        "id":5,
        "img":"https://a0.muscache.com/im/pictures/fe1c6b39-287c-4f45-8bb9-3091da201f6e.jpg?im_w=960",
        "name": "Amanita Treehouse Experience Gerês",
        "city":"Braga",
        "country":"Portugal",
        "info":"2 hóspedes 1 quarto 1 cama 1 casa de banho",
        "reviews":"4,95",
        "price":85
      },
      {
        "id":6,
        "img":"https://a0.muscache.com/im/pictures/83087995/ecd50775_original.jpg?im_w=1200",
        "name": "Spacious accommodation - Casa do Pisão",
        "city":"Coimbra",
        "country":"Portugal",
        "info":"4 hóspedes 2 quartos 4 camas 2 casas de banho",
        "reviews":"4,98",
        "price":90.00
      },
      {
        "id":7,
        "img":"https://a0.muscache.com/im/pictures/b763c031-7074-4bcf-879f-fa535403320c.jpg?im_w=960",
        "name": "Green Box",
        "city":"Porto",
        "country":"Portugal",
        "info":"2 hóspedes 1 cama 1 casa de banho",
        "reviews":"4,81",
        "price":52
      },
      {
        "id":8,
        "img":"https://a0.muscache.com/im/pictures/23669c38-a2cf-4861-9b39-3d06ab77f26c.jpg?im_w=1200",
        "name": "Camping bus retro dos anos 60 ",
        "city":"Leiria",
        "country":"Portugal",
        "info":"4 hóspedes 1 quarto 1 cama 1 casa de banho",
        "reviews":"4,99",
        "price":110
      },
      {
        "id":9,
        "img":"https://a0.muscache.com/im/pictures/5dc0b543-d556-4f07-95f5-4734af612f86.jpg?im_w=960",
        "name": "Hut D @ LovelyMemories",
        "city":"Porto",
        "country":"Portugal",
        "info":"2 hóspedes 1 cama 1 casa de banho",
        "reviews":"4,96",
        "price":69
      },
      {
        "id":10,
        "img":"https://a0.muscache.com/im/pictures/3d0b7af6-162c-4db4-b2f7-85fbf3e8fb58.jpg?im_w=960",
        "name": "Bungalow aconchegante",
        "city":"Viseu",
        "country":"Portugal",
        "info":"4 hóspedes 1 quarto 2 camas 1 casa de banho",
        "reviews":"5,0",
        "price":42
      },
      {
        "id":11,
        "img":"https://a0.muscache.com/im/pictures/prohost-api/Hosting-43195532/original/35bd2044-fd3e-434e-862b-0546ba051fd8.jpeg?im_w=960",
        "name": "Casas de Calcário",
        "city":"Santiago da Guarda",
        "country":"Portugal",
        "info":"2 hóspedes 1 quarto 1 cama 1 casa de banho",
        "reviews":"4,89",
        "price":86
      },
      {
        "id":12,
        "img":"https://a0.muscache.com/im/pictures/083ca210-9791-4323-b82e-5ce4011f6d97.jpg?im_w=960",
        "name": "Relax Container",
        "city":"Guarda",
        "country":"Portugal",
        "info":"2 hóspedes 1 quarto 1 cama 1 casa de banho e meia",
        "reviews":"4,93",
        "price":120
      }
]

