{
  "font": {
    "size": {
      "xxxs": { "value": "12px" },
      "xxs": { "value": "14px" },
      "xs": { "value": "16px" },
      "sm": { "value": "20px" },
      "md": { "value": "24px" },
      "lg": { "value": "32px" },
      "xl": { "value": "40px" },
      "xxl": { "value": "48px" },
      "xxxl": { "value": "64px" },
      "display": { "value": "72px" },
      "giant": { "value": "80px" }
    }
  }
}
  