Total de horas: 59:28

02/01/2025  Total 01:13
17:00 as 18:13 - isip-561 - Atuando no filtro de Lancamento Mensal fazendo o metodo com criteria Builder

03/01/2025 01:21 + 00:46 = Total 02:07
17:00 as 18:21 - isip-561 - Fazendo alterações do sonar e testando - Tela de Lançamento Mensal
19:16 as 20:02 - isip-561 subindo para homologação

04/01/2025 Total 01:08
20:45 as 21:53 - ieso-1642 - Atualizar regra de cargo em comissão no evento S-2206, enviado para homologação.

07/01/2025 Total 00:45
21:26 as 22:11 - ieso-1595 - Carimbando evento S1202, S2400 e S2410, todos os eventos carimbados.

13/01/2025 - 00:20 + 00:51 = Total 01:11
17:00 as 17:20 - Reunião com Rafael e Daniel Rodrigues a respeito da isip-621 e isip-593
19:48 as 20:39 - isip-620 - Correção do filtro de verbas individuais

16/01/2025 - 00:48 + 00:53 = Total 01:41
17:00 as 17:48 - Ajustando telas de consulta eSocial mergiado homologação.
20:26 as 21:19 - Ajustando telas de consulta eSocial mergiado homologação.

Total Geral = 08:05

Total = 59:28 + 08:05 = 67:33

-08:00 - 24/12/2024
-08:00 - 31/12/2024

Total = 67:33 - 08:00 -08:00 = 51:33


21/01/2025 Total 00:48
17:00 as 17:48 - Criando a rota para consultar o ID da tabela de icmmFuncaoCargo diretamente na folha

22/01/2025 Total 00:39
20:03 as 20:42 - liberando isip-631 para homologação, subindo atualização do Agile para homologação (ISIP)

21/02/2025 Total 01:08
17:00 as 18:08 - isip-698 Atuação na analise e correção do unidadeGestora como paramentro de GrupoVerbas 

24/02/2025 Total 01:56
17:00 as 18:56 - isip-561 - Correção dos Reports de pesquisa

25/02/2025 
17:00 as 17:23 - Telefone com Ana Paula Atendimento card IESO-1795







