{
  "project_info": {
    "project_number": "30150245294",
    "firebase_url": "https://seeker-66515.firebaseio.com",
    "project_id": "seeker-66515",
    "storage_bucket": "seeker-66515.appspot.com"
  },
  "client": [
    {
      "client_info": {
        "mobilesdk_app_id": "1:30150245294:android:b7daf8ebaf38da3b",
        "android_client_info": {
          "package_name": "com.Ana.Seeker"
        }
      },
      "oauth_client": [
        {
          "client_id": "30150245294-lttctspt7fjhctgm1re6pg0rgm0sh81j.apps.googleusercontent.com",
          "client_type": 3
        }
      ],
      "api_key": [
        {
          "current_key": "AIzaSyB_Hju4yhUL2kF0rvlYdzCkw0r1n1uh_UE"
        }
      ],
      "services": {
        "appinvite_service": {
          "other_platform_oauth_client": [
            {
              "client_id": "30150245294-lttctspt7fjhctgm1re6pg0rgm0sh81j.apps.googleusercontent.com",
              "client_type": 3
            }
          ]
        }
      }
    }
  ],
  "configuration_version": "1"
}