<?xml version="1.0" encoding="utf-8"?>
<!-- Generator: Adobe Illustrator 15.1.0, SVG Export Plug-In . SVG Version: 6.00 Build 0)  -->
<!DOCTYPE svg PUBLIC "-//W3C//DTD SVG 1.1//EN" "http://www.w3.org/Graphics/SVG/1.1/DTD/svg11.dtd">
<svg version="1.1" id="Layer_1" xmlns="http://www.w3.org/2000/svg" xmlns:xlink="http://www.w3.org/1999/xlink" x="0px" y="0px"
	 width="165px" height="134px" viewBox="0 0 165 134" enable-background="new 0 0 165 134"
	 xml:space="preserve">
	<g transform="translate(0 20)">
<polygon fill="#53AFE2" points="100.203,90.75 100.203,5.191 80.162,24.448 80.13,114.279 88.592,114.375 "/>
<rect x="60.119" y="42" fill="#FF4A3D" width="20.041" height="72.374"/>
<polygon fill="#079E8F" points="5.766,52.13 0.001,52.13 0.001,64.042 0.001,114.377 20.028,114.377 20.042,114.377 20.042,52.13
	"/>
<rect x="0" y="73.596" fill="#53AFE2" width="20.028" height="40.778"/>
<rect x="20.028" y="35.103" fill="#0F4B60" width="20.041" height="57.741"/>
<rect x="40.074" y="60.61" fill="#FFB85E" width="20.041" height="18.923"/>
<rect x="87.18" y="27.433" fill="#FFFFFF" width="2.004" height="48.42"/>
<rect x="91.182" y="27.433" fill="#FFFFFF" width="2.004" height="48.42"/>
<rect x="95.184" y="27.433" fill="#FFFFFF" width="2.004" height="48.42"/>
<rect x="62.311" y="59.033" fill="#FFFFFF" width="15.656" height="2.004"/>
<rect x="62.311" y="55.031" fill="#FFFFFF" width="15.656" height="2.004"/>
<rect x="62.311" y="51.029" fill="#FFFFFF" width="15.656" height="2.004"/>
<rect x="62.311" y="47.028" fill="#FFFFFF" width="15.656" height="2.004"/>
<rect x="62.311" y="74.977" fill="#FFFFFF" width="15.656" height="2.004"/>
<rect x="62.311" y="70.975" fill="#FFFFFF" width="15.656" height="2.004"/>
<rect x="62.311" y="66.973" fill="#FFFFFF" width="15.656" height="2.004"/>
<rect x="62.311" y="62.971" fill="#FFFFFF" width="15.656" height="2.004"/>
<polygon fill="#53AFE2" points="20.028,73.596 20.042,73.611 20.042,73.596 "/>
<polygon fill="#FF4A3D" points="20.028,114.375 40.069,114.375 40.069,93.137 20.041,73.61 20.028,73.597 "/>
<polygon fill="#079E8F" points="60.115,83.328 28.632,114.375 60.115,114.375 "/>
<polygon fill="#0F4B60" points="102.999,114.375 138.056,82.955 132.319,82.955 128.926,82.955 118.757,82.955 113.022,82.955
	109.628,82.955 74.571,114.375 "/>
	</g>
</svg>
