<?xml version="1.0" encoding="utf-8"?>
<!-- Generator: Adobe Illustrator 15.1.0, SVG Export Plug-In . SVG Version: 6.00 Build 0)  -->
<!DOCTYPE svg PUBLIC "-//W3C//DTD SVG 1.1//EN" "http://www.w3.org/Graphics/SVG/1.1/DTD/svg11.dtd">
<svg version="1.1" id="Layer_1" xmlns="http://www.w3.org/2000/svg" xmlns:xlink="http://www.w3.org/1999/xlink" x="0px" y="0px"
	 width="467.977px" height="370.481px" viewBox="0 0 467.977 370.481" enable-background="new 0 0 467.977 370.481"
	 xml:space="preserve">
<g>
	<path fill="#B4B4B4" d="M136.085,202.477c0,0-44.918-1.76-52.672,4.193c-7.753,5.953-8.317,10.886-4.735,31.973
		c3.581,21.085,26.321,58.124,34.517,58.371s24.87-10.777,36.763-20.44C161.851,266.911,136.085,202.477,136.085,202.477z"/>
	<circle fill="#113B4F" cx="239.055" cy="219.699" r="107.407"/>
	<circle fill="#113B4F" cx="238.111" cy="220.488" r="107.408"/>
	<g>
		<polygon fill="#079E8F" points="243.579,255.127 240.016,252.353 234.362,259.612 249.522,271.419 263.637,253.298 		"/>
		<polygon fill="#FF4A3D" points="227.705,245.111 218.475,228.448 209.8,246.836 227.182,255.038 231.108,246.716 		"/>
		<polygon fill="#FFB85E" points="240.571,223.397 241.23,223.597 246.9,204.944 228.511,199.354 226.721,205.241 		"/>
		<polygon fill="#53AFE2" points="251.813,230.378 273.311,217.073 275.11,208.127 256.274,204.338 251.067,230.228 		"/>
	</g>
	<path fill="#FF4A3D" d="M234.455,192.85c-0.019-3.768-1.14-7.736-2.204-11.394c-1.189-4.097-1.17-8.522-2.329-12.563
		c-0.541-1.877-0.083-3.075-0.18-4.996c-0.067-1.352-0.512-3.234-0.72-4.646c-0.347-2.354-0.258-5.949-1.475-7.958
		c0.976-0.948,2.787-0.772,4.066-1.145c1.572-0.455,3.004-1.129,4.516-1.702c2.357-0.894,4.809-1.004,7.273-1.457
		c1.947-0.359,3.973-0.977,5.912-1.468c1.262-0.32,3.545-1.281,4.819-0.922c2.619,0.739,2.296,7.858,2.69,10.414
		c0.479,3.114,0.859,6.085,1.549,9.181c0.564,2.534,0.472,5.008,1.064,7.418c0.9,3.663,0.824,7.027,2.158,10.642
		c0.486,1.321,1.873,3.082,0.724,4.108c-1.188,1.058-4.388,0.582-5.89,0.982c-4.579,1.217-9.159,2.77-13.648,3.801
		c-2.22,0.51-6.364,2.907-8.558,1.715"/>
	<path fill="#FFFFFF" d="M285.126,251.704c-0.98-3.639-3.076-7.187-5.039-10.452c-2.197-3.657-3.31-7.94-5.461-11.552
		c-1.001-1.676-0.865-2.951-1.45-4.784c-0.409-1.289-1.32-2.995-1.882-4.308c-0.937-2.188-1.77-5.686-3.46-7.316
		c0.703-1.166,2.498-1.459,3.64-2.145c1.403-0.842,2.616-1.859,3.931-2.799c2.052-1.467,4.394-2.199,6.661-3.268
		c1.79-0.844,3.591-1.959,5.341-2.93c1.14-0.63,3.101-2.144,4.424-2.121c2.721,0.045,4.227,7.011,5.262,9.38
		c1.258,2.888,2.384,5.664,3.842,8.481c1.192,2.305,1.734,4.721,2.925,6.9c1.804,3.311,2.59,6.583,4.803,9.737
		c0.808,1.153,2.599,2.502,1.749,3.786c-0.878,1.326-4.092,1.685-5.442,2.456c-4.117,2.346-8.148,5.016-12.225,7.159
		c-2.017,1.062-5.41,4.438-7.838,3.845"/>
	<path fill="#FFFFFF" d="M240.781,180.847c1.371-3.509,1.792-7.61,2.15-11.404c0.404-4.246,2.054-8.353,2.466-12.537
		c0.19-1.943,1.058-2.888,1.675-4.71c0.436-1.28,0.717-3.194,1.043-4.584c0.547-2.315,1.953-5.625,1.561-7.941
		c1.26-0.521,2.877,0.309,4.203,0.436c1.629,0.156,3.209,0.057,4.825,0.082c2.521,0.038,4.84,0.839,7.299,1.327
		c1.941,0.384,4.054,0.556,6.036,0.814c1.291,0.168,3.769,0.116,4.82,0.919c2.162,1.652-0.762,8.15-1.336,10.672
		c-0.703,3.072-1.445,5.974-1.946,9.106c-0.408,2.562-1.407,4.829-1.744,7.287c-0.514,3.737-1.824,6.837-1.918,10.688
		c-0.034,1.407,0.606,3.556-0.84,4.086c-1.494,0.545-4.293-1.075-5.837-1.258c-4.705-0.556-9.535-0.8-14.088-1.497
		c-2.254-0.344-6.989,0.357-8.588-1.561"/>
	<path fill="#F5F5F5" d="M172.445,208.59c3.73-0.525,7.512-2.172,10.993-3.721c3.897-1.73,8.285-2.309,12.133-4.002
		c1.788-0.788,3.036-0.496,4.926-0.852c1.329-0.25,3.136-0.944,4.506-1.342c2.286-0.66,5.86-1.057,7.686-2.535
		c1.072,0.842,1.142,2.658,1.683,3.875c0.663,1.496,1.524,2.825,2.295,4.246c1.204,2.215,1.644,4.628,2.424,7.01
		c0.618,1.881,1.504,3.805,2.252,5.66c0.487,1.206,1.749,3.34,1.563,4.65c-0.377,2.695-7.476,3.335-9.954,4.07
		c-3.021,0.896-5.915,1.673-8.89,2.774c-2.433,0.9-4.898,1.143-7.206,2.055c-3.509,1.386-6.851,1.765-10.253,3.573
		c-1.243,0.66-2.802,2.273-3.972,1.272c-1.209-1.035-1.17-4.269-1.77-5.704c-1.824-4.373-3.98-8.7-5.607-13.009
		c-0.805-2.132-3.741-5.915-2.854-8.249"/>
	<path fill="#FFB75E" d="M226.762,146.091c0.105,0.084,1.415,2.005,3.916,1.389c2.5-0.615,7.608-1.54,7.608-1.54l1.386,2.154
		c0,0-1.889,1.333-1.99,2.587c-0.102,1.256-0.108,1.622,0.354,1.626c0.459,0.004,1.002-1.294,1.744-2.201
		c0.74-0.905,2.029-1.553,2.029-1.999c-0.002-0.256-0.171-1.577-0.469-2.614c-0.219-0.764-0.469-1.509-0.675-1.888
		c-0.487-0.893-0.918-1.521-0.817-1.402c0.103,0.121,1.736,4.34,1.789,4.604c0.053,0.266-0.81,1.745-0.549,2.113
		c0.262,0.368,1.263-0.426,1.784-1.832c0.522-1.407-0.027-2.898-0.435-4.306c-0.406-1.407-0.793-2.144-0.793-2.144l0.937,2.628
		l0.501,2.75c0,0,0.807-3.711-0.047-6.044c-0.852-2.334-1.317-2.005-3.98-3.037c-2.667-1.032-7.661,1.432-10.91,0.725
		c-3.248-0.706-5.944,2.346-5.919,2.495C222.25,140.308,226.762,146.091,226.762,146.091z"/>
	<path fill="#FFB75E" d="M362.646,240.198l0.074-3.829c0,0-4.125-5.135-6.113-6.724c-1.988-1.588-8.142-4.564-14.185-5.168
		c-6.041-0.604-19.289-3.4-21.499-4.647c-2.21-1.245-8.085-6.146-10.197-6.646c-2.113-0.5-7.345,1.843-9.351,2.975
		c-2.005,1.13-4.413,2.582-3.093,3.249c1.321,0.667,5.26,0.309,9.008-0.954c3.749-1.262,4.855-1.615,5.022-0.822
		c0.167,0.791-0.05,3.964-1.551,3.572c-1.498-0.391-4.562-0.926-5.279-0.126c-0.718,0.801-0.617,1.548,1.61,2.318
		c2.229,0.771,4.787,1.951,5.847,2.933c1.06,0.982,5.343,1.143,7.792,1.276c2.448,0.132,24.536,8.423,28.051,10.811
		c3.514,2.389,4.241,4.659,5.781,6.639C356.103,247.032,362.646,240.198,362.646,240.198z"/>
	<path fill="#FFB75E" d="M287.96,281.172c-0.465,4.619-0.97,36.739,1.429,39.829c2.396,3.091,15.067,4.943,18.725,3.979
		c3.655-0.965-0.222-12.891-0.222-12.891c-0.488-0.128-8.785,1.506-10.262-4.404c-1.476-5.91-1.558-26.517-1.476-27.225
		L287.96,281.172z"/>
	<path fill="#FFB75E" d="M152.371,230.153"/>
	<path fill="#FFB75E" d="M155.308,227.739"/>
	<path fill="#FFB75E" d="M160.508,225.36"/>
	<path fill="#FFB75E" d="M172.482,262.18c0,0-8.063-19-9.567-21.508c-1.506-2.508-2.471-3.747-1.949-4.679
		c0.522-0.932,3.651-6.404,3.802-7.155c0.15-0.751,1.066-5.014,0.178-5.083c-0.887-0.069-0.706,4.208-2.209,5.604
		c0,0,0.951-3.991,1.049-4.659c0.098-0.669-1.837-4.691-1.845-5.369c-0.008-0.678-1.442-0.205-1.228,1.453
		c0.213,1.658,1.315,3.333,1.187,3.529c-0.128,0.197-0.655,3.681-0.912,4.075c-0.258,0.396-0.312-2.285-0.646-4.359
		c-0.336-2.075-2.653-6.286-2.722-6.612s-1.536,0.63-0.782,2.754c0.754,2.123,1.816,4.895,1.75,6.033
		c-0.067,1.139-0.793,2.409-0.793,2.409s0.043-3.63-0.657-5.772c-0.7-2.145-0.943-4.271-1.649-4.225
		c-0.705,0.046-1.074,1.044-0.734,2.334c0.34,1.291,0.634,3.732,0.633,4.575c-0.001,0.7,0.051,3.295-0.178,4.833
		c-0.047,0.313-0.105,0.584-0.179,0.785c-0.432,1.181-2.555,2.324-1.77,4.425c1.271,3.403,6.56,24.3,8.661,29.146
		c2.101,4.849,10.734-2.252,10.734-2.252"/>
	<path fill="#FFB75E" d="M148.801,193.917l2.066-1.271c0,0,4.888,0.785,11.87,3.098c6.982,2.313,12.375,4.514,13.793,4.491
		c2.715-0.042,8.058-4.39,9.079-3.939c0.915,0.403,0.503,1.134-1.042,1.868c-1.865,0.883-1.882,2.314-0.792,2.316
		c1.091,0.001,8.071-1.439,8.451-0.855c0.669,1.029-0.172,1.087-1.417,1.449c-1.245,0.361-6.895,0.827-6.497,1.306
		c0.398,0.478,7.96,0.468,9,0.38c1.039-0.088,2.066,0.405,1.776,1.293c-0.33,1.013-4.784,0.755-6.451,0.842
		c-1.667,0.087-3.558,0.414-2.729,0.482c0.813,0.068,7.106-0.194,8.235,0.153c1.034,0.319-0.015,1.981-2.134,1.966
		c-2.119-0.016-9.688-0.074-9.267,0.493c1.182,1.59,2.761,1.942,4.973,2.196c0.908,0.104,0.335,2.896-4.761,1.354
		c-1.751-0.529-7.003-4.765-8.248-5.535c-1.243-0.77-16.724-2.06-25.022-2.313C141.388,203.437,148.801,193.917,148.801,193.917z"/>
	<path fill="#B4B4B4" d="M347.327,255.137c0,0,38.235,1.77,47.889,11.887c6.718,7.041,8.386,10.753-2.327,26.184
		c-10.713,15.432-24.745,38.058-24.745,38.058s-8.702,16.273-22.755,4.165c-14.054-12.107-23.841-40.74-23.841-40.74
		L347.327,255.137z"/>
	<path fill="#B4B4B4" d="M212.909,86.872c0,0-8.087-18.955-3.345-26.971c4.741-8.017,22.5-9.072,36.572-8.197
		c14.073,0.875,43.06,4.079,44.02,13.72c0.96,9.641-8.37,23.216-14.235,34.437C270.057,111.081,212.909,86.872,212.909,86.872z"/>
	<path fill="#FFB75E" d="M271.856,144.917c0,0-9.121,10.116-11.903,12.914c-2.781,2.795-8.536,6.348-6.688,3.722
		c1.849-2.624,5.972-6.211,5.972-6.211s-4.47,2.505-5.879,3.661c-1.41,1.155-5.694,2.242-4.813,1.031
		c0.884-1.212,7.329-5.112,6.833-5.626c-0.498-0.517-5.371,2.216-7.107,3.396c-1.734,1.183-3.925,1.941-2.74-0.012
		c1.184-1.952,10.727-6.717,9.079-6.916c-1.646-0.196-7.081,3.724-7.821,3.422c-0.74-0.3,0.239-1.944,2.215-3.339
		c1.979-1.395,10.626-5.11,9.267-5.82c-1.362-0.708-4.49,1.009-5.772,0.879c-1.281-0.128-1.006-1.192,0.361-2.052
		c1.367-0.856,5.736-2.147,8.072-1.908c2.333,0.241,5.643,0.406,6.82,0.019c1.176-0.387,3.366-0.756,3.366-0.756L271.856,144.917z"
		/>
	<path fill="#FFB75E" d="M295.18,290.055c0.057-0.223-1.763-4.825,0.601-8.101c2.359-3.273,6.933-11.688,5.311-11.557
		c-1.623,0.133-1.759,2.799-3.335,3.657c-1.571,0.858-2.015-1.716-1.731-4.022c0.285-2.308,1.556-10.233,0.303-10.004
		c-1.248,0.231-1.697,4.082-2.2,6.016c-0.504,1.934-1.626,2.593-1.324,0.211c0.304-2.382,1.269-9.751-0.207-9.264
		c-1.478,0.488-1.41,2.968-1.557,4.755c-0.147,1.787-0.585,6.518-1.089,4.798c-0.505-1.719,0.085-8.869-1.169-8.322
		s-1.195,3.976-1.136,5.58c0.06,1.602,0.581,5.39-0.585,4.689c-1.168-0.702-0.485-5.763-1.284-6.049
		c-0.799-0.288-1.646,0.84-1.737,2.404c-0.088,1.565,0.593,9.918,1.408,12.275c0.817,2.354,2.652,3.231,2.806,4.776
		c0.152,1.548,0.896,9.364,0.911,9.604C289.181,291.748,295.18,290.055,295.18,290.055z"/>
	<path fill="#FFB75E" d="M154.846,230.991c-0.903-0.779-0.825-3.479-0.408-5.286c0.418-1.808-1.236-1.77-1.366,0.884
		c-0.129,2.654-0.552,2.837-1.14,5.139c-0.589,2.304,1.501,3.921,2.685,5.451c1.182,1.532,3.341-3.805,3.341-3.805l-1.517-4.285
		C156.442,229.088,157.023,232.865,154.846,230.991z"/>
	<g>
		<path fill="#FFFFFF" d="M263.045,297.863c-0.357-0.321-1.211-2.418-1.211-2.418s1.906-3.183,2.289-3.057
			c0.381,0.127,1.232,2.24,1.416,3.518c0.16,1.112-1.178,2.239-1.397,2.094c-0.221-0.147-0.79-0.086-0.79-0.086L263.045,297.863z"/>
		<path fill="#FF4A3D" d="M261.834,295.445l-1.456,11.713c0,0-0.155,0.618,1.304,1.037c1.459,0.42,2.398-0.1,2.398-0.1l1.515-12.182
			c0,0-0.603,0.362-1.522,0.407C263.151,296.366,261.834,295.445,261.834,295.445z"/>
		<path fill="#FF4A3D" d="M262.928,293.731c0.169,0.26,1.059,0.782,2.174,0.392c-0.249-0.858-0.785-1.67-0.979-1.734
			C263.943,292.329,263.426,293.003,262.928,293.731z"/>
	</g>
	<g>
		<path fill="#FFFFFF" d="M193.172,253.141c0.109-0.469,1.533-2.228,1.533-2.228s3.708,0.133,3.781,0.53
			c0.072,0.396-1.366,2.158-2.396,2.938c-0.896,0.676-2.53,0.049-2.509-0.215c0.022-0.264-0.307-0.733-0.307-0.733L193.172,253.141z
			"/>
		<path fill="#54AFE2" d="M194.705,250.914l-10.96,4.378c0,0-0.617,0.162-0.279,1.643c0.336,1.48,1.245,2.054,1.245,2.054
			l11.4-4.555c0,0-0.609-0.352-1.093-1.136C194.534,252.511,194.705,250.914,194.705,250.914z"/>
		<path fill="#54AFE2" d="M196.734,251.045c-0.146,0.272-0.175,1.305,0.707,2.094c0.631-0.635,1.082-1.496,1.045-1.695
			C198.452,251.256,197.612,251.129,196.734,251.045z"/>
	</g>
	<g>
		<g>
			<path fill="#113B4F" d="M207.205,202.946c0.521,0.637,0.89,1.367,1.329,2.057c0.284,0.447,1.818-0.172,1.647-0.441
				c-0.471-0.74-0.871-1.518-1.429-2.199C208.47,202.018,206.904,202.579,207.205,202.946L207.205,202.946z"/>
		</g>
	</g>
	<g>
		<g>
			<path fill="#113B4F" d="M208.73,206.119c0.027,0.724,0.447,1.329,0.851,1.906c0.389,0.556,1.972-0.046,1.517-0.697
				c-0.265-0.378-0.688-0.879-0.706-1.363C210.361,205.154,208.705,205.458,208.73,206.119L208.73,206.119z"/>
		</g>
	</g>
	<g>
		<g>
			<path fill="#113B4F" d="M210.342,209.458c0.122,0.284,0.244,0.569,0.366,0.854c0.157,0.367,1.758-0.184,1.647-0.441
				c-0.122-0.285-0.244-0.57-0.366-0.854C211.832,208.649,210.231,209.201,210.342,209.458L210.342,209.458z"/>
		</g>
	</g>
	<g>
		<g>
			<path fill="#113B4F" d="M211.604,211.921c0.421,1.813,1.285,3.481,2.281,5.043c0.33,0.518,1.924-0.042,1.522-0.672
				c-0.951-1.491-1.753-3.081-2.156-4.813C213.103,210.84,211.452,211.269,211.604,211.921L211.604,211.921z"/>
		</g>
	</g>
	<g>
		<g>
			<path fill="#113B4F" d="M201.869,205.167c1.505,3.771,4.149,6.936,5.611,10.727c0.195,0.506,1.819,0.004,1.647-0.441
				c-1.461-3.791-4.106-6.956-5.611-10.727C203.315,204.218,201.694,204.727,201.869,205.167L201.869,205.167z"/>
		</g>
	</g>
	<g>
		<g>
			<path fill="#113B4F" d="M207.995,217.458c0.17,0.463,0.357,0.911,0.629,1.324c0.402,0.611,1.976-0.012,1.51-0.72
				c-0.216-0.329-0.355-0.678-0.491-1.046C209.371,216.28,207.732,216.745,207.995,217.458L207.995,217.458z"/>
		</g>
	</g>
	<g>
		<g>
			<path fill="#113B4F" d="M208.8,219.21c0.125,0.491,0.386,0.902,0.738,1.264c0.41,0.42,1.973-0.194,1.529-0.649
				c-0.304-0.312-0.511-0.631-0.62-1.056C210.297,218.183,208.648,218.62,208.8,219.21L208.8,219.21z"/>
		</g>
	</g>
	<g>
		<g>
			<path fill="#113B4F" d="M196.152,206.708c0.908,0.932,1.029,2.24,1.603,3.359c0.241,0.471,1.825-0.098,1.647-0.441
				c-0.606-1.183-0.745-2.525-1.706-3.512C197.361,205.769,195.821,206.366,196.152,206.708L196.152,206.708z"/>
		</g>
	</g>
	<g>
		<g>
			<path fill="#113B4F" d="M199.089,212.674c0.118,0.156,0.194,0.279,0.245,0.469c0.207,0.785,1.854,0.344,1.647-0.441
				c-0.075-0.285-0.209-0.528-0.386-0.763C200.13,211.323,198.565,211.981,199.089,212.674L199.089,212.674z"/>
		</g>
	</g>
	<g>
		<g>
			<path fill="#113B4F" d="M200.172,215.016c0.25,0.188,0.406,0.494,0.561,0.756c0.32,0.543,1.913-0.016,1.521-0.68
				c-0.22-0.374-0.44-0.68-0.789-0.942C200.969,213.777,199.473,214.49,200.172,215.016L200.172,215.016z"/>
		</g>
	</g>
	<g>
		<g>
			<path fill="#113B4F" d="M182.769,214.408c0.758,1.259,1.256,2.651,1.742,4.032c0.224,0.637,1.861,0.166,1.647-0.441
				c-0.515-1.467-1.061-2.926-1.866-4.262C183.979,213.217,182.383,213.767,182.769,214.408L182.769,214.408z"/>
		</g>
	</g>
	<g>
		<g>
			<path fill="#113B4F" d="M185.591,221.499c0.109,0.185,0.218,0.346,0.384,0.482c0.229,0.189,0.831-0.021,1.059-0.104
				c0.093-0.033,0.717-0.268,0.496-0.45c-0.128-0.106-0.207-0.228-0.291-0.37C187.004,220.661,185.468,221.29,185.591,221.499
				L185.591,221.499z"/>
		</g>
	</g>
	<g>
		<g>
			<path fill="#113B4F" d="M186.515,223.537c0.07,0.256,0.182,0.483,0.314,0.714c0.378,0.656,1.946,0.028,1.507-0.732
				c-0.082-0.142-0.13-0.266-0.174-0.423C187.948,222.319,186.302,222.761,186.515,223.537L186.515,223.537z"/>
		</g>
	</g>
	<g>
		<g>
			<path fill="#113B4F" d="M187.144,225.153c0.063,0.068,0.106,0.145,0.169,0.213c0.448,0.488,2.02-0.141,1.52-0.688
				c-0.063-0.068-0.107-0.144-0.17-0.212C188.215,223.977,186.643,224.607,187.144,225.153L187.144,225.153z"/>
		</g>
	</g>
	<g>
		<path fill="#B4B4B4" d="M273.144,204.883c2.09-0.38,4.572-2.04,6.605-2.998c2.487-1.173,4.817-2.498,7.291-3.664
			c3.712-1.749,7.318-3.131,11.225-4.047c5.255,10.223,9.079,21.172,13.978,31.569c0.575,1.222,2.016,3.338,1.365,4.61
			c-0.474,0.929-2.603,1.512-3.522,1.943c-4.305,2.029-8.419,4.354-12.571,6.489c-1.596,0.821-5.311,3.616-7.11,2.789
			c-1.104-0.508-1.742-2.788-2.235-3.835c-0.959-2.034-1.9-4.053-3.033-5.966c-5.034-8.488-9.412-17.729-13.316-26.829
			c0.253-0.068,0.447-0.03,0.676,0.015"/>
		<g>
			<g>
				<path fill="#113B4F" d="M281.563,207.315c1.171-0.049,2.091-0.566,3.09-1.135c1.137-0.648,2.563-0.774,3.738-1.411
					c0.211-0.114,0.511-0.447,0.156-0.599c-0.362-0.156-0.839-0.012-1.164,0.165c-0.858,0.465-1.801,0.706-2.736,0.962
					c-0.818,0.225-1.594,1.104-2.428,1.139c-0.372,0.016-0.853,0.12-1.091,0.439C280.899,207.182,281.322,207.326,281.563,207.315
					L281.563,207.315z"/>
			</g>
		</g>
		<g>
			<g>
				<path fill="#113B4F" d="M289.098,204.661c0.327-0.025,0.598-0.084,0.874-0.277c0.275-0.191,0.436-0.596,0.098-0.816
					c-0.351-0.23-0.858-0.115-1.18,0.107c-0.02,0.014-0.039,0.028-0.06,0.042c0.207-0.075,0.414-0.149,0.62-0.225
					c-0.064,0.001-0.129,0.005-0.194,0.011c-0.353,0.027-0.857,0.246-0.912,0.648C288.288,204.561,288.79,204.685,289.098,204.661
					L289.098,204.661z"/>
			</g>
		</g>
		<g>
			<g>
				<path fill="#113B4F" d="M280.926,214.759c1.815-0.397,3.569-1.182,5.36-1.701c1.609-0.467,3.386-0.9,4.89-1.663
					c0.987-0.5-0.502-0.687-1.006-0.431c-0.786,0.398-1.715,0.456-2.554,0.699c-0.707,0.205-1.346,0.583-2.057,0.79
					c-1.605,0.465-3.208,1.193-4.837,1.549C279.722,214.221,279.942,214.974,280.926,214.759L280.926,214.759z"/>
			</g>
		</g>
		<g>
			<g>
				<path fill="#113B4F" d="M293.775,210.731c0.394-0.084,0.777-0.184,1.152-0.334c0.123-0.049,0.732-0.33,0.47-0.547
					c-0.26-0.217-0.806-0.061-1.073,0.047c-0.233,0.094-0.476,0.142-0.721,0.193c-0.179,0.039-0.815,0.252-0.738,0.541
					C292.946,210.933,293.594,210.77,293.775,210.731L293.775,210.731z"/>
			</g>
		</g>
		<g>
			<g>
				<path fill="#113B4F" d="M296.729,209.534c0.123-0.017,0.345,0.04,0.481,0.043c0.396,0.01,0.832-0.092,1.165-0.313
					c0.257-0.169,0.221-0.381-0.104-0.389c-0.424-0.01-0.821-0.047-1.245,0.011c-0.276,0.037-0.83,0.173-0.963,0.464
					C295.932,209.638,296.638,209.545,296.729,209.534L296.729,209.534z"/>
			</g>
		</g>
		<g>
			<g>
				<path fill="#113B4F" d="M300.202,209.019c-0.32,0.133-0.053,0.026,0.069,0.012c0.322-0.039,0.852-0.212,0.93-0.585
					c0.079-0.379-0.482-0.428-0.723-0.398c-0.332,0.04-0.635,0.095-0.946,0.224c-0.225,0.093-0.685,0.419-0.428,0.706
					S299.903,209.143,300.202,209.019L300.202,209.019z"/>
			</g>
		</g>
		<g>
			<g>
				<path fill="#113B4F" d="M283.156,218.905c0.503,0.182,1.028,0.127,1.528-0.041c0.481-0.162,0.928-0.486,1.412-0.611
					c0.225-0.057,0.808-0.281,0.719-0.615c-0.091-0.338-0.706-0.232-0.93-0.174c-0.312,0.079-0.603,0.202-0.891,0.342
					c-0.164,0.08-0.327,0.163-0.492,0.24c-0.222,0.102-0.157,0.033-0.03,0.08c-0.376-0.137-0.829-0.04-1.165,0.16
					C283.117,218.399,282.778,218.768,283.156,218.905L283.156,218.905z"/>
			</g>
		</g>
		<g>
			<g>
				<path fill="#113B4F" d="M289.318,217.51c0.058-0.018,0.115-0.016,0.173,0.006c0.388,0.07,0.864-0.054,1.165-0.313
					c0.258-0.223,0.189-0.5-0.151-0.562c-0.482-0.087-0.924-0.023-1.399,0.073c-0.228,0.047-0.806,0.291-0.718,0.619
					C288.48,217.68,289.089,217.557,289.318,217.51L289.318,217.51z"/>
			</g>
		</g>
		<g>
			<g>
				<path fill="#113B4F" d="M291.398,216.819c0.417,0.088,0.836,0.104,1.257,0.033c0.321-0.054,0.85-0.199,0.931-0.582
					c0.079-0.37-0.484-0.433-0.722-0.393c-0.167,0.027-0.303,0.035-0.47,0c-0.392-0.082-0.87,0.035-1.165,0.313
					C290.976,216.429,291.046,216.745,291.398,216.819L291.398,216.819z"/>
			</g>
		</g>
		<g>
			<g>
				<path fill="#113B4F" d="M294.523,216.001c0.553,0.069,1.031-0.089,1.536-0.301c0.302-0.126,0.634-0.522,0.39-0.847
					c-0.256-0.342-0.781-0.263-1.118-0.121c-0.072,0.061-0.151,0.086-0.237,0.073c-0.391-0.049-0.894,0.13-1.072,0.504
					C293.841,215.684,294.179,215.958,294.523,216.001L294.523,216.001z"/>
			</g>
		</g>
		<g>
			<g>
				<path fill="#113B4F" d="M297.331,214.915c0.292,0.029,0.578,0.027,0.869-0.016c0.324-0.047,0.851-0.206,0.929-0.589
					c0.076-0.376-0.48-0.44-0.726-0.405c-0.159,0.023-0.29,0.018-0.451,0.002c-0.367-0.038-0.882,0.139-1.083,0.465
					C296.654,214.719,297.052,214.885,297.331,214.915L297.331,214.915z"/>
			</g>
		</g>
		<g>
			<g>
				<path fill="#113B4F" d="M301.106,214.288c-0.069,0.024,0.35,0.005,0.322,0.006c0.354-0.004,0.845-0.145,1.1-0.404
					c0.271-0.278-0.237-0.314-0.4-0.313c-0.558,0.007-1.081,0.09-1.607,0.277c-0.098,0.035-0.738,0.314-0.481,0.506
					C300.306,214.558,300.836,214.383,301.106,214.288L301.106,214.288z"/>
			</g>
		</g>
		<g>
			<g>
				<path fill="#113B4F" d="M286.759,224.64c1.094-0.614,2.25-1.09,3.41-1.563c0.928-0.378,1.862-1.182,2.871-1.265
					c0.845-0.068,1.34-1.09,0.203-0.996c-1.067,0.088-1.983,0.606-2.904,1.113c-1.485,0.818-3.134,1.311-4.623,2.146
					C284.744,224.621,286.181,224.964,286.759,224.64L286.759,224.64z"/>
			</g>
		</g>
		<g>
			<g>
				<path fill="#113B4F" d="M295.19,220.997c0.384-0.027,0.741-0.135,1.111-0.227c0.317-0.08,0.78-0.383,0.676-0.775
					c-0.107-0.4-0.655-0.413-0.973-0.334c-0.223,0.057-0.433,0.133-0.662,0.148c-0.358,0.025-0.858,0.254-0.91,0.659
					C294.379,220.882,294.873,221.018,295.19,220.997L295.19,220.997z"/>
			</g>
		</g>
		<g>
			<g>
				<path fill="#113B4F" d="M297.346,220.386c0.254-0.054,0.508-0.106,0.762-0.159c0.34-0.072,0.771-0.416,0.667-0.809
					c-0.112-0.419-0.643-0.439-0.981-0.367c-0.254,0.053-0.508,0.106-0.762,0.159c-0.34,0.071-0.771,0.416-0.667,0.809
					C296.477,220.438,297.007,220.458,297.346,220.386L297.346,220.386z"/>
			</g>
		</g>
		<g>
			<g>
				<path fill="#113B4F" d="M300.006,219.44c0.108-0.033,0.682-0.232,0.214-0.088c0.131-0.041,0.824-0.218,0.759-0.465
					c-0.064-0.24-0.759-0.063-0.89-0.023c-0.219,0.068-0.432,0.157-0.647,0.225c-0.068,0.021-0.74,0.299-0.495,0.453
					C299.225,219.716,299.732,219.526,300.006,219.44L300.006,219.44z"/>
			</g>
		</g>
		<g>
			<g>
				<path fill="#113B4F" d="M301.236,219.046c0.151-0.018,0.305-0.014,0.456-0.03c0.365-0.041,0.817-0.14,1.105-0.385
					c0.285-0.241-0.253-0.247-0.379-0.232c-0.151,0.017-0.305,0.013-0.456,0.03c-0.365,0.042-0.816,0.139-1.105,0.384
					C300.573,219.054,301.11,219.061,301.236,219.046L301.236,219.046z"/>
			</g>
		</g>
		<g>
			<g>
				<path fill="#113B4F" d="M303.137,218.625c0.547,0,1.778-0.829,0.67-0.829C303.26,217.795,302.029,218.625,303.137,218.625
					L303.137,218.625z"/>
			</g>
		</g>
		<g>
			<g>
				<path fill="#113B4F" d="M288.33,230.358c0.716-0.152,1.409-0.33,2.089-0.606c0.315-0.128,0.622-0.546,0.383-0.872
					c-0.259-0.354-0.777-0.277-1.123-0.137c-0.531,0.217-1.102,0.328-1.661,0.447c-0.337,0.072-0.772,0.412-0.668,0.805
					C287.462,230.412,287.993,230.43,288.33,230.358L288.33,230.358z"/>
			</g>
		</g>
		<g>
			<g>
				<path fill="#113B4F" d="M292.619,227.993c0.108-0.001,0.217-0.004,0.325-0.01c-0.051,0.005,0.57-0.051,0.259-0.047
					c0.396-0.006,0.823-0.104,1.165-0.313c0.257-0.157,0.228-0.348-0.093-0.344c-0.108,0-0.217,0.004-0.325,0.009
					c0.053-0.005-0.569,0.054-0.259,0.048c-0.396,0.007-0.823,0.104-1.165,0.313C292.271,227.805,292.298,227.999,292.619,227.993
					L292.619,227.993z"/>
			</g>
		</g>
		<g>
			<g>
				<path fill="#113B4F" d="M294.715,227.276c0.304,0.131,0.614,0.11,0.936,0.057c0.284-0.049,0.833-0.172,0.956-0.486
					c0.121-0.311-0.557-0.244-0.677-0.225c0.042-0.012,0.083-0.024,0.125-0.037c-0.331-0.143-0.862,0.04-1.157,0.191
					C294.703,226.877,294.377,227.129,294.715,227.276L294.715,227.276z"/>
			</g>
		</g>
	</g>
	<path fill="#FFB75E" d="M313.171,219.741c0,0-1.116,1.536-2.501,1.389c-1.384-0.146-4.181-0.334-5.07,0.137
		c-0.889,0.47-1.435,2.021-0.059,2.061c1.374,0.042,4.001,0.998,5.544,1.777c1.543,0.78,4.124-3.062,4.195-3.171
		C315.352,221.823,313.171,219.741,313.171,219.741z"/>
	<g>
		<path fill="#54AFE2" d="M262.087,139.41c-0.118-0.37-0.181-0.59-0.181-0.59C261.319,139.722,261.522,139.766,262.087,139.41z"/>
		<path fill="#54AFE2" d="M307.885,119.271c-0.731-5.903-15.142-31.405-25.651-37.916c-10.509-6.511-38.418-15.205-53.296-9.81
			c-0.566,0.206-14.413,4.68-27.472,18.213c-13.06,13.533-25.333,30.8-14.186,41.796c11.146,10.997,18.524,12.159,26.938,15.045
			c9.329,3.199,13.931,2.43,13.931,2.43l3.966-11.992c0,0-5-4.447-14.287-7.616c-9.287-3.17-14.311-5.089-14.503-8.437
			c-0.193-3.347,6.411-16.339,8.356-14.902c1.931,1.426,4.254,8.61,4.293,8.725c19.785-4.352,40.782-3.133,60.445,4.184
			c1.281-1.451,2.704-3.206,2.704-3.206l4.008-4.849c0,0,7.157,6.19,4.417,11.697c-0.156,0.312-0.354,0.626-0.58,0.94
			c0.137,0.068,0.274,0.132,0.412,0.202c-0.306,0.65-0.976,1.121-1.897,1.462c-4.931,4.659-15.677,9.13-19.112,10.893
			c-0.69,0.355-3.181,2.58-4.284,3.277c0.493,1.546,1.985,5.767,4.204,8.033c2.748,2.809,4.129,3.031,4.129,3.031
			s24.139-9.195,30.278-13.672C306.839,132.325,308.617,125.173,307.885,119.271z"/>
	</g>
	<path fill="#FFB75E" d="M229.61,80.762c0.262,0.392,1.045,7.93,6.9,10.638c5.856,2.707,6.281,2.169,6.859,3.212
		s2.119,2.756,2.866,2.843c2.313,0.27,3.168-2.682,4.559-2.886c1.392-0.204,7.054-1.174,10.896-5.253
		c3.843-4.08,5.702-12.04,5.733-12.316c0.033-0.276-34.27-2.584-34.946-1.545C231.801,76.493,229.61,80.762,229.61,80.762z"/>
	<path fill="#113B4F" d="M227.957,70.011c-0.545-2.637,0.666-7.344,2.212-9.617c0.857-1.262,2.092-2.149,3.063-3.33
		c1.16-1.412,1.984-3.06,3.268-4.37c5.241-5.346,12.628-6.927,19.067-3.022c3.306,2.004,7.15,4.197,9.579,7.27
		c1.415,1.791,2.696,4.03,3.045,6.286c0.36,2.335-0.087,4.917,0.416,7.229c0.786,3.616-0.896,13.566-2.142,13.553
		c-0.742-0.009,0.109,0.494-0.785,0.448c-1.501-0.076-2.426-0.583-3.766-1.109c-2.223-0.873-3.967-2.19-6.428-2.232
		c-1.896-0.032-3.655-0.588-5.466-1.135c-2.345-0.708-1.952,0.006-4.09,0.438c-3.094,0.624-5.579-1.405-8.406-1.693
		c-3.344-0.34-8.707,0.458-7.51,4.932c-1.549-0.448-2.136-3.557-2.951-4.849c-1.132-1.794-2.151-2.873-2.167-5.109
		c-0.008-1.134,0.309-3.056,0.734-3.991c0.545-1.201,1.584-1.215,2.176-2.28"/>
	<path fill="#113B4F" d="M241.715,72.164c-1.81,1.138-2.873,2.229-2.326,4.595c0.419,1.806,2.091,3.849,3.917,4.547
		c1.095,0.419,2.063-0.084,3.129,0.293c1.198,0.424,2.136,1.238,3.008,2.104c0.457,0.456,0.924,1.035,1.567,1.294
		c0.536,0.216,1.104,0.034,1.686,0.214c1.457,0.451,2.456,1.983,3.51,2.944c1.566,1.426,3.926,2.609,6.091,1.891
		c0.882-0.292,2.265-1.552,2.476-2.524c0.176-0.809-0.304-1.902-0.237-2.823c0.069-0.966,0.212-1.929-0.219-2.844
		c-0.99-2.104-3.831-3.729-5.679-4.935c-1.003-0.654-1.97-1.417-3.1-1.785c-1.229-0.401-2.441-0.28-3.582-0.896
		c-1.682-0.906-2.641-3.447-4.547-3.734c-0.558-0.083-1.574,0.117-2.2,0.155c-1.386,0.084-2.271,1.173-3.555,1.213"/>
	<path fill="#113B4F" d="M249.078,77.503c-1.519,0.735-2.294,2.81-3.763,3.73c-0.712,0.446-1.523,1.019-2.317,1.193
		c-2.152,0.471-4.5,0.292-6.64,0.363c-1.368,0.045-2.576,0.214-3.865-0.44c-0.615-0.312-1.143-1.018-1.777-0.414
		c-0.504,0.479-0.086,1.442,0.131,1.934c-1.351,0.264-1.526-1.583-1.587-2.476c-0.121-1.779,0.041-2.798,0.967-4.343
		c1.262-2.102,4.154-2.572,6.357-3.178c3.942-1.085,7.891-0.264,11.471,1.595c1.277,0.664,1.371,0.62,0.988,1.866"/>
	<path fill="#113B4F" d="M236.487,88.56c0.881,0.563,1.812,1.026,2.771,1.439c0.264,0.114,0.788,0.313,1.063,0.121
		c0.271-0.187-0.342-0.501-0.447-0.547c-0.835-0.359-1.636-0.763-2.402-1.253c-0.299-0.192-0.788-0.344-1.145-0.257
		C235.948,88.155,236.341,88.467,236.487,88.56L236.487,88.56z"/>
	<path fill="#113B4F" d="M252.336,91.987c0.436,0.236,0.973,0.169,1.439,0.084c0.627-0.113,1.281-0.341,1.807-0.706
		c0.355-0.246-0.377-0.633-0.625-0.46c-0.367,0.256-0.785,0.425-1.214,0.55c-0.233,0.068-0.849,0.266-1.046,0.158
		C252.321,91.41,251.836,91.715,252.336,91.987L252.336,91.987z"/>
	<path fill="#FFB75E" d="M233.291,83.267c-0.138-1.183,0.289-2.126-0.673-3.236c-0.754-0.869-1.557-1.389-2.347-0.482
		c-1.376,1.579,0.129,4.671,1.612,5.638c0.284-0.612,0.292-1.662,1.052-1.932"/>
	<path fill="#113B4F" d="M241.371,76.562c-3.052,1.31,0.148,3.605,1.357,4.688c1.287,1.151,2.281,2.565,3.572,3.735
		c1.35,1.223,2.496,2.441,4.453,2.358c2.225-0.097,3.527-0.625,5.465,0.762c2.85,2.043,3.633,5.4,7.135,6.241
		c1.807,0.436,4.333-1.772,4.74-4.021c0.346-1.919,1.327-5.73,0.245-6.993c-1.427-1.667-4.987-4.697-6.571-6.208
		c-2.457-2.345-3.832-1.024-6.67-3.008c-1.178-0.823-2.521-1.957-3.899-2.381c-1.543-0.476-3.522,0.049-5.107,0.244
		c-1.435,0.175-3.475,0.769-4.343,2.077c-0.531,0.799-0.066,1.403-0.333,2.141"/>
	<g>
		<path fill="#FF4A3D" d="M365.051,235.429c0.055-0.009,0.092-0.017,0.092-0.017S365.021,235.282,365.051,235.429z"/>
		<path fill="#FF4A3D" d="M370.756,282.76c0.065-0.1,0.596-1.096,1.269-2.519c1.223-2.579,2.909-6.566,3.144-9.168
			c0.362-4.04-6.797-29.548-8.725-32.942c-1.075-1.892-1.355-2.518-1.393-2.702c-0.625,0.106-4.644,0.857-7.795,2.859
			c-3.423,2.178-6.504,4.444-6.504,4.444l3.942,6.045l-12.028-0.976c-5.448,20.089-16.692,38.588-32.966,52.781l4.869,9.549
			l-8.508-0.067c0,0-1.42,6.689-1.496,11.316c-0.075,4.627,1.893,5.91,1.893,5.91s30.012-0.747,36.765-5.164
			c6.754-4.416,16.704-17.838,17.193-18.588C360.905,302.79,370.756,282.76,370.756,282.76z"/>
	</g>
	<path fill="#089D8E" d="M175.724,279.883c2.256-6.275-2.345-18.564-3.092-18.844c-2.908-1.089-8.982,1.153-12.123,4.035
		c0,0,2.25,1.217,0.913,4.83c-1.068,2.891-11.739,0.724-15.967-0.259c-0.613-0.128-1.231-0.261-1.851-0.402
		c-7.74-13.673-13.296-31.233-12.888-50.743c-1.233-0.331-2.877-1.012-2.589-2.252c0.454-1.945,4.017-5.536,8.796-9.741
		c4.779-4.206,12.917-1.993,12.917-1.993s1.132-0.484,2.238-3.434c1.106-2.947,1.24-8.158-0.656-8.376
		c-1.897-0.218-17.73-1.568-22.593-0.05c-4.862,1.519-11.805,12.484-15.735,17.262c-3.398,4.131-11.46,13.232-13.578,15.619
		c-0.332,0.372-0.518,0.582-0.518,0.582s-3.16,9.647-2.842,12.912s11.482,33.982,22.36,41.372
		c10.878,7.391,32.862,3.996,39.717,4.185C165.092,284.775,173.469,286.158,175.724,279.883z"/>
	<path fill="#FFB75E" d="M105.618,231.666c0,0,5.008,1.101,9.46,5.402c4.451,4.301,3.667,4.757,5.589,5.68
		c3.948,1.892,2.894,2.394,1.255,4.126s-1.382,3.682-2.033,6.438c-0.651,2.757-1.202,7.448-7.174,10.556
		c-5.971,3.108-11.325-0.724-13.155-3.188c-1.829-2.465-3.461-5.819-2.285-9.38C98.45,247.739,105.618,231.666,105.618,231.666z"/>
	<path fill="#113B4F" d="M115.346,236.772c-0.063,1.852-3.647-1.476-4.76-0.195c-0.952,1.097,0.304,4.755-0.333,5.9
		c-0.648,1.172,0.257,3.486-0.404,5.071c-0.759,1.819-2.334,3.159-3.44,4.628c1.979,1.385,1.974,6.767,3.574,8.267
		c1.453,1.36,2.857,0.366,4.562,1.514c6.718,4.52,9.595,11.635,6.511,18.576c-1.584,3.567-5.411,6.703-5.315,10.845
		c0.098,4.207,3.757,5.021,5.751,8.05c2.095,3.182,0.092,5.145,1.361,8.157c1.349,3.196,5.738,2.051,9.204,3.444
		c10.919,4.384-0.683,14.035-5.104,13.914c-26.595-0.734-22.079-7.487-32.49-12.736c-7.314-3.688-15.467-9.871-17.879-18.331
		c-1.522-5.344-0.829-8.043,0.814-13.186c1.889-5.914,0.635-10.759-2.607-16.142c-2.344-3.893-4.239-6.47-3.286-11.055
		c1.479-7.123,4.083-13.465,8.368-19.332c4.362-5.973,7.465-10.375,15.234-8.939c5.099,0.942,10.132,2.869,14.953,4.513
		C111.985,230.391,115.463,233.387,115.346,236.772z"/>
	<g>
		<g>
			<path fill="#FFB75E" d="M113.641,239.95c0.871,0.295,1.342,1.471,1.227,2.344"/>
			<path fill="#113B4F" d="M114.659,242.615c-0.12-0.078-0.191-0.222-0.171-0.372c0.095-0.723-0.302-1.704-0.969-1.93
				c-0.205-0.069-0.31-0.285-0.241-0.485c0.067-0.202,0.286-0.31,0.485-0.24c1.067,0.356,1.623,1.715,1.486,2.756
				c-0.028,0.21-0.221,0.358-0.431,0.331C114.76,242.666,114.705,242.645,114.659,242.615z"/>
		</g>
		<g>
			<path fill="#FFB75E" d="M116.922,250.75c0.284,1.203,0.431,2.19-0.243,3.396"/>
			<path fill="#113B4F" d="M116.469,254.467c-0.168-0.109-0.224-0.331-0.126-0.508c0.614-1.098,0.472-1.985,0.205-3.12
				c-0.049-0.207,0.079-0.414,0.285-0.463c0.207-0.048,0.413,0.078,0.462,0.285c0.288,1.22,0.465,2.338-0.281,3.673
				c-0.104,0.184-0.338,0.25-0.522,0.146C116.484,254.476,116.476,254.472,116.469,254.467z"/>
		</g>
	</g>
	<path fill="#FFB75E" d="M371.276,282.875c0,0,0.164-3.414-1.702-4.828c-1.865-1.415-3.893-2.072-4.879-1.786
		c-0.985,0.288-1.563,0.974-1.563,0.974s-5.401-1.596-8.302-1.427c-2.898,0.169-9.796,3.111-10.799,4.649
		c-1.002,1.538-3.918,1.433-5.597,1.863c-1.253,0.322-0.782,0.486-0.063,2.747c0.718,2.261,1,2.644,0.725,4.39
		s-1.87,5.62-0.024,9.612c1.848,3.993,4.373,6.437,4.373,6.437s-0.61,2.259,2.302,4.82c2.911,2.562,5.47,2.304,6.14,1.479
		C352.558,310.981,371.276,282.875,371.276,282.875z"/>
	<path fill="#113B4F" d="M370.849,278.227c-0.179,1.354-0.962,3.002-2.589,2.579c-1.242-0.322-1.303-1.745-2.413-2.228
		c-1.089-0.476-1.729,0.228-2.624,0.753c-0.566,0.329-0.617-0.392-1.126,0.442c-0.396,0.648,0.104,1.266,0.153,1.902
		c0.243,3.149-2.537,5.029-3.518,7.903c-0.4,1.176-0.394,2.366-1.242,3.423c-0.731,0.906-1.764,1.636-2.513,2.646
		c-1.751,2.361-3.384,3.926-5.834,5.581c-1.85,1.25-3.98,4.251-3.53,5.711c0.448,1.458,4.166,0.954,4.11,3.149
		c-0.033,1.325-0.913,1.435-0.185,2.776c0.721,1.331,2.266,2.119,3.496,3.025c1.436,1.056,2.751,2.692,4.612,3.038
		c1.646,0.308,3.908-0.334,5.479-0.754c3.659-0.979,7.115,1.255,9.277-1.861c1.864-2.685,8.371-7.828,9.789-10.731
		c0.579-1.186,0.304-3.834,0.635-5.09c0.373-1.417,0.649-2.62,1.331-4.01c0.731-1.49-1.363-4.439-1.312-6.221
		c0.041-1.427-2.875-2.064-3.158-3.436c-0.702-3.398-2.361-5.46-5.04-7.549c-1.043-0.813-3.106-1.046-4.411-0.535"/>
	<path fill="#113B4F" d="M367.294,285.766c0.186-2.66-0.562-4.025-2.52-5.589c-1.068-0.854-2.419-1.879-3.77-1.077
		c-1.589,0.943-1.14,2.91-1.816,4.195c-0.531,1.005-1.675,1.411-2.262,2.506c-0.601,1.12-1.012,2.679-0.846,3.972
		c0.258,1.977,2.508,2.964,2.508,5.023c0.001,1.308-1.309,3.421-2.504,3.96c-1.317,0.59-2.674-0.215-4.002-0.359
		c-2.135-0.233-4.324,1.591-5.941,2.988c-1.073,0.928-1.74,1.986-0.891,3.302c2.462,3.813,7.787,1.794,11.407,1.871
		c1.882,0.039,4.106,0.206,5.802-0.609c1.843-0.887,3.49-2.884,4.721-4.489c2.396-3.129,1.633-5.639,1.491-9.249
		c-0.064-1.632-0.071-2.642-0.817-4.229c-0.391-0.83-0.735-1.622-0.88-2.527"/>
	<g>
		<path fill="#FFB75E" d="M350.352,279.654c-0.909,0.267-1.768,1.102-2.088,1.951c0.534-0.902,1.338-1.646,2.237-2.182"/>
		<path fill="#113B4F" d="M348.077,281.891c-0.133-0.087-0.19-0.256-0.132-0.406c0.295-0.786,0.963-1.51,1.728-1.918
			c0.208-0.154,0.427-0.3,0.653-0.437c0.163-0.097,0.372-0.042,0.468,0.119c0.093,0.157,0.047,0.361-0.105,0.459
			c-0.021,0.126-0.111,0.234-0.241,0.272c-0.136,0.042-0.273,0.096-0.407,0.164c-0.617,0.468-1.122,1.023-1.482,1.634
			c-0.092,0.151-0.281,0.211-0.441,0.134C348.103,281.906,348.088,281.898,348.077,281.891z"/>
	</g>
	<g>
		<path fill="#FFB75E" d="M342.576,289.788c-0.841,0.832-1.405,1.887-1.451,3.088"/>
		<path fill="#113B4F" d="M340.939,293.162c-0.097-0.063-0.159-0.175-0.154-0.3c0.046-1.212,0.584-2.359,1.553-3.316
			c0.134-0.133,0.349-0.138,0.481,0.002c0.134,0.135,0.131,0.35-0.002,0.482c-0.845,0.834-1.312,1.822-1.351,2.858
			c-0.008,0.188-0.166,0.335-0.354,0.326C341.047,293.213,340.99,293.195,340.939,293.162z"/>
	</g>
</g>
</svg>
