<?xml version="1.0" encoding="utf-8"?>
<!-- Generator: Adobe Illustrator 15.1.0, SVG Export Plug-In . SVG Version: 6.00 Build 0)  -->
<!DOCTYPE svg PUBLIC "-//W3C//DTD SVG 1.1//EN" "http://www.w3.org/Graphics/SVG/1.1/DTD/svg11.dtd">
<svg version="1.1" id="Layer_1" xmlns="http://www.w3.org/2000/svg" xmlns:xlink="http://www.w3.org/1999/xlink" x="0px" y="0px"
	 width="716.585px" height="322.911px" viewBox="-33.5 412.089 716.585 322.911"
	 enable-background="new -33.5 412.089 716.585 322.911" xml:space="preserve">
<polygon fill="#54AFE2" points="642.032,735.283 683.085,735.283 683.085,490.498 642.032,535.891 "/>
<polygon fill="#FFB75E" points="642.027,694.127 600.859,733.683 600.859,733.987 642.027,733.987 "/>
<polygon fill="#54AFE2" points="526.085,734.686 598.079,675.155 584.79,675.155 576.931,675.155 553.353,675.155 540.068,675.155 
	532.208,675.155 460.235,734.686 "/>
<rect x="63.692" y="655.688" fill="#53AEE1" width="44.926" height="79.33"/>
<polygon fill="#0F4B60" points="438.861,418.867 482.967,466.166 538.263,472.024 579.657,433.442 "/>
<polygon fill="#54AFE2" points="-29.888,600.492 59.413,526.633 67.272,526.633 80.558,526.633 104.115,526.633 111.975,526.633 
	125.264,526.633 35.964,600.492 "/>
<polygon fill="#FFB75E" points="626.282,506.189 534.838,506.189 481.482,560.646 430.721,539.904 374.091,596.025 320.112,572.067 
	236.943,642.303 166.329,642.303 166.329,712.198 245.816,712.198 246.047,712.469 246.367,712.198 247.667,712.198 
	247.667,711.099 330.029,641.554 387.103,666.879 444.642,609.855 492.362,629.354 626.57,506.535 "/>
<polygon fill="#079D8E" points="522.475,703.673 601.468,638.355 608.417,638.355 620.165,638.355 640.997,638.355 647.95,638.355 
	659.702,638.355 580.732,703.673 "/>
<polygon fill="#0F4B60" points="521.541,487.619 356.56,641.364 385.168,672.044 523.523,543.026 "/>
<polygon fill="#089D8E" points="328.002,610.742 356.611,641.42 521.541,487.619 466.308,481.768 "/>
<polygon fill="#089D8E" points="579.657,433.442 538.263,472.024 540.25,527.596 584.378,574.895 "/>
<polygon fill="#FF4A3D" points="405.489,721.168 414.414,730.739 465.871,682.756 448.638,680.931 "/>
<polygon fill="#FF4A3D" points="484.846,665.061 471.938,677.098 472.557,694.435 486.319,709.191 "/>
<polygon fill="#FF4A3D" points="440.926,660.513 454.686,675.27 471.938,677.097 484.846,665.06 "/>
<polygon fill="#54AFE2" points="99.227,548.263 86.319,560.3 86.939,577.637 100.7,592.394 "/>
<polygon fill="#FFFFFF" points="55.306,543.716 69.067,558.473 86.319,560.3 99.227,548.263 "/>
<line fill="none" stroke="#DCEEF8" stroke-width="3.254" stroke-linecap="round" stroke-linejoin="round" stroke-dasharray="13.844,13.844" x1="438.971" y1="523.557" x2="308.763" y2="647.789"/>
<line fill="none" stroke="#FFB75E" stroke-width="3.254" stroke-linecap="round" stroke-linejoin="round" stroke-dasharray="12.782,12.782" x1="611.05" y1="545" x2="490.802" y2="659.699"/>
<line fill="none" stroke="#54AFE2" stroke-width="3.254" stroke-linecap="round" stroke-linejoin="round" stroke-dasharray="12.363,12.363" x1="583.657" y1="592.184" x2="503.107" y2="668.965"/>
<polygon fill="#0F4B60" points="411.089,661.281 384.006,686.199 356.304,662.045 326.025,690.122 292.297,661.617 291.908,662.078 
	291.908,705.529 326.78,735.005 356.81,707.157 384.448,731.255 411.089,706.76 "/>
<polygon fill="#FF4A3D" points="429.338,734.686 466.489,700.043 465.87,682.756 414.398,730.723 418.094,734.686 "/>
</svg>
