<?xml version="1.0" encoding="utf-8"?>
<!-- Generator: Adobe Illustrator 15.1.0, SVG Export Plug-In . SVG Version: 6.00 Build 0)  -->
<!DOCTYPE svg PUBLIC "-//W3C//DTD SVG 1.1//EN" "http://www.w3.org/Graphics/SVG/1.1/DTD/svg11.dtd">
<svg version="1.1" id="Layer_1" xmlns="http://www.w3.org/2000/svg" xmlns:xlink="http://www.w3.org/1999/xlink" x="0px" y="0px"
	 width="165.738px" height="159.042px" viewBox="0 0 165.738 159.042" enable-background="new 0 0 165.738 159.042"
	 xml:space="preserve">
<g>
	<path fill="#CCE7F7" d="M77.99,131.843c36.406,0,65.918-29.516,65.918-65.921C143.908,29.516,114.396,0,77.99,0
		C41.585,0,12.073,29.516,12.073,65.922C12.073,102.328,41.585,131.843,77.99,131.843"/>
</g>
<g>
	<rect x="53.704" y="50.123" fill="#FFFFFF" width="102.007" height="31.392"/>
	<g>
		<g>
			<path fill="#0F4A61" d="M92.918,28.576v18.479c0,0,0,2-2,2h-3.723c0,0-2,0-2-2V30.576c0,0,0-2,2-2H92.918z"/>
		</g>
		<rect x="87.127" y="28.585" fill="#0F4A61" width="34.201" height="3.857"/>
		<path fill="#0F4A61" d="M116.699,28.576v18.479c0,0,0,2,2,2h3.318c0,0,2,0,2-2V30.576c0,0,0-2-2-2H116.699z"/>
	</g>
	<rect x="53.704" y="75.076" fill="#113B4F" width="102.007" height="34.154"/>
	<polygon fill="#FFFFFF" points="103.922,87.642 117.82,74.838 107.931,74.838 103.82,78.651 99.449,74.838 89.41,74.838 	"/>
	<rect x="53.704" y="38.873" fill="#FF4A3D" width="102.007" height="31.392"/>
</g>
<g>
	
		<rect x="26.198" y="53.818" transform="matrix(0.9833 -0.1818 0.1818 0.9833 -15.7104 11.1672)" fill="#FFFFFF" width="53.75" height="74.962"/>
	<g>
		
			<rect x="43.35" y="84.456" transform="matrix(0.9833 -0.1819 0.1819 0.9833 -17.079 10.5215)" fill="#54B0E3" width="10.965" height="27.866"/>
		
			<rect x="55.016" y="92.635" transform="matrix(-0.9833 0.1818 -0.1818 -0.9833 138.4361 190.1948)" fill="#FFB85E" width="10.966" height="17.618"/>
	</g>
</g>
</svg>
