<?xml version="1.0" encoding="utf-8"?>
<!-- Generator: Adobe Illustrator 15.1.0, SVG Export Plug-In . SVG Version: 6.00 Build 0)  -->
<!DOCTYPE svg PUBLIC "-//W3C//DTD SVG 1.1//EN" "http://www.w3.org/Graphics/SVG/1.1/DTD/svg11.dtd">
<svg version="1.1" id="Layer_1" xmlns="http://www.w3.org/2000/svg" xmlns:xlink="http://www.w3.org/1999/xlink" x="0px" y="0px"
	 width="648px" height="200px" viewBox="0 0 648 200" enable-background="new 0 0 648 200"
	 xml:space="preserve">
<g transform="translate(6 0) scale(2 2)">
	<path fill="#0F4B60" d="M141.94,44.208l3.02-6.859l3.021,6.859H141.94z M150.22,49.308h2.1l-6.36-14h-1.979l-6.34,14h2.06
		l1.541-3.5h7.439L150.22,49.308z M126.7,39.988l0.1-2.94h6.141v10.521h-7.9c0.547-0.493,0.943-1.387,1.19-2.68
		S126.633,41.96,126.7,39.988 M134.92,47.568v-12.26h-9.84l-0.141,4.5c-0.08,2.439-0.3,4.33-0.66,5.67
		c-0.359,1.34-0.98,2.037-1.859,2.09h-0.68l-0.021,4.8h1.86l0.02-3.06h11.52v3.06h1.86v-4.8H134.92z M113.581,47.688
		c-1.027,0-1.957-0.233-2.791-0.7c-0.832-0.467-1.486-1.11-1.959-1.93c-0.474-0.82-0.711-1.737-0.711-2.75
		c0-1.014,0.237-1.931,0.711-2.75c0.473-0.82,1.127-1.463,1.959-1.931c0.834-0.467,1.764-0.699,2.791-0.699
		c1.026,0,1.949,0.232,2.77,0.699c0.82,0.468,1.467,1.11,1.939,1.931c0.474,0.819,0.711,1.736,0.711,2.75
		c0,1.013-0.237,1.93-0.711,2.75c-0.473,0.819-1.119,1.463-1.939,1.93S114.607,47.688,113.581,47.688 M113.581,49.468
		c1.399,0,2.666-0.311,3.799-0.931c1.134-0.62,2.021-1.473,2.66-2.56c0.641-1.087,0.961-2.311,0.961-3.67
		c0-1.36-0.32-2.583-0.961-3.67c-0.64-1.088-1.526-1.94-2.66-2.561c-1.133-0.62-2.399-0.93-3.799-0.93
		c-1.414,0-2.688,0.31-3.82,0.93s-2.023,1.478-2.67,2.57c-0.647,1.093-0.971,2.313-0.971,3.66c0,1.347,0.323,2.566,0.971,3.66
		c0.646,1.093,1.537,1.949,2.67,2.569S112.167,49.468,113.581,49.468 M106.86,35.308h-9.18v14h1.98L99.64,37.047h7.2L106.86,35.308z
		 M90.26,35.308H78.72v1.739h4.78v12.261h1.96V37.047h4.8V35.308z M76.64,49.308h2.28l-5.24-7.221l5-6.779h-2.14l-4.4,6.08h-2.96
		v-6.08h-1.96v14h1.96v-6.16h2.92L76.64,49.308z M56.121,47.568v-4.521h7.02v-1.699h-7.02v-4.301h7.88v-1.739h-9.88v14h10.16v-1.74
		H56.121z M43.661,47.688c-1.027,0-1.957-0.233-2.79-0.7c-0.834-0.467-1.487-1.11-1.96-1.93c-0.474-0.82-0.71-1.737-0.71-2.75
		c0-1.014,0.236-1.931,0.71-2.75c0.473-0.82,1.126-1.463,1.96-1.931c0.833-0.467,1.763-0.699,2.79-0.699
		c1.026,0,1.95,0.232,2.77,0.699c0.82,0.468,1.466,1.11,1.94,1.931c0.473,0.819,0.71,1.736,0.71,2.75c0,1.013-0.237,1.93-0.71,2.75
		c-0.474,0.819-1.12,1.463-1.94,1.93C45.611,47.455,44.687,47.688,43.661,47.688 M43.661,49.468c1.4,0,2.666-0.311,3.8-0.931
		c1.133-0.62,2.02-1.473,2.66-2.56s0.96-2.311,0.96-3.67c0-1.36-0.32-2.583-0.96-3.67c-0.64-1.088-1.527-1.94-2.66-2.561
		c-1.134-0.62-2.4-0.93-3.8-0.93c-1.414,0-2.687,0.31-3.82,0.93c-1.134,0.62-2.024,1.478-2.67,2.57
		c-0.647,1.093-0.97,2.313-0.97,3.66c0,1.347,0.323,2.566,0.97,3.66c0.646,1.093,1.536,1.949,2.67,2.569
		C40.974,49.158,42.247,49.468,43.661,49.468 M28.681,43.328h-3.4v-6.28h3.4c1.267,0,2.233,0.271,2.9,0.811s1,1.316,1,2.33
		c0,1.013-0.333,1.79-1,2.33S29.948,43.328,28.681,43.328 M28.741,35.308h-5.46v14h2v-4.24h3.46c1.813,0,3.24-0.433,4.28-1.3
		s1.56-2.061,1.56-3.58c0-1.521-0.52-2.713-1.56-3.58S30.554,35.308,28.741,35.308 M7.061,35.308v14h1.98V37.047h8.12v12.261h1.96
		v-14H7.061z"/>
	<path fill="#0F4B60" d="M159.161,7.328c1.08,0,1.916-0.24,2.51-0.72c0.593-0.48,0.896-1.153,0.91-2.021h-1.4
		c-0.014,0.521-0.203,0.924-0.57,1.21c-0.367,0.287-0.85,0.431-1.449,0.431c-0.627,0-1.117-0.144-1.471-0.431
		c-0.354-0.286-0.537-0.689-0.55-1.21h-1.42c0.013,0.881,0.317,1.558,0.909,2.03C157.223,7.09,158.067,7.328,159.161,7.328
		 M153.14,22.308h1.84l8.3-10.78v10.78h1.961v-14H163.4l-8.28,10.8v-10.8h-1.979V22.308z M147,22.308h1.979v-14H147V22.308z
		 M139.18,20.728h-3.721v-5.96h3.721c2.4,0,3.6,0.96,3.6,2.88c0,1-0.31,1.763-0.93,2.29C141.23,20.464,140.34,20.728,139.18,20.728
		 M139.62,13.188h-4.16v-4.88h-1.979v14h5.78c1.773,0,3.137-0.4,4.09-1.2s1.43-1.967,1.43-3.5c0-1.453-0.443-2.553-1.33-3.3
		S141.288,13.188,139.62,13.188 M127.32,8.308v6.02h-8.04v-6.02h-2v14h2v-6.24h8.04v6.24h2v-14H127.32z M104.84,20.728v-5.141h3.941
		c2.346,0,3.52,0.848,3.52,2.54c0,0.854-0.301,1.5-0.9,1.94c-0.6,0.439-1.474,0.66-2.619,0.66H104.84z M102.861,22.308h6
		c1.746,0,3.091-0.367,4.03-1.101c0.939-0.732,1.41-1.787,1.41-3.16c0-1.307-0.434-2.307-1.301-3
		c-0.867-0.692-2.133-1.04-3.799-1.04h-4.361v-4h8.58V8.308h-10.56V22.308z M90.261,17.208l3.021-6.859l3.02,6.859H90.261z
		 M98.542,22.308h2.1l-6.359-14h-1.98l-6.34,14h2.06l1.54-3.5H97L98.542,22.308z M86.36,8.308H74.82v1.739h4.78v12.261h1.96V10.047
		h4.8V8.308z M70.621,8.308v12.26h-5.82V8.308h-1.96v12.26h-5.82V8.308h-1.98v14h17.54v-14H70.621z M47.141,22.468
		c1.093,0,2.097-0.188,3.01-0.561s1.69-0.92,2.33-1.64l-1.3-1.261c-1.067,1.12-2.38,1.681-3.94,1.681c-1.04,0-1.98-0.233-2.82-0.7
		c-0.84-0.467-1.497-1.11-1.97-1.93c-0.473-0.82-0.71-1.737-0.71-2.75c0-1.014,0.237-1.931,0.71-2.75
		c0.473-0.82,1.13-1.463,1.97-1.931c0.84-0.467,1.78-0.699,2.82-0.699c1.573,0,2.887,0.553,3.94,1.659l1.3-1.26
		c-0.64-0.72-1.413-1.263-2.32-1.63c-0.907-0.367-1.907-0.55-3-0.55c-1.4,0-2.667,0.31-3.8,0.93c-1.133,0.62-2.02,1.473-2.66,2.561
		c-0.64,1.087-0.96,2.31-0.96,3.67c0,1.359,0.32,2.583,0.96,3.67c0.64,1.087,1.523,1.939,2.65,2.56S45.741,22.468,47.141,22.468
		 M28.481,17.208l3.02-6.859l3.02,6.859H28.481z M36.761,22.308h2.1l-6.36-14h-1.98l-6.34,14h2.06l1.54-3.5h7.44L36.761,22.308z
		 M21.961,22.308l-0.02-14h-1.64l-5.76,9.84l-5.84-9.84h-1.64v14h1.92V12.167l5.06,8.44h0.92l5.06-8.5l0.02,10.2H21.961z"/>
</g>
<g transform="translate(20 100) scale(2 2)">
<path fill="#0F4B60" d="M72.026,38.413h0.792l2.916-3.474v3.474h0.864v-4.77h-0.783l-2.925,3.474v-3.474h-0.864V38.413z
		 M65.78,38.413h0.792l2.916-3.474v3.474h0.864v-4.77h-0.783l-2.925,3.474v-3.474H65.78V38.413z M63.908,37.657v-4.014h-0.864v4.014
		h-2.61v-4.014H59.57v4.77h4.275v1.144h0.819v-1.899H63.908z M55.773,37.802c-0.331,0-0.589-0.069-0.774-0.207
		c-0.187-0.139-0.279-0.327-0.279-0.567c0-0.492,0.365-0.738,1.098-0.738h1.332v0.666c-0.108,0.271-0.283,0.479-0.522,0.626
		C56.387,37.729,56.102,37.802,55.773,37.802 M55.971,33.599c-0.385,0-0.747,0.053-1.089,0.157C54.54,33.861,54.245,34.013,54,34.21
		l0.36,0.648c0.185-0.156,0.414-0.28,0.684-0.373s0.545-0.14,0.828-0.14c0.419,0,0.738,0.099,0.954,0.297
		c0.216,0.197,0.324,0.482,0.324,0.854v0.171h-1.368c-0.666,0-1.152,0.128-1.458,0.384c-0.306,0.255-0.459,0.592-0.459,1.012
		s0.16,0.759,0.481,1.017c0.321,0.258,0.748,0.387,1.283,0.387c0.365,0,0.682-0.058,0.949-0.176
		c0.267-0.116,0.473-0.286,0.617-0.508v0.63h0.819v-2.88c0-0.642-0.176-1.125-0.527-1.449C57.136,33.761,56.63,33.599,55.971,33.599
		 M51.777,33.644l-1.926,3.222l-1.872-3.222h-0.891v4.77h0.792v-3.492l1.764,2.952h0.378l1.782-2.942v3.482h0.783v-4.77H51.777z
		 M43.353,37.711c-0.3,0-0.573-0.069-0.819-0.211c-0.246-0.141-0.438-0.339-0.576-0.595c-0.138-0.254-0.207-0.547-0.207-0.877
		s0.07-0.621,0.211-0.873s0.333-0.448,0.576-0.589c0.243-0.142,0.515-0.212,0.815-0.212c0.306,0,0.58,0.068,0.823,0.207
		c0.243,0.138,0.435,0.335,0.576,0.59s0.212,0.547,0.212,0.877s-0.071,0.623-0.212,0.877c-0.141,0.256-0.333,0.454-0.576,0.595
		C43.933,37.642,43.659,37.711,43.353,37.711 M43.425,33.599c-0.354,0-0.678,0.067-0.972,0.203
		c-0.294,0.134-0.537,0.334-0.729,0.598v-0.756h-0.828v6.516h0.864v-2.466c0.198,0.252,0.439,0.444,0.724,0.576
		c0.285,0.132,0.599,0.197,0.941,0.197c0.462,0,0.876-0.102,1.242-0.306s0.652-0.491,0.859-0.858
		c0.207-0.369,0.311-0.795,0.311-1.274c0-0.48-0.104-0.903-0.311-1.269c-0.207-0.366-0.493-0.651-0.859-0.855
		S43.887,33.599,43.425,33.599 M37.17,37.711c-0.306,0-0.581-0.069-0.824-0.211c-0.243-0.141-0.435-0.339-0.576-0.595
		c-0.141-0.254-0.211-0.547-0.211-0.877s0.07-0.622,0.211-0.877s0.333-0.452,0.576-0.59c0.243-0.139,0.518-0.207,0.824-0.207
		s0.58,0.068,0.823,0.207c0.243,0.138,0.434,0.335,0.572,0.59s0.207,0.547,0.207,0.877s-0.069,0.623-0.207,0.877
		c-0.138,0.256-0.329,0.454-0.572,0.595C37.75,37.642,37.476,37.711,37.17,37.711 M37.17,38.467c0.474,0,0.898-0.104,1.273-0.314
		s0.669-0.499,0.882-0.868c0.213-0.37,0.32-0.788,0.32-1.256s-0.107-0.886-0.32-1.255c-0.213-0.37-0.507-0.657-0.882-0.864
		s-0.799-0.311-1.273-0.311s-0.9,0.104-1.278,0.311s-0.674,0.494-0.887,0.864c-0.213,0.369-0.319,0.787-0.319,1.255
		s0.106,0.886,0.319,1.256c0.213,0.369,0.509,0.658,0.887,0.868S36.696,38.467,37.17,38.467 M31.086,37.721v-3.357
		c0.648,0.042,1.137,0.203,1.467,0.482c0.33,0.277,0.495,0.67,0.495,1.174C33.048,37.052,32.394,37.618,31.086,37.721 M28.287,36.02
		c0-0.498,0.162-0.889,0.486-1.17c0.324-0.282,0.813-0.444,1.467-0.486v3.348c-0.648-0.042-1.136-0.207-1.463-0.495
		C28.45,36.929,28.287,36.529,28.287,36.02 M33.903,36.02c0-0.732-0.246-1.307-0.738-1.725c-0.492-0.416-1.185-0.648-2.079-0.696
		v-1.863H30.24v1.863c-0.9,0.048-1.593,0.278-2.079,0.692c-0.486,0.414-0.729,0.99-0.729,1.729c0,0.744,0.244,1.328,0.733,1.75
		c0.489,0.423,1.181,0.659,2.075,0.707v1.683h0.846v-1.683c0.894-0.048,1.587-0.285,2.079-0.711
		C33.657,37.339,33.903,36.757,33.903,36.02 M24.894,38.467c0.432,0,0.817-0.088,1.156-0.265c0.339-0.177,0.602-0.431,0.788-0.761
		l-0.657-0.414c-0.15,0.228-0.336,0.399-0.558,0.513c-0.222,0.114-0.468,0.171-0.738,0.171c-0.312,0-0.593-0.068-0.842-0.207
		c-0.249-0.138-0.444-0.334-0.585-0.59c-0.141-0.254-0.211-0.55-0.211-0.886c0-0.33,0.07-0.622,0.211-0.877s0.336-0.452,0.585-0.59
		c0.249-0.139,0.53-0.207,0.842-0.207c0.27,0,0.516,0.057,0.738,0.171s0.408,0.285,0.558,0.513l0.657-0.423
		c-0.186-0.33-0.449-0.582-0.788-0.756c-0.339-0.174-0.724-0.261-1.156-0.261c-0.486,0-0.92,0.104-1.301,0.311
		c-0.381,0.207-0.679,0.494-0.895,0.864c-0.216,0.369-0.324,0.787-0.324,1.255s0.108,0.886,0.324,1.256
		c0.216,0.369,0.514,0.658,0.895,0.868C23.974,38.362,24.408,38.467,24.894,38.467 M16.686,38.413h0.864v-1.998h2.718v1.998h0.864
		v-4.77h-0.864v2.024H17.55v-2.024h-0.864V38.413z M12.888,37.802c-0.33,0-0.588-0.069-0.774-0.207
		c-0.186-0.139-0.279-0.327-0.279-0.567c0-0.492,0.366-0.738,1.098-0.738h1.332v0.666c-0.108,0.271-0.282,0.479-0.522,0.626
		C13.503,37.729,13.218,37.802,12.888,37.802 M13.086,33.599c-0.384,0-0.747,0.053-1.089,0.157
		c-0.342,0.105-0.636,0.257-0.882,0.454l0.36,0.648c0.186-0.156,0.414-0.28,0.684-0.373s0.546-0.14,0.828-0.14
		c0.42,0,0.738,0.099,0.954,0.297c0.216,0.197,0.324,0.482,0.324,0.854v0.171h-1.368c-0.666,0-1.152,0.128-1.458,0.384
		c-0.306,0.255-0.459,0.592-0.459,1.012s0.16,0.759,0.481,1.017c0.321,0.258,0.749,0.387,1.283,0.387
		c0.366,0,0.682-0.058,0.949-0.176c0.267-0.116,0.473-0.286,0.617-0.508v0.63h0.819v-2.88c0-0.642-0.176-1.125-0.527-1.449
		C14.251,33.761,13.746,33.599,13.086,33.599 M7.695,37.711c-0.3,0-0.573-0.069-0.819-0.211C6.63,37.359,6.438,37.161,6.3,36.905
		c-0.138-0.254-0.207-0.547-0.207-0.877s0.07-0.621,0.211-0.873c0.141-0.252,0.333-0.448,0.576-0.589
		c0.243-0.142,0.515-0.212,0.815-0.212c0.306,0,0.58,0.068,0.823,0.207c0.243,0.138,0.435,0.335,0.576,0.59
		c0.141,0.255,0.212,0.547,0.212,0.877s-0.071,0.623-0.212,0.877c-0.141,0.256-0.333,0.454-0.576,0.595
		C8.275,37.642,8.001,37.711,7.695,37.711 M7.767,33.599c-0.354,0-0.678,0.067-0.972,0.203c-0.294,0.134-0.537,0.334-0.729,0.598
		v-0.756H5.238v6.516h0.864v-2.466c0.198,0.252,0.439,0.444,0.724,0.576c0.285,0.132,0.599,0.197,0.941,0.197
		c0.462,0,0.876-0.102,1.242-0.306c0.366-0.204,0.652-0.491,0.859-0.858c0.207-0.369,0.311-0.795,0.311-1.274
		c0-0.48-0.104-0.903-0.311-1.269c-0.207-0.366-0.493-0.651-0.859-0.855C8.643,33.7,8.229,33.599,7.767,33.599 M4.356,33.644H0
		v0.756h1.746v4.014H2.61v-4.014h1.746V33.644z"/>
<path fill="#0F4B60" d="M82.97,20.022c0.438,0,0.783-0.106,1.035-0.319s0.381-0.521,0.387-0.923h-0.603
		c-0.006,0.222-0.084,0.401-0.234,0.536c-0.15,0.135-0.348,0.202-0.594,0.202s-0.442-0.067-0.589-0.202
		c-0.148-0.135-0.224-0.314-0.23-0.536h-0.585c0.006,0.402,0.132,0.71,0.378,0.923S82.526,20.022,82.97,20.022 M80.738,25.413h0.792
		l2.916-3.474v3.474h0.864v-4.77h-0.783l-2.925,3.474v-3.474h-0.864V25.413z M77.012,24.711c-0.306,0-0.58-0.069-0.823-0.211
		c-0.243-0.141-0.435-0.339-0.576-0.595c-0.141-0.254-0.212-0.547-0.212-0.877s0.071-0.622,0.212-0.877
		c0.141-0.255,0.333-0.452,0.576-0.59c0.243-0.139,0.517-0.207,0.823-0.207c0.306,0,0.581,0.068,0.824,0.207
		c0.243,0.138,0.433,0.335,0.571,0.59c0.138,0.255,0.207,0.547,0.207,0.877s-0.069,0.623-0.207,0.877
		c-0.138,0.256-0.328,0.454-0.571,0.595C77.593,24.642,77.318,24.711,77.012,24.711 M77.012,25.467c0.474,0,0.899-0.104,1.274-0.314
		s0.669-0.499,0.882-0.868s0.319-0.788,0.319-1.256s-0.106-0.886-0.319-1.255c-0.213-0.37-0.507-0.657-0.882-0.864
		s-0.8-0.311-1.274-0.311c-0.474,0-0.9,0.104-1.278,0.311s-0.673,0.494-0.886,0.864c-0.213,0.369-0.32,0.787-0.32,1.255
		s0.107,0.887,0.32,1.256c0.213,0.369,0.508,0.658,0.886,0.868S76.538,25.467,77.012,25.467 M71.675,24.747h-1.386v-1.431h1.44
		c0.354,0,0.614,0.06,0.779,0.18s0.247,0.303,0.247,0.549c0,0.24-0.09,0.417-0.27,0.531C72.305,24.69,72.035,24.747,71.675,24.747
		 M70.289,21.31h1.296c0.672,0,1.008,0.228,1.008,0.684c0,0.229-0.085,0.402-0.256,0.522s-0.422,0.18-0.752,0.18h-1.296V21.31z
		 M72.692,22.938c0.24-0.097,0.428-0.235,0.563-0.418c0.135-0.184,0.202-0.401,0.202-0.653c0-0.39-0.159-0.69-0.477-0.904
		c-0.318-0.213-0.759-0.319-1.323-0.319h-2.214v4.77h2.295c0.624,0,1.094-0.114,1.409-0.342s0.472-0.552,0.472-0.972
		C73.619,23.481,73.31,23.095,72.692,22.938 M65.717,24.711c-0.306,0-0.58-0.069-0.823-0.211c-0.243-0.141-0.435-0.339-0.576-0.595
		c-0.141-0.254-0.212-0.547-0.212-0.877s0.071-0.622,0.212-0.877s0.333-0.452,0.576-0.59c0.243-0.139,0.517-0.207,0.823-0.207
		c0.306,0,0.581,0.068,0.824,0.207c0.243,0.138,0.433,0.335,0.571,0.59c0.138,0.255,0.207,0.547,0.207,0.877
		s-0.069,0.623-0.207,0.877c-0.138,0.256-0.328,0.454-0.571,0.595C66.298,24.642,66.023,24.711,65.717,24.711 M65.717,25.467
		c0.474,0,0.899-0.104,1.274-0.314s0.669-0.499,0.882-0.868s0.319-0.788,0.319-1.256s-0.106-0.886-0.319-1.255
		c-0.213-0.37-0.507-0.657-0.882-0.864s-0.8-0.311-1.274-0.311c-0.474,0-0.9,0.104-1.278,0.311s-0.673,0.494-0.886,0.864
		c-0.213,0.369-0.32,0.787-0.32,1.255s0.107,0.887,0.32,1.256c0.213,0.369,0.508,0.658,0.886,0.868S65.243,25.467,65.717,25.467
		 M59.939,24.711c-0.3,0-0.573-0.069-0.819-0.211c-0.246-0.141-0.438-0.339-0.576-0.595c-0.138-0.254-0.207-0.547-0.207-0.877
		s0.071-0.621,0.212-0.873c0.141-0.252,0.333-0.448,0.576-0.589c0.243-0.142,0.514-0.212,0.814-0.212
		c0.306,0,0.581,0.068,0.824,0.207c0.243,0.138,0.435,0.335,0.576,0.59c0.141,0.255,0.211,0.547,0.211,0.877
		s-0.07,0.623-0.211,0.877c-0.141,0.256-0.333,0.454-0.576,0.595C60.52,24.642,60.245,24.711,59.939,24.711 M60.011,20.599
		c-0.354,0-0.678,0.067-0.972,0.203c-0.294,0.134-0.537,0.334-0.729,0.598v-0.756h-0.828v6.516h0.864v-2.466
		c0.198,0.252,0.44,0.444,0.725,0.576c0.285,0.132,0.598,0.197,0.94,0.197c0.462,0,0.876-0.102,1.242-0.306
		c0.366-0.204,0.653-0.491,0.86-0.858c0.207-0.369,0.31-0.795,0.31-1.274c0-0.48-0.103-0.903-0.31-1.269
		c-0.207-0.366-0.494-0.651-0.86-0.855C60.887,20.7,60.473,20.599,60.011,20.599 M53.441,24.721v-3.357
		c0.648,0.042,1.137,0.203,1.467,0.482c0.33,0.278,0.495,0.67,0.495,1.174C55.403,24.052,54.749,24.618,53.441,24.721 M50.642,23.02
		c0-0.498,0.162-0.889,0.486-1.17c0.324-0.282,0.813-0.444,1.467-0.486v3.348c-0.648-0.042-1.135-0.207-1.462-0.495
		C50.806,23.929,50.642,23.529,50.642,23.02 M56.258,23.02c0-0.732-0.246-1.307-0.738-1.725c-0.492-0.416-1.185-0.648-2.079-0.696
		v-1.863h-0.846v1.863c-0.9,0.048-1.593,0.278-2.079,0.692c-0.486,0.414-0.729,0.99-0.729,1.729c0,0.744,0.245,1.328,0.734,1.751
		s1.18,0.658,2.074,0.706v1.683h0.846v-1.683c0.894-0.048,1.587-0.285,2.079-0.711C56.012,24.339,56.258,23.757,56.258,23.02
		 M43.992,25.413h0.792l2.916-3.474v3.474h0.864v-4.77h-0.783l-2.925,3.474v-3.474h-0.864V25.413z M42.12,24.657v-4.014h-0.864
		v4.014h-2.61v-4.014h-0.864v4.77h4.275v1.144h0.819v-1.899H42.12z M33.633,20.644l-1.647,3.815l-1.665-3.815h-0.9l2.106,4.761
		l-0.153,0.333c-0.114,0.27-0.242,0.46-0.383,0.571c-0.141,0.11-0.316,0.167-0.526,0.167c-0.324,0-0.609-0.117-0.855-0.352
		l-0.369,0.648c0.144,0.144,0.325,0.253,0.544,0.329c0.219,0.073,0.446,0.111,0.68,0.111c0.384,0,0.712-0.099,0.985-0.297
		c0.273-0.197,0.512-0.54,0.716-1.025l2.313-5.247H33.633z M29.583,25.413l-1.899-2.438l1.8-2.331h-0.945l-1.305,1.719l-1.314-1.719
		h-0.963l1.791,2.331l-1.881,2.438h0.963l1.395-1.827l1.377,1.827H29.583z M22.059,24.711c-0.306,0-0.581-0.069-0.824-0.211
		c-0.243-0.141-0.435-0.339-0.576-0.595c-0.141-0.254-0.211-0.547-0.211-0.877s0.07-0.622,0.211-0.877
		c0.141-0.255,0.333-0.452,0.576-0.59c0.243-0.139,0.518-0.207,0.824-0.207s0.58,0.068,0.823,0.207
		c0.243,0.138,0.434,0.335,0.572,0.59c0.138,0.255,0.207,0.547,0.207,0.877s-0.069,0.623-0.207,0.877
		c-0.138,0.256-0.329,0.454-0.572,0.595C22.639,24.642,22.365,24.711,22.059,24.711 M22.059,25.467c0.474,0,0.898-0.104,1.273-0.314
		s0.669-0.499,0.882-0.868s0.32-0.788,0.32-1.256s-0.107-0.886-0.32-1.255c-0.213-0.37-0.507-0.657-0.882-0.864
		s-0.799-0.311-1.273-0.311s-0.9,0.104-1.278,0.311c-0.378,0.207-0.674,0.494-0.887,0.864c-0.213,0.369-0.319,0.787-0.319,1.255
		s0.106,0.887,0.319,1.256s0.509,0.658,0.887,0.868C21.159,25.362,21.585,25.467,22.059,25.467 M13.923,20.644v4.77h0.864v-4.014
		h2.691v4.014h0.864v-4.77H13.923z M10.125,20.589c-0.414,0-0.792,0.066-1.134,0.198c-0.342,0.132-0.63,0.327-0.864,0.585
		l0.504,0.495c0.39-0.384,0.876-0.576,1.458-0.576c0.456,0,0.846,0.128,1.17,0.383c0.324,0.256,0.525,0.59,0.603,1.004H9.486v0.639
		h2.394c-0.066,0.432-0.264,0.782-0.594,1.048c-0.33,0.268-0.729,0.401-1.197,0.401c-0.588,0-1.074-0.189-1.458-0.567l-0.504,0.504
		c0.234,0.252,0.52,0.444,0.859,0.576c0.339,0.132,0.719,0.198,1.139,0.198c0.486,0,0.925-0.105,1.318-0.315
		s0.701-0.501,0.923-0.873c0.222-0.372,0.333-0.792,0.333-1.26c0-0.462-0.111-0.879-0.333-1.251
		c-0.222-0.372-0.53-0.663-0.923-0.873S10.611,20.589,10.125,20.589 M3.033,24.747H1.647v-1.431h1.44c0.354,0,0.613,0.06,0.779,0.18
		c0.164,0.12,0.247,0.303,0.247,0.549c0,0.24-0.09,0.417-0.27,0.531C3.663,24.69,3.393,24.747,3.033,24.747 M1.647,21.31h1.296
		c0.672,0,1.008,0.228,1.008,0.684c0,0.229-0.085,0.402-0.256,0.522c-0.172,0.12-0.422,0.18-0.752,0.18H1.647V21.31z M4.05,22.938
		c0.24-0.097,0.428-0.235,0.563-0.418c0.134-0.184,0.202-0.401,0.202-0.653c0-0.39-0.159-0.69-0.477-0.904
		c-0.318-0.213-0.759-0.319-1.323-0.319H0.801v4.77h2.295c0.624,0,1.093-0.114,1.408-0.342C4.82,24.844,4.977,24.52,4.977,24.1
		C4.977,23.481,4.668,23.095,4.05,22.938"/>
<path fill="#0F4B60" d="M114.173,12.413h0.792l2.916-3.474v3.474h0.864v-4.77h-0.783l-2.925,3.474V7.644h-0.864V12.413z
		 M107.927,12.413h0.792l2.916-3.474v3.474h0.864v-4.77h-0.783l-2.925,3.474V7.644h-0.864V12.413z M106.055,11.657V7.644h-0.864
		v4.014h-2.61V7.644h-0.864v4.77h4.275v1.144h0.819v-1.899H106.055z M95.588,12.413h0.864v-1.998h2.718v1.998h0.864v-4.77H99.17
		v2.024h-2.718V7.644h-0.864V12.413z M91.889,8.327c0.414,0,0.761,0.128,1.04,0.382c0.279,0.256,0.442,0.584,0.49,0.986h-3.06
		c0.048-0.408,0.212-0.738,0.491-0.99C91.129,8.453,91.475,8.327,91.889,8.327 M94.247,10.056c0-0.48-0.1-0.906-0.301-1.278
		c-0.201-0.372-0.48-0.662-0.837-0.869s-0.764-0.31-1.22-0.31s-0.865,0.103-1.228,0.31c-0.363,0.207-0.648,0.497-0.855,0.869
		s-0.311,0.789-0.311,1.251c0,0.468,0.107,0.888,0.32,1.26s0.514,0.661,0.904,0.868c0.39,0.207,0.837,0.311,1.341,0.311
		c0.396,0,0.755-0.065,1.076-0.197c0.321-0.132,0.589-0.324,0.805-0.576l-0.477-0.558c-0.348,0.384-0.807,0.575-1.377,0.575
		c-0.468,0-0.859-0.127-1.174-0.383c-0.315-0.254-0.5-0.592-0.554-1.012h3.87C94.241,10.208,94.247,10.121,94.247,10.056
		 M86.201,11.711c-0.3,0-0.573-0.069-0.819-0.211c-0.246-0.141-0.438-0.339-0.576-0.595c-0.138-0.254-0.207-0.547-0.207-0.877
		s0.071-0.621,0.212-0.873s0.333-0.448,0.576-0.59c0.243-0.141,0.514-0.211,0.814-0.211c0.306,0,0.581,0.068,0.824,0.207
		c0.243,0.138,0.435,0.335,0.576,0.59s0.211,0.547,0.211,0.877s-0.07,0.623-0.211,0.877c-0.141,0.256-0.333,0.454-0.576,0.595
		C86.782,11.642,86.507,11.711,86.201,11.711 M86.273,7.599c-0.354,0-0.678,0.067-0.972,0.201c-0.294,0.136-0.537,0.336-0.729,0.6
		V7.644h-0.828v6.516h0.864v-2.466c0.198,0.252,0.44,0.444,0.725,0.576s0.598,0.197,0.94,0.197c0.462,0,0.876-0.102,1.242-0.306
		c0.366-0.204,0.653-0.491,0.86-0.858c0.207-0.37,0.31-0.795,0.31-1.274c0-0.48-0.103-0.903-0.31-1.269
		c-0.207-0.366-0.494-0.651-0.86-0.855C87.149,7.7,86.735,7.599,86.273,7.599 M82.016,7.644l-1.647,3.815l-1.665-3.815h-0.9
		l2.106,4.761l-0.153,0.333c-0.114,0.27-0.241,0.46-0.382,0.571c-0.141,0.11-0.317,0.167-0.527,0.167
		c-0.324,0-0.609-0.117-0.855-0.352l-0.369,0.648c0.144,0.144,0.326,0.253,0.545,0.328c0.219,0.074,0.445,0.112,0.679,0.112
		c0.384,0,0.713-0.099,0.986-0.297c0.273-0.197,0.511-0.54,0.715-1.025l2.313-5.247H82.016z M76.949,12.413h1.017l-1.935-2.475
		l1.809-2.295h-0.927l-1.548,2.016h-1.008V7.644h-0.864v4.77h0.864v-2.016h0.99L76.949,12.413z M67.364,12.413h0.864v-1.998h2.718
		v1.998h0.864v-4.77h-0.864v2.024h-2.718V7.644h-0.864V12.413z M63.638,11.711c-0.306,0-0.58-0.069-0.823-0.211
		c-0.243-0.141-0.435-0.339-0.576-0.595c-0.141-0.254-0.212-0.547-0.212-0.877s0.071-0.622,0.212-0.877
		c0.141-0.255,0.333-0.452,0.576-0.59c0.243-0.139,0.517-0.207,0.823-0.207c0.306,0,0.581,0.068,0.824,0.207
		c0.243,0.138,0.433,0.335,0.571,0.59c0.138,0.255,0.207,0.547,0.207,0.877s-0.069,0.623-0.207,0.877
		c-0.138,0.256-0.328,0.454-0.571,0.595C64.219,11.642,63.944,11.711,63.638,11.711 M63.638,12.467c0.474,0,0.899-0.104,1.274-0.314
		s0.669-0.499,0.882-0.869c0.213-0.369,0.319-0.787,0.319-1.255s-0.106-0.887-0.319-1.256s-0.507-0.657-0.882-0.864
		s-0.8-0.31-1.274-0.31c-0.474,0-0.9,0.103-1.278,0.31s-0.673,0.495-0.886,0.864s-0.32,0.788-0.32,1.256s0.107,0.886,0.32,1.255
		c0.213,0.37,0.508,0.659,0.886,0.869S63.164,12.467,63.638,12.467 M59.831,12.413h1.017l-1.935-2.475l1.809-2.295h-0.927
		l-1.548,2.016h-1.008V7.644h-0.864v4.77h0.864v-2.016h0.99L59.831,12.413z M47.709,12.413H48.5l2.916-3.474v3.474h0.864v-4.77
		h-0.782l-2.925,3.474V7.644h-0.864V12.413z M41.463,12.413h0.792l2.916-3.474v3.474h0.864v-4.77h-0.783l-2.925,3.474V7.644h-0.864
		V12.413z M40.581,7.644h-4.356v0.756h1.746v4.014h0.864V8.399h1.746V7.644z M30.78,12.413h0.792l2.916-3.474v3.474h0.864v-4.77
		h-0.783l-2.925,3.474V7.644H30.78V12.413z M27.486,11.747H26.1v-1.431h1.44c0.354,0,0.613,0.06,0.778,0.18s0.248,0.303,0.248,0.549
		c0,0.24-0.09,0.417-0.27,0.531C28.116,11.69,27.846,11.747,27.486,11.747 M26.1,8.31h1.296c0.672,0,1.008,0.228,1.008,0.684
		c0,0.229-0.086,0.402-0.257,0.522s-0.421,0.18-0.751,0.18H26.1V8.31z M28.503,9.938c0.24-0.097,0.427-0.235,0.562-0.418
		c0.135-0.184,0.203-0.401,0.203-0.653c0-0.39-0.159-0.69-0.477-0.905c-0.318-0.212-0.759-0.318-1.323-0.318h-2.214v4.77h2.295
		c0.624,0,1.093-0.114,1.408-0.342S29.43,11.52,29.43,11.1C29.43,10.481,29.121,10.095,28.503,9.938 M22.941,9.93
		c0.264-0.097,0.474-0.237,0.63-0.424c0.156-0.186,0.234-0.396,0.234-0.63c0-0.252-0.087-0.477-0.261-0.675s-0.414-0.351-0.72-0.459
		c-0.306-0.107-0.651-0.162-1.035-0.162c-0.636,0-1.245,0.147-1.827,0.441l0.234,0.666c0.528-0.246,1.029-0.369,1.503-0.369
		c0.372,0,0.667,0.06,0.886,0.18c0.219,0.12,0.329,0.288,0.329,0.504c0,0.198-0.093,0.354-0.279,0.469
		c-0.186,0.113-0.441,0.171-0.765,0.171h-0.81v0.621h0.873c0.354,0,0.628,0.06,0.823,0.18c0.195,0.12,0.293,0.291,0.293,0.513
		c0,0.24-0.122,0.432-0.365,0.571c-0.243,0.142-0.568,0.212-0.976,0.212c-0.3,0-0.597-0.041-0.891-0.122s-0.555-0.193-0.783-0.337
		l-0.261,0.657c0.264,0.174,0.565,0.308,0.904,0.399c0.339,0.094,0.686,0.141,1.04,0.141c0.42,0,0.799-0.063,1.138-0.186
		c0.339-0.122,0.605-0.293,0.797-0.513c0.192-0.218,0.288-0.469,0.288-0.751c0-0.276-0.087-0.507-0.261-0.693
		C23.505,10.148,23.259,10.014,22.941,9.93 M16.641,11.802c-0.33,0-0.588-0.069-0.774-0.207c-0.186-0.139-0.279-0.327-0.279-0.567
		c0-0.492,0.366-0.738,1.098-0.738h1.332v0.666c-0.108,0.271-0.282,0.479-0.522,0.625C17.256,11.729,16.971,11.802,16.641,11.802
		 M16.839,7.599c-0.384,0-0.747,0.053-1.089,0.156c-0.342,0.106-0.636,0.258-0.882,0.455l0.36,0.648
		c0.186-0.156,0.414-0.28,0.684-0.373s0.546-0.14,0.828-0.14c0.42,0,0.738,0.099,0.954,0.297c0.216,0.197,0.324,0.482,0.324,0.854
		v0.171H16.65c-0.666,0-1.152,0.128-1.458,0.382c-0.306,0.257-0.459,0.594-0.459,1.014s0.16,0.759,0.481,1.017
		c0.321,0.258,0.749,0.387,1.283,0.387c0.366,0,0.682-0.059,0.949-0.176c0.267-0.116,0.473-0.286,0.617-0.508v0.63h0.819v-2.88
		c0-0.642-0.176-1.125-0.527-1.449C18.004,7.761,17.499,7.599,16.839,7.599 M11.448,11.711c-0.3,0-0.573-0.069-0.819-0.211
		c-0.246-0.141-0.438-0.339-0.576-0.595c-0.138-0.254-0.207-0.547-0.207-0.877s0.07-0.621,0.211-0.873s0.333-0.448,0.576-0.59
		c0.243-0.141,0.515-0.211,0.815-0.211c0.306,0,0.58,0.068,0.823,0.207c0.243,0.138,0.435,0.335,0.576,0.59
		c0.141,0.255,0.212,0.547,0.212,0.877s-0.071,0.623-0.212,0.877c-0.141,0.256-0.333,0.454-0.576,0.595
		C12.028,11.642,11.754,11.711,11.448,11.711 M11.52,7.599c-0.354,0-0.678,0.067-0.972,0.201c-0.294,0.136-0.537,0.336-0.729,0.6
		V7.644H8.991v6.516h0.864v-2.466c0.198,0.252,0.439,0.444,0.724,0.576c0.285,0.132,0.599,0.197,0.941,0.197
		c0.462,0,0.876-0.102,1.242-0.306c0.366-0.204,0.652-0.491,0.859-0.858c0.207-0.37,0.311-0.795,0.311-1.274
		c0-0.48-0.104-0.903-0.311-1.269c-0.207-0.366-0.493-0.651-0.859-0.855C12.396,7.7,11.982,7.599,11.52,7.599 M2.844,11.711
		c-0.306,0-0.581-0.069-0.824-0.211c-0.242-0.141-0.435-0.339-0.576-0.595c-0.141-0.254-0.211-0.547-0.211-0.877
		s0.07-0.622,0.211-0.877c0.141-0.255,0.334-0.452,0.576-0.59c0.243-0.139,0.518-0.207,0.824-0.207c0.306,0,0.58,0.068,0.824,0.207
		c0.242,0.138,0.433,0.335,0.571,0.59c0.138,0.255,0.207,0.547,0.207,0.877s-0.069,0.623-0.207,0.877
		C4.101,11.161,3.91,11.359,3.668,11.5C3.424,11.642,3.15,11.711,2.844,11.711 M2.844,12.467c0.474,0,0.898-0.104,1.273-0.314
		S4.786,11.653,5,11.283c0.212-0.369,0.319-0.787,0.319-1.255S5.212,9.142,5,8.772C4.786,8.403,4.492,8.115,4.117,7.908
		s-0.799-0.31-1.273-0.31c-0.474,0-0.9,0.103-1.278,0.31S0.892,8.403,0.679,8.772C0.466,9.142,0.36,9.561,0.36,10.028
		s0.106,0.886,0.319,1.255c0.213,0.37,0.509,0.659,0.887,0.869S2.37,12.467,2.844,12.467"/>
</g>
</svg>

