<?xml version="1.0" encoding="utf-8"?>
<!-- Generator: Adobe Illustrator 15.1.0, SVG Export Plug-In . SVG Version: 6.00 Build 0)  -->
<!DOCTYPE svg PUBLIC "-//W3C//DTD SVG 1.1//EN" "http://www.w3.org/Graphics/SVG/1.1/DTD/svg11.dtd">
<svg version="1.1" id="Layer_1" xmlns="http://www.w3.org/2000/svg" xmlns:xlink="http://www.w3.org/1999/xlink" x="0px" y="0px"
	 width="273.334px" height="293.999px" viewBox="6.732 5.049 273.334 293.999" enable-background="new 6.732 5.049 273.334 293.999"
	 xml:space="preserve">
<path fill="#FF4A3D" d="M12.813,294.745c0.002,0.322,0.232,0.605,0.542,0.655c0.107,0.031,2.495,0.206,4.261-1.261
	c1.094-0.913,1.707-2.248,1.849-4.009c0.414-4.609-3.332-6.394-5.412-6.7c-0.335-0.048-0.644,0.191-0.692,0.535
	c-0.051,0.328,0.187,0.66,0.521,0.707c0.209,0.027,4.743,0.711,4.363,5.36c-0.114,1.42-0.582,2.478-1.411,3.163
	c-1.372,1.14-3.313,0.918-3.332,0.909c-0.336-0.044-0.644,0.202-0.685,0.558L12.813,294.745z"/>
<path fill="#FF4A3D" d="M14.881,288.795c-0.576-0.023-1.063,0.438-1.083,1.026c-0.021,0.591,0.434,1.083,1.01,1.099
	c0.574,0.016,1.054-0.444,1.075-1.026C15.902,289.313,15.457,288.82,14.881,288.795"/>
<path fill="#FF4A3D" d="M13.279,282.722c-0.021,0.313,0.186,0.599,0.491,0.657c0.102,0.024,2.473,0.459,4.342-0.902
	c1.159-0.84,1.858-2.149,2.105-3.908c0.68-4.604-2.974-6.58-5.034-6.995c-0.33-0.066-0.652,0.155-0.718,0.496
	c-0.069,0.324,0.149,0.668,0.481,0.73c0.205,0.041,4.707,0.962,4.059,5.6c-0.198,1.415-0.734,2.447-1.607,3.078
	c-1.446,1.048-3.367,0.68-3.386,0.674c-0.333-0.069-0.656,0.151-0.723,0.491L13.279,282.722z"/>
<path fill="#FF4A3D" d="M15.719,276.965c-0.572-0.056-1.085,0.373-1.139,0.959c-0.057,0.586,0.367,1.104,0.941,1.154
	c0.573,0.05,1.079-0.38,1.134-0.959C16.709,277.54,16.292,277.022,15.719,276.965"/>
<path fill="#FF4A3D" d="M14.449,270.825c-0.039,0.31,0.153,0.604,0.454,0.682c0.101,0.028,2.445,0.591,4.384-0.674
	c1.201-0.781,1.969-2.054,2.303-3.8c0.913-4.568-2.641-6.723-4.678-7.238c-0.327-0.082-0.659,0.124-0.741,0.459
	c-0.086,0.32,0.116,0.675,0.444,0.755c0.201,0.051,4.654,1.192,3.772,5.793c-0.27,1.405-0.855,2.41-1.762,2.996
	c-1.498,0.972-3.398,0.502-3.417,0.495c-0.328-0.085-0.662,0.118-0.745,0.454L14.449,270.825z"/>
<path fill="#FF4A3D" d="M17.179,265.206c-0.57-0.086-1.102,0.318-1.187,0.9c-0.084,0.581,0.313,1.119,0.883,1.198
	c0.569,0.079,1.098-0.324,1.181-0.899C18.14,265.828,17.747,265.291,17.179,265.206"/>
<path fill="#FF4A3D" d="M16.215,259.01c-0.054,0.309,0.122,0.612,0.421,0.704c0.097,0.033,2.413,0.709,4.411-0.457
	c1.239-0.72,2.066-1.955,2.488-3.681c1.136-4.518-2.306-6.843-4.313-7.462c-0.324-0.1-0.665,0.091-0.764,0.422
	c-0.103,0.315,0.082,0.679,0.405,0.776c0.2,0.062,4.589,1.423,3.481,5.974c-0.339,1.389-0.975,2.365-1.907,2.904
	c-1.545,0.896-3.419,0.334-3.437,0.324c-0.324-0.1-0.667,0.087-0.769,0.418L16.215,259.01z"/>
<path fill="#FF4A3D" d="M19.221,253.534c-0.563-0.114-1.119,0.262-1.229,0.84c-0.114,0.577,0.256,1.134,0.821,1.242
	c0.564,0.105,1.112-0.271,1.225-0.84C20.147,254.203,19.786,253.648,19.221,253.534"/>
<path fill="#FF4A3D" d="M18.565,247.297c-0.069,0.305,0.091,0.618,0.386,0.725c0.097,0.038,2.374,0.827,4.429-0.235
	c1.272-0.657,2.161-1.849,2.668-3.551c1.365-4.449-1.952-6.949-3.926-7.673c-0.318-0.114-0.668,0.059-0.784,0.384
	c-0.118,0.311,0.047,0.683,0.364,0.797c0.196,0.069,4.511,1.655,3.174,6.144c-0.408,1.37-1.096,2.311-2.053,2.804
	c-1.589,0.816-3.43,0.162-3.447,0.154c-0.319-0.117-0.671,0.052-0.788,0.377L18.565,247.297z"/>
<path fill="#FF4A3D" d="M21.841,241.976c-0.558-0.142-1.127,0.206-1.271,0.777c-0.141,0.57,0.2,1.146,0.761,1.282
	c0.558,0.135,1.124-0.214,1.264-0.778C22.736,242.693,22.399,242.119,21.841,241.976"/>
<path fill="#FF4A3D" d="M21.508,235.712c-0.084,0.302,0.06,0.622,0.347,0.743c0.095,0.043,2.329,0.95,4.436-0.007
	c1.306-0.589,2.254-1.732,2.851-3.403c1.595-4.367-1.578-7.041-3.509-7.871c-0.311-0.132-0.671,0.021-0.805,0.341
	c-0.136,0.305,0.011,0.686,0.321,0.815c0.193,0.082,4.41,1.896,2.839,6.305c-0.479,1.348-1.215,2.249-2.194,2.691
	c-1.63,0.731-3.436-0.017-3.453-0.025c-0.312-0.135-0.671,0.018-0.806,0.337L21.508,235.712z"/>
<path fill="#FF4A3D" d="M25.061,230.568c-0.549-0.172-1.137,0.146-1.312,0.709c-0.17,0.563,0.139,1.154,0.69,1.32
	c0.552,0.165,1.136-0.153,1.305-0.711C25.916,231.331,25.609,230.74,25.061,230.568"/>
<path fill="#FF4A3D" d="M25.065,224.292c-0.101,0.296,0.027,0.625,0.308,0.762c0.093,0.049,2.271,1.075,4.429,0.235
	c1.333-0.517,2.347-1.604,3.034-3.237c1.836-4.264-1.175-7.117-3.056-8.058c-0.303-0.149-0.671-0.019-0.823,0.293
	c-0.152,0.296-0.03,0.685,0.273,0.835c0.189,0.093,4.291,2.147,2.477,6.455c-0.556,1.314-1.335,2.178-2.341,2.563
	c-1.665,0.645-3.43-0.201-3.445-0.214c-0.304-0.149-0.673-0.021-0.825,0.292L25.065,224.292z"/>
<path fill="#FF4A3D" d="M28.899,219.348c-0.54-0.201-1.143,0.083-1.348,0.636c-0.205,0.552,0.075,1.161,0.615,1.357
	c0.542,0.196,1.139-0.091,1.343-0.637C29.71,220.158,29.436,219.549,28.899,219.348"/>
<path fill="#FF4A3D" d="M29.266,213.079c-0.119,0.29-0.009,0.627,0.261,0.779c0.092,0.055,2.205,1.203,4.408,0.492
	c1.361-0.438,2.438-1.461,3.219-3.049c2.088-4.141-0.739-7.171-2.559-8.228c-0.293-0.168-0.668-0.061-0.841,0.241
	c-0.171,0.285-0.071,0.684,0.222,0.851c0.185,0.104,4.149,2.408,2.081,6.595c-0.633,1.279-1.462,2.092-2.49,2.419
	c-1.699,0.543-3.409-0.403-3.427-0.417c-0.293-0.167-0.67-0.059-0.84,0.244L29.266,213.079z"/>
<path fill="#FF4A3D" d="M33.387,208.367c-0.527-0.235-1.146,0.014-1.383,0.554c-0.24,0.539,0.003,1.165,0.532,1.393
	c0.527,0.228,1.142-0.023,1.378-0.556C34.148,209.223,33.91,208.6,33.387,208.367"/>
<path fill="#FF4A3D" d="M34.138,202.126c-0.135,0.283-0.048,0.625,0.214,0.795c0.086,0.062,2.127,1.338,4.368,0.767
	c1.386-0.354,2.523-1.304,3.403-2.838c2.344-3.99-0.274-7.199-2.019-8.375c-0.279-0.188-0.666-0.105-0.854,0.186
	c-0.188,0.275-0.116,0.677,0.166,0.864c0.176,0.117,3.977,2.675,1.646,6.715c-0.711,1.236-1.59,1.995-2.637,2.255
	c-1.729,0.437-3.378-0.616-3.393-0.628c-0.283-0.187-0.665-0.101-0.855,0.191L34.138,202.126z"/>
<path fill="#FF4A3D" d="M38.553,197.681c-0.51-0.267-1.145-0.06-1.417,0.465c-0.272,0.523-0.071,1.163,0.442,1.423
	c0.513,0.262,1.142,0.051,1.409-0.466C39.256,198.585,39.062,197.948,38.553,197.681"/>
<path fill="#FF4A3D" d="M39.714,191.5c-0.155,0.273-0.091,0.621,0.158,0.808c0.08,0.065,2.036,1.477,4.307,1.054
	c1.41-0.256,2.6-1.131,3.587-2.596c2.608-3.815,0.226-7.197-1.432-8.495c-0.268-0.207-0.654-0.15-0.866,0.126
	c-0.209,0.261-0.167,0.666,0.102,0.872c0.169,0.131,3.78,2.949,1.18,6.814c-0.795,1.184-1.725,1.879-2.782,2.071
	c-1.757,0.317-3.333-0.842-3.346-0.857c-0.271-0.204-0.657-0.144-0.864,0.137L39.714,191.5z"/>
<path fill="#FF4A3D" d="M44.42,187.359c-0.488-0.302-1.144-0.141-1.446,0.366c-0.305,0.506-0.152,1.156,0.343,1.451
	c0.493,0.294,1.14,0.129,1.44-0.37C45.056,188.307,44.911,187.661,44.42,187.359"/>
<path fill="#FF4A3D" d="M46.012,181.268c-0.175,0.261-0.134,0.615,0.102,0.818c0.077,0.072,1.924,1.612,4.223,1.357
	c1.42-0.159,2.677-0.938,3.759-2.331c2.875-3.607,0.756-7.156-0.801-8.577c-0.251-0.227-0.641-0.197-0.871,0.063
	c-0.228,0.246-0.216,0.653,0.036,0.879c0.158,0.142,3.548,3.222,0.672,6.882c-0.876,1.123-1.851,1.75-2.923,1.863
	c-1.772,0.192-3.262-1.075-3.275-1.091c-0.254-0.224-0.644-0.19-0.872,0.073L46.012,181.268z"/>
<path fill="#FF4A3D" d="M51.008,177.473c-0.466-0.337-1.126-0.221-1.471,0.26c-0.342,0.482-0.233,1.146,0.238,1.473
	c0.472,0.331,1.124,0.211,1.462-0.264C51.577,178.468,51.474,177.809,51.008,177.473"/>
<path fill="#FF4A3D" d="M53.051,171.514c-0.194,0.248-0.183,0.601,0.037,0.822c0.07,0.076,1.801,1.754,4.111,1.672
	c1.427-0.05,2.735-0.734,3.924-2.035c3.136-3.373,1.313-7.084-0.152-8.602c-0.235-0.243-0.624-0.246-0.871-0.007
	c-0.241,0.225-0.258,0.63-0.022,0.873c0.151,0.152,3.283,3.481,0.142,6.911c-0.96,1.049-1.98,1.601-3.055,1.633
	c-1.786,0.056-3.171-1.316-3.186-1.335c-0.236-0.241-0.628-0.238-0.875,0.009L53.051,171.514z"/>
<path fill="#FF4A3D" d="M58.322,168.105c-0.438-0.372-1.104-0.306-1.484,0.149c-0.382,0.451-0.321,1.123,0.124,1.486
	c0.446,0.365,1.103,0.293,1.478-0.152C58.813,169.142,58.76,168.476,58.322,168.105"/>
<path fill="#FF4A3D" d="M60.792,162.339c-0.207,0.231-0.217,0.583-0.014,0.818c0.067,0.079,1.669,1.885,3.983,1.947
	c1.438,0.046,2.791-0.581,4.063-1.836c3.349-3.289,1.58-7.067,0.175-8.621c-0.228-0.251-0.617-0.264-0.87-0.032
	c-0.249,0.218-0.277,0.623-0.05,0.872c0.135,0.15,3.215,3.586-0.118,6.912c-1.021,1.009-2.074,1.51-3.152,1.478
	c-1.788-0.055-3.081-1.523-3.093-1.54c-0.221-0.256-0.611-0.281-0.87-0.054L60.792,162.339z"/>
<path fill="#FF4A3D" d="M66.208,159.271c-0.423-0.39-1.088-0.357-1.484,0.074c-0.396,0.432-0.372,1.097,0.053,1.485
	c0.425,0.387,1.09,0.354,1.483-0.074C66.654,160.327,66.631,159.661,66.208,159.271"/>
<path fill="#FF4A3D" d="M68.851,153.609c-0.214,0.225-0.233,0.576-0.037,0.818c0.064,0.082,1.612,1.932,3.923,2.066
	c1.435,0.087,2.809-0.495,4.116-1.712c3.446-3.178,1.803-7.009,0.446-8.612c-0.219-0.257-0.606-0.283-0.868-0.058
	c-0.254,0.21-0.295,0.614-0.077,0.871c0.133,0.157,3.096,3.686-0.337,6.904c-1.049,0.979-2.121,1.444-3.195,1.38
	c-1.784-0.107-3.032-1.614-3.044-1.631c-0.214-0.262-0.604-0.299-0.869-0.08L68.851,153.609z"/>
<path fill="#FF4A3D" d="M74.36,150.706c-0.412-0.404-1.075-0.391-1.485,0.029c-0.408,0.419-0.405,1.086,0.008,1.487
	c0.412,0.4,1.078,0.387,1.484-0.029C74.772,151.775,74.77,151.108,74.36,150.706"/>
<path fill="#FF4A3D" d="M77.187,145.129c-0.221,0.218-0.254,0.567-0.065,0.815c0.061,0.083,1.548,1.982,3.856,2.195
	c1.424,0.129,2.824-0.397,4.165-1.573c3.549-3.053,2.046-6.939,0.751-8.588c-0.21-0.264-0.597-0.305-0.868-0.09
	c-0.263,0.2-0.318,0.602-0.109,0.866c0.127,0.162,2.963,3.796-0.577,6.889c-1.077,0.947-2.168,1.369-3.239,1.272
	c-1.777-0.165-2.976-1.713-2.987-1.729c-0.204-0.27-0.592-0.318-0.865-0.109L77.187,145.129z"/>
<path fill="#FF4A3D" d="M82.795,142.412c-0.396-0.417-1.063-0.429-1.489-0.025c-0.424,0.405-0.441,1.074-0.042,1.488
	c0.4,0.415,1.063,0.422,1.483,0.02C83.17,143.494,83.19,142.829,82.795,142.412"/>
<path fill="#FF4A3D" d="M85.818,136.934c-0.229,0.211-0.273,0.56-0.094,0.814c0.057,0.086,1.477,2.038,3.771,2.33
	c1.424,0.187,2.833-0.294,4.222-1.413c3.655-2.915,2.31-6.851,1.081-8.552c-0.199-0.273-0.585-0.329-0.864-0.126
	c-0.272,0.189-0.343,0.591-0.144,0.864c0.122,0.169,2.805,3.906-0.844,6.862c-1.114,0.9-2.216,1.287-3.282,1.148
	c-1.773-0.232-2.914-1.821-2.925-1.838c-0.194-0.277-0.579-0.34-0.86-0.138L85.818,136.934z"/>
<path fill="#FF4A3D" d="M91.525,134.422c-0.38-0.433-1.049-0.471-1.485-0.079c-0.439,0.39-0.483,1.055-0.101,1.485
	c0.384,0.428,1.049,0.462,1.484,0.075C91.856,135.515,91.904,134.853,91.525,134.422"/>
<path fill="#FF4A3D" d="M94.764,129.064c-0.238,0.201-0.297,0.548-0.127,0.81c0.054,0.088,1.396,2.095,3.675,2.479
	c1.414,0.244,2.841-0.178,4.273-1.236c3.766-2.755,2.601-6.74,1.448-8.498c-0.187-0.281-0.569-0.353-0.857-0.162
	c-0.28,0.178-0.371,0.574-0.183,0.856c0.114,0.175,2.628,4.023-1.138,6.82c-1.15,0.851-2.265,1.194-3.327,1.011
	c-1.763-0.306-2.837-1.936-2.847-1.954c-0.184-0.286-0.564-0.363-0.854-0.173L94.764,129.064z"/>
<path fill="#FF4A3D" d="M100.574,126.786c-0.36-0.448-1.027-0.514-1.482-0.141c-0.454,0.371-0.527,1.035-0.161,1.48
	c0.365,0.444,1.028,0.505,1.479,0.137C100.859,127.894,100.935,127.234,100.574,126.786"/>
<path fill="#FF4A3D" d="M104.047,121.571c-0.246,0.19-0.321,0.535-0.163,0.804c0.05,0.091,1.3,2.153,3.561,2.642
	c1.399,0.304,2.846-0.046,4.32-1.038c3.89-2.56,2.918-6.606,1.857-8.416c-0.172-0.29-0.554-0.384-0.85-0.204
	c-0.287,0.165-0.396,0.558-0.224,0.848c0.104,0.178,2.425,4.148-1.466,6.756c-1.187,0.8-2.317,1.084-3.367,0.856
	c-1.745-0.383-2.748-2.064-2.756-2.082c-0.17-0.291-0.551-0.389-0.848-0.211L104.047,121.571z"/>
<path fill="#FF4A3D" d="M109.962,119.56c-0.34-0.465-1.001-0.559-1.477-0.211c-0.473,0.348-0.573,1.011-0.229,1.472
	c0.345,0.461,1.002,0.55,1.47,0.205C110.195,120.682,110.301,120.024,109.962,119.56"/>
<path fill="#FF4A3D" d="M113.691,114.517c-0.257,0.179-0.35,0.518-0.206,0.794c0.045,0.093,1.192,2.216,3.426,2.818
	c1.382,0.375,2.841,0.1,4.364-0.809c4.01-2.347,3.268-6.434,2.311-8.303c-0.155-0.299-0.531-0.414-0.836-0.251
	c-0.298,0.149-0.43,0.535-0.273,0.835c0.096,0.185,2.188,4.272-1.829,6.667c-1.227,0.732-2.366,0.964-3.404,0.679
	c-1.725-0.474-2.64-2.198-2.648-2.217c-0.154-0.302-0.528-0.415-0.836-0.254L113.691,114.517z"/>
<path fill="#FF4A3D" d="M119.706,112.811c-0.313-0.482-0.973-0.615-1.463-0.289c-0.49,0.327-0.629,0.979-0.309,1.458
	c0.319,0.478,0.975,0.605,1.458,0.283C119.878,113.941,120.021,113.293,119.706,112.811"/>
<path fill="#FF4A3D" d="M123.713,107.976c-0.267,0.163-0.379,0.498-0.251,0.781c0.039,0.096,1.066,2.279,3.26,3.007
	c1.357,0.454,2.828,0.266,4.399-0.551c4.13-2.098,3.651-6.212,2.816-8.143c-0.136-0.309-0.502-0.444-0.819-0.303
	c-0.308,0.13-0.465,0.506-0.327,0.815c0.085,0.193,1.912,4.403-2.235,6.544c-1.265,0.658-2.416,0.82-3.436,0.478
	c-1.694-0.573-2.51-2.344-2.517-2.366c-0.138-0.31-0.505-0.444-0.82-0.3L123.713,107.976z"/>
<path fill="#FF4A3D" d="M129.825,106.619c-0.284-0.5-0.933-0.669-1.444-0.375c-0.511,0.294-0.687,0.943-0.396,1.438
	c0.292,0.497,0.936,0.658,1.439,0.368C129.93,107.76,130.109,107.119,129.825,106.619"/>
<path fill="#FF4A3D" d="M134.133,102.038c-0.278,0.144-0.41,0.475-0.301,0.766c0.034,0.101,0.918,2.336,3.061,3.21
	c1.324,0.539,2.801,0.451,4.419-0.256c4.248-1.805,4.072-5.935,3.379-7.926c-0.113-0.317-0.469-0.479-0.796-0.359
	c-0.316,0.108-0.5,0.472-0.386,0.79c0.07,0.199,1.587,4.524-2.687,6.372c-1.306,0.57-2.462,0.656-3.459,0.245
	c-1.649-0.676-2.352-2.502-2.356-2.522c-0.117-0.318-0.476-0.475-0.801-0.353L134.133,102.038z"/>
<path fill="#FF4A3D" d="M140.331,101.086c-0.249-0.519-0.886-0.731-1.417-0.473c-0.528,0.263-0.749,0.895-0.492,1.41
	c0.257,0.514,0.89,0.721,1.411,0.463C140.357,102.231,140.58,101.603,140.331,101.086"/>
<path fill="#FF4A3D" d="M144.964,96.818c-0.289,0.126-0.448,0.441-0.359,0.74c0.024,0.1,0.748,2.402,2.818,3.426
	c1.279,0.639,2.753,0.657,4.418,0.084c4.357-1.462,4.524-5.585,4.004-7.627c-0.086-0.327-0.429-0.518-0.766-0.425
	c-0.324,0.082-0.54,0.431-0.451,0.757c0.055,0.207,1.202,4.632-3.188,6.138c-1.344,0.464-2.501,0.463-3.463-0.021
	c-1.597-0.803-2.161-2.669-2.164-2.691c-0.094-0.326-0.44-0.509-0.775-0.408L144.964,96.818z"/>
<path fill="#FF4A3D" d="M151.226,96.334c-0.207-0.536-0.826-0.801-1.377-0.58c-0.548,0.22-0.819,0.831-0.602,1.366
	c0.217,0.531,0.832,0.788,1.373,0.572C151.16,97.474,151.434,96.871,151.226,96.334"/>
<path fill="#FF4A3D" d="M156.203,92.453c-0.299,0.102-0.483,0.404-0.421,0.709c0.016,0.102,0.547,2.455,2.521,3.649
	c1.22,0.749,2.681,0.894,4.383,0.472c4.451-1.054,5.011-5.136,4.694-7.218c-0.054-0.333-0.377-0.558-0.724-0.498
	c-0.332,0.051-0.582,0.378-0.522,0.711c0.032,0.214,0.75,4.719-3.744,5.817c-1.376,0.343-2.527,0.238-3.443-0.325
	c-1.52-0.934-1.928-2.846-1.928-2.867c-0.065-0.332-0.396-0.544-0.738-0.471L156.203,92.453z"/>
<path fill="#FF4A3D" d="M162.497,92.513c-0.158-0.555-0.75-0.868-1.319-0.699c-0.571,0.167-0.894,0.759-0.725,1.308
	c0.17,0.551,0.76,0.855,1.318,0.691C162.33,93.648,162.656,93.064,162.497,92.513"/>
<path fill="#FF4A3D" d="M167.835,89.113c-0.31,0.073-0.523,0.357-0.49,0.667c0.004,0.105,0.308,2.492,2.151,3.879
	c1.14,0.86,2.572,1.155,4.3,0.913c4.506-0.579,5.521-4.552,5.447-6.663c-0.014-0.337-0.312-0.598-0.664-0.576
	c-0.338,0.012-0.623,0.31-0.604,0.646c0.011,0.223,0.214,4.765-4.351,5.381c-1.399,0.197-2.53-0.022-3.387-0.676
	c-1.419-1.079-1.637-3.019-1.635-3.041c-0.031-0.337-0.34-0.581-0.691-0.545L167.835,89.113z"/>
<path fill="#FF4A3D" d="M174.108,89.809c-0.1-0.569-0.656-0.942-1.242-0.834c-0.586,0.109-0.971,0.663-0.856,1.227
	c0.111,0.564,0.668,0.93,1.238,0.823C173.822,90.92,174.206,90.375,174.108,89.809"/>
<path fill="#FF4A3D" d="M179.808,87.015c-0.315,0.038-0.563,0.296-0.565,0.607c-0.01,0.105,0.024,2.51,1.692,4.101
	c1.029,0.987,2.41,1.45,4.142,1.422c4.498-0.01,6.041-3.785,6.27-5.892c0.032-0.336-0.229-0.632-0.582-0.661
	c-0.34-0.036-0.664,0.223-0.691,0.559c-0.021,0.225-0.44,4.734-5.016,4.771c-1.408,0.02-2.5-0.331-3.271-1.08
	c-1.281-1.241-1.275-3.19-1.271-3.212c0.008-0.338-0.271-0.616-0.625-0.62L179.808,87.015z"/>
<path fill="#FF4A3D" d="M185.979,88.46c-0.026-0.576-0.534-1.02-1.133-0.984c-0.6,0.038-1.05,0.537-1.007,1.112
	c0.045,0.573,0.552,1.006,1.132,0.97C185.554,89.523,186.005,89.033,185.979,88.46"/>
<path fill="#FF4A3D" d="M192.033,86.448c-0.321-0.008-0.604,0.213-0.65,0.521c-0.026,0.104-0.319,2.488,1.103,4.298
	c0.873,1.125,2.155,1.779,3.844,2.024c2.216,0.335,3.781-0.321,4.965-1.329c1.173-1.006,1.937-2.362,2.244-3.362
	c0.103-0.322-0.104-0.669-0.459-0.77c-0.336-0.102-0.713,0.087-0.805,0.412c-0.074,0.229-1.33,4.524-5.771,3.837
	c-1.383-0.199-2.4-0.708-3.055-1.561c-1.086-1.412-0.808-3.341-0.797-3.361c0.058-0.335-0.183-0.649-0.537-0.702L192.033,86.448z"/>
<path fill="#FF4A3D" d="M197.964,88.808c0.067-0.571-0.366-1.094-0.972-1.152c-0.602-0.06-1.129,0.367-1.174,0.942
	c-0.046,0.573,0.392,1.076,0.971,1.133C197.369,89.788,197.896,89.378,197.964,88.808"/>
<path fill="#FF4A3D" d="M204.219,87.18c-0.182,0.272-0.147,0.634,0.089,0.838c0.074,0.076,1.932,1.602,4.242,1.327
	c1.43-0.166,2.694-0.952,3.819-2.352c2.98-3.634,0.955-7.252-0.578-8.698c-0.245-0.231-0.641-0.207-0.881,0.056
	c-0.234,0.247-0.234,0.661,0.015,0.891c0.157,0.146,3.475,3.29,0.489,6.983c-0.907,1.133-1.896,1.765-2.979,1.884
	c-1.788,0.203-3.271-1.066-3.285-1.084c-0.252-0.225-0.647-0.187-0.884,0.089L204.219,87.18z"/>
<path fill="#FF4A3D" d="M209.349,83.289c-0.461-0.345-1.131-0.23-1.488,0.26c-0.357,0.49-0.266,1.163,0.201,1.498
	c0.468,0.335,1.129,0.215,1.481-0.266C209.895,84.3,209.81,83.633,209.349,83.289"/>
<path fill="#FF4A3D" d="M211.574,77.257c-0.203,0.249-0.199,0.608,0.017,0.834c0.067,0.078,1.765,1.79,4.098,1.718
	c1.443-0.041,2.782-0.732,4.021-2.053c3.271-3.432,1.474-7.183,0.043-8.724c-0.231-0.246-0.627-0.249-0.884-0.003
	c-0.25,0.229-0.276,0.642-0.046,0.888c0.146,0.153,3.262,3.518-0.006,7c-0.997,1.066-2.042,1.62-3.129,1.648
	c-1.802,0.048-3.163-1.354-3.175-1.371c-0.232-0.246-0.629-0.247-0.883,0.002L211.574,77.257z"/>
<path fill="#FF4A3D" d="M216.976,73.833c-0.437-0.377-1.108-0.312-1.501,0.145c-0.393,0.459-0.354,1.134,0.089,1.506
	c0.439,0.37,1.109,0.303,1.495-0.15C217.446,74.883,217.409,74.21,216.976,73.833"/>
<path fill="#FF4A3D" d="M219.599,67.983c-0.217,0.236-0.238,0.594-0.037,0.832c0.063,0.083,1.643,1.904,3.977,1.981
	c1.443,0.05,2.829-0.559,4.146-1.806c3.479-3.243,1.893-7.092,0.549-8.709c-0.217-0.259-0.611-0.283-0.881-0.053
	c-0.263,0.215-0.312,0.624-0.095,0.883c0.136,0.16,3.063,3.7-0.414,6.988c-1.062,1.005-2.141,1.495-3.228,1.455
	c-1.802-0.066-3.068-1.554-3.08-1.571c-0.218-0.261-0.609-0.286-0.882-0.056L219.599,67.983z"/>
<path fill="#FF4A3D" d="M225.192,64.91c-0.413-0.402-1.088-0.378-1.506,0.054c-0.418,0.434-0.42,1.109-0.002,1.507
	c0.414,0.397,1.088,0.371,1.5-0.058C225.601,65.986,225.603,65.313,225.192,64.91"/>
<path fill="#FF4A3D" d="M228.139,59.228c-0.229,0.223-0.27,0.578-0.082,0.828c0.06,0.084,1.534,1.994,3.859,2.198
	c1.439,0.129,2.857-0.404,4.242-1.582c3.652-3.06,2.258-6.99,0.998-8.671c-0.203-0.269-0.596-0.313-0.877-0.098
	c-0.271,0.201-0.342,0.608-0.137,0.877c0.125,0.167,2.873,3.852-0.775,6.958c-1.115,0.947-2.219,1.381-3.303,1.28
	c-1.795-0.162-2.979-1.721-2.99-1.738c-0.201-0.272-0.594-0.32-0.875-0.105L228.139,59.228z"/>
<path fill="#FF4A3D" d="M233.886,56.465c-0.391-0.424-1.066-0.435-1.507-0.026c-0.438,0.41-0.477,1.084-0.081,1.503
	c0.393,0.42,1.066,0.43,1.502,0.023C234.235,57.56,234.274,56.889,233.886,56.465"/>
<path fill="#FF4A3D" d="M237.115,50.944c-0.238,0.21-0.297,0.563-0.122,0.821c0.056,0.088,1.431,2.07,3.744,2.39
	c1.433,0.2,2.876-0.263,4.317-1.373c3.801-2.885,2.59-6.879,1.411-8.615c-0.191-0.277-0.582-0.342-0.871-0.139
	c-0.281,0.189-0.369,0.592-0.178,0.869c0.116,0.172,2.689,3.984-1.108,6.913c-1.159,0.892-2.285,1.27-3.361,1.118
	c-1.784-0.252-2.891-1.868-2.898-1.885c-0.188-0.282-0.577-0.35-0.868-0.15L237.115,50.944z"/>
<path fill="#FF4A3D" d="M242.987,48.471c-0.369-0.442-1.045-0.488-1.504-0.1c-0.459,0.387-0.526,1.06-0.153,1.498
	c0.374,0.438,1.046,0.479,1.5,0.096C243.283,49.58,243.356,48.912,242.987,48.471"/>
<path fill="#FF4A3D" d="M246.472,43.11c-0.248,0.199-0.322,0.548-0.16,0.815c0.052,0.09,1.332,2.134,3.629,2.561
	c1.422,0.267,2.887-0.131,4.377-1.176c3.933-2.713,2.897-6.757,1.793-8.543c-0.178-0.286-0.563-0.366-0.86-0.178
	c-0.291,0.175-0.396,0.574-0.217,0.861c0.108,0.176,2.515,4.098-1.415,6.855c-1.198,0.841-2.342,1.167-3.411,0.964
	c-1.771-0.333-2.8-1.998-2.81-2.017c-0.174-0.29-0.56-0.376-0.859-0.189L246.472,43.11z"/>
<path fill="#FF4A3D" d="M252.448,40.909c-0.35-0.458-1.021-0.532-1.496-0.166c-0.478,0.364-0.573,1.035-0.222,1.489
	c0.353,0.455,1.021,0.525,1.492,0.164C252.696,42.033,252.797,41.367,252.448,40.909"/>
<path fill="#FF4A3D" d="M256.12,36.302c-0.216,0.158-0.289,0.449-0.163,0.677c0.04,0.077,1.035,1.834,2.944,2.276
	c1.181,0.273,2.423-0.005,3.708-0.828c3.391-2.132,2.666-5.556,1.803-7.088c-0.138-0.246-0.459-0.327-0.716-0.179
	c-0.248,0.136-0.351,0.466-0.212,0.712c0.086,0.151,1.963,3.519-1.425,5.689c-1.035,0.661-2.003,0.893-2.891,0.684
	c-1.472-0.344-2.271-1.775-2.277-1.79c-0.136-0.249-0.455-0.335-0.716-0.191L256.12,36.302z"/>
<path fill="#FF4A3D" d="M261.201,34.677c-0.275-0.396-0.835-0.483-1.247-0.193c-0.41,0.288-0.518,0.846-0.237,1.239
	c0.278,0.393,0.835,0.475,1.244,0.19C261.369,35.627,261.477,35.072,261.201,34.677"/>
<path fill="#FF4A3D" d="M263.771,30.847c-0.178,0.13-0.238,0.37-0.134,0.558c0.033,0.063,0.853,1.51,2.425,1.874
	c0.972,0.226,1.995-0.003,3.053-0.681c2.793-1.756,2.195-4.575,1.484-5.837c-0.113-0.203-0.378-0.269-0.59-0.147
	c-0.204,0.112-0.288,0.384-0.173,0.586c0.069,0.125,1.615,2.897-1.175,4.685c-0.853,0.544-1.649,0.735-2.38,0.563
	c-1.212-0.283-1.87-1.461-1.876-1.474c-0.111-0.205-0.375-0.276-0.588-0.157L263.771,30.847z"/>
<path fill="#FF4A3D" d="M267.955,29.509c-0.227-0.326-0.688-0.397-1.026-0.159c-0.339,0.237-0.427,0.696-0.196,1.021
	c0.229,0.323,0.688,0.391,1.024,0.157C268.094,30.291,268.182,29.834,267.955,29.509"/>
<path fill="#FF4A3D" d="M269.979,25.974c-0.156,0.114-0.209,0.325-0.117,0.491c0.029,0.056,0.75,1.329,2.133,1.648
	c0.854,0.198,1.755-0.003,2.686-0.599c2.457-1.545,1.932-4.025,1.306-5.135c-0.1-0.178-0.332-0.237-0.519-0.13
	c-0.18,0.099-0.254,0.337-0.152,0.516c0.062,0.109,1.421,2.549-1.033,4.121c-0.75,0.479-1.451,0.646-2.094,0.496
	c-1.066-0.249-1.646-1.286-1.65-1.296c-0.098-0.18-0.33-0.243-0.518-0.138L269.979,25.974z"/>
<path fill="#FF4A3D" d="M273.66,24.797c-0.199-0.287-0.605-0.35-0.903-0.14c-0.298,0.208-0.375,0.612-0.173,0.898
	c0.201,0.284,0.605,0.344,0.901,0.138C273.782,25.485,273.86,25.083,273.66,24.797"/>
<g>
	<path fill="#FF4A3D" d="M100.374,48.817c0,0,4.674-0.242,4.957-3.078c0.214-2.141-1.43-3.981-3.713-4.327
		c-0.739-0.111-2.786-0.24-4.565,0.931c-3.701,2.436-4.12,10.029,3.372,12.929c8.787,3.401,18.112-5.895,12.764-15.376
		c-5.244-8.787-19.108-10.144-25.345-0.365s0.06,28.418,17.207,30.403c11.873,1.374,20.146-8.463,24.112-14.645
		c1.762-2.747,4.38-9.217,4.38-9.217l-4.682-17.097l-4.111-6.377h-15.163c0,0,17.006,13.037,11.479,28.769
		c-3.808,10.84-15.075,10.963-22.354,7.326c-3.285-1.641-7.507-4.727-6.83-11.927c0.4-4.257,3.087-6.735,6.782-7.418
		C110.52,37.159,111.607,52.903,100.374,48.817"/>
	<path fill="#FF4A3D" d="M128.293,44.708c0,0,6.944,11.338,24.659,15.448c17.715,4.109,22.958-7.513,29.903-10.914
		c12.322-6.611,19.495,0.196,19.495,0.196s2.066-10.697-10.424-10.683c-3.828-0.283-5.67-3.26-11.057-9.637
		c-5.384-6.377-9.013-12.408-21.177-12.219c-13.035,0.617-17.184,13.543-12.79,21.479c0,0,4.797,8.89,14.291,6.339
		c9.497-2.551,9.22-11.976,4.4-13.109c-8.632-1.674-7.927,6.885-7.927,7.31c0,0.286-4.492-1.938-5.589-4.648
		c-2.159-5.334,2.221-8.85,2.989-9.272c2.803-1.539,6.61-1.934,10.792-0.612c12.858,4.932,10.903,23.016-2.42,25.992
		c-13.322,2.976-29.054-12.33-31.038-18.424c-1.172-3.602-0.012-4.612,0.852-4.058c3.724,2.393,5.097-1.085,5.097-1.652
		s-1.519-7.963-1.519-7.963l-17.185,3.611L128.293,44.708z"/>
	<g>
		<path fill="#FF4A3D" d="M146.844,66.142c-0.959-0.297-2.717-1.193-4.594-3.88c-2.81-4.023-7.726-3.501-7.458-1.828
			c0.406,2.543,4.072,15.046,4.072,15.046s2.383-1.8,2.112-4.727c-0.271-2.929-0.232-3.638-0.232-3.638s2.661,1.948,6.033-0.229
			C147.041,66.717,147.322,66.29,146.844,66.142z"/>
		<path fill="#FF4A3D" d="M127.443,70.942c0.709-0.711,1.848-2.323,2.254-5.575c0.61-4.87,5.202-6.7,5.746-5.096
			c0.827,2.439,3.413,15.209,3.413,15.209s-2.947-0.481-4.072-3.197c-1.126-2.716-1.491-3.326-1.491-3.326s-1.446,2.964-5.443,2.611
			C127.536,71.542,127.09,71.296,127.443,70.942z"/>
	</g>
	<g>
		<path fill="#FF4A3D" d="M85.878,76.591c5.269-2.978,15.255-4.275,16.599-4.987c-6.177-1.15-10.507-4.204-12.504-6.248
			c-1.466,0.741-5.989,2.852-11.084,5.69C80.915,73.143,83.314,74.982,85.878,76.591z"/>
		<path fill="#FF4A3D" d="M69.847,89.523c-2.672,2.355-0.93,6.918,0.315,7.4c-4.795-1.503-5.609-6.423,0.87-11.184
			c0.5-0.368,1.054-0.756,1.644-1.158c-2.255-1.665-4.299-3.466-6.121-5.417c-1.973,1.632-3.65,3.305-4.788,4.961
			c-6.235,9.069-0.472,17.998,8.315,17.713c8.787-0.284,11-9.052,7.953-11.843C75.808,87.955,72.335,87.331,69.847,89.523z"/>
	</g>
	<path fill="#FF4A3D" d="M58.062,55.8c2.35,13.695,9.242,23.552,21.828,30.456c7.543,3.65,16.651,6.967,19.081,7.834
		c3.523-1.894,7.225-3.766,11.131-5.6c-5.345-1.091-38.991-8.817-39.775-30.604c-0.85-23.667,12.089-28.749,15.632-29.174
		c3.544-0.426,0.1-3.544-3.302-4.394c-3.4-0.852-4.535-0.852-4.535-0.852s0.502-5.332-0.49-7.032
		c-0.992-1.701-8.721,3.489-8.721,3.489s-2.268-4.108-6.378-5.667c-4.111-1.56-0.846,1.574-1.128,6.676
		C61.121,26.035,54.658,39.755,58.062,55.8z"/>
	<circle fill="#FF4A3D" cx="162.894" cy="36.505" r="6.08"/>
	<path fill="#FF4A3D" d="M123.864,26.464l-6.402,4.214c0,0-4.943-6.078-12.318-10.616c-7.374-4.539-5.591-9.077,2.999-4.701
		c8.59,4.376,15.803,4.458,23.096,1.783c7.294-2.674,18.882-3.404,17.018-0.892c-1.863,2.513-8.59,5.917-10.292,10.292
		c-1.702,4.375-7.293-3.728-11.021-3.485c-3.728,0.243-3.08,3.08-3.08,3.08"/>
	<path fill="#FF4A3D" d="M127.839,23.184c0,0.361,0.796,6.011,1.014,6.301c0.218,0.29,5.288,6.012,5.288,6.012
		s-3.114-9.562-0.724-6.447c2.391,3.115,7.605,6.375,7.171,0.362c-0.435-6.012,2.246-8.837,5.216-11.01
		c2.97-2.173-12.024,1.304-12.387,1.666S127.839,23.184,127.839,23.184z"/>
	<path fill="#FF4A3D" d="M128.7,32.362l3.897-2.355c0,0,0.77,5.567,5.738,10.106c4.968,4.54-7.023,1.627-7.451,0.814
		C130.456,40.113,128.7,32.362,128.7,32.362z"/>
	<path fill="#FF4A3D" d="M215.583,15.832c-10.438-4.927-24.171,4.579-27.456,7.067c-1.818,1.377-5.171,1.675-7.805,1.668
		c0.313,0.376,0.625,0.754,0.934,1.131c0.493,0.6,0.992,1.208,1.509,1.819c0.802,0.948,1.524,1.822,2.188,2.623
		c3.711,4.484,5.015,5.948,7.076,6.134c0.129,0,0.248,0.014,0.376,0.016c0.516-3.501,1.899-8.863,10.575-13.061
		c6.663-3.694,16.74-0.206,14.345,6.419c-1.72,5.066-6.518,4.566-8.367,2.817c-1.291-1.222-0.942-3.112-0.942-3.112
		s2.801,4.551,5.797,0.614c2.035-2.674-1.301-5.789-4.869-5.388c-4.271,0.479-7.104,5.388-4.23,10.097
		c3.584,4.896,10.307,5.067,13.815,1.654c3.586-3.489,4.03-5.714,4.345-7.201C223.885,24.318,222.404,18.742,215.583,15.832z"/>
</g>
<path fill="#FF4A3D" d="M255.684,13.42c-34.087,26.318-61.304,53.998-63.607,56.767c-3.863-0.154-31.723-0.537-73.108,17.288
	c-46.909,20.203-68.523,46.338-74.272,54.242V13.42h-1.749v131.113c0,0.392,0.262,0.736,0.639,0.842
	c0.375,0.109,0.779-0.053,0.983-0.388c0.193-0.32,20.001-32.18,75.092-55.906c44.008-18.953,72.465-17.147,72.749-17.128
	c0.28,0.02,0.566-0.1,0.747-0.325c0.161-0.202,27.989-29.587,65.395-58.208H255.684z"/>
<path fill="#FF4A3D" d="M266.988,13.42c-38.803,28.929-68.657,62.013-68.816,62.209l-2.402,3.004l-3.829-0.28
	c-0.2-0.019-26.72-1.907-69.741,16.622c-41.875,18.033-73.897,59.495-85.67,76.392V14.072c0-0.227-0.038-0.442-0.092-0.652h-5.062
	c-0.054,0.21-0.092,0.426-0.092,0.652v165.967c0,1.171,0.776,2.201,1.903,2.521c1.126,0.32,2.33-0.143,2.949-1.14
	c0.369-0.596,37.553-59.842,88.137-81.627c41.303-17.788,67.019-16.227,67.275-16.208l5.215,0.382
	c0.869,0.049,1.701-0.303,2.24-0.978l3.26-4.076c0.149-0.185,30.618-33.437,67.753-61.212c0.516-0.385,1.041-0.758,1.55-1.153
	c1.546-1.201,2.848-2.234,3.944-3.128H266.988z"/>
</svg>
