<?xml version="1.0" encoding="utf-8"?>
<!-- Generator: Adobe Illustrator 15.1.0, SVG Export Plug-In . SVG Version: 6.00 Build 0)  -->
<!DOCTYPE svg PUBLIC "-//W3C//DTD SVG 1.1//EN" "http://www.w3.org/Graphics/SVG/1.1/DTD/svg11.dtd">
<svg version="1.1" id="Layer_1" xmlns="http://www.w3.org/2000/svg" xmlns:xlink="http://www.w3.org/1999/xlink" x="0px" y="0px"
	 width="273.334px" height="293.999px" viewBox="6.732 5.049 273.334 293.999" enable-background="new 6.732 5.049 273.334 293.999"
	 xml:space="preserve">
<path fill="#FF4A3D" d="M12.817,14.18c0.041,0.355,0.349,0.602,0.685,0.558c0.02-0.009,1.96-0.23,3.332,0.909
	c0.829,0.686,1.297,1.743,1.411,3.163c0.38,4.649-4.154,5.333-4.363,5.36c-0.335,0.047-0.572,0.379-0.521,0.707
	c0.049,0.344,0.357,0.583,0.692,0.535c2.08-0.307,5.826-2.091,5.412-6.7c-0.142-1.761-0.755-3.096-1.849-4.009
	c-1.766-1.467-4.153-1.292-4.261-1.261c-0.31,0.05-0.54,0.333-0.542,0.655L12.817,14.18z"/>
<path fill="#FF4A3D" d="M14.881,20.048c0.576-0.025,1.021-0.518,1.002-1.099c-0.021-0.582-0.501-1.042-1.075-1.026
	c-0.576,0.016-1.03,0.508-1.01,1.099C13.819,19.61,14.305,20.071,14.881,20.048"/>
<path fill="#FF4A3D" d="M13.289,26.2c0.066,0.34,0.39,0.561,0.723,0.491c0.019-0.006,1.939-0.374,3.386,0.674
	c0.873,0.631,1.409,1.663,1.607,3.078c0.648,4.638-3.854,5.559-4.059,5.6c-0.332,0.063-0.551,0.406-0.481,0.73
	c0.065,0.341,0.388,0.563,0.718,0.496c2.061-0.415,5.714-2.391,5.034-6.995c-0.247-1.759-0.946-3.068-2.105-3.908
	c-1.869-1.361-4.24-0.927-4.342-0.902c-0.306,0.059-0.513,0.344-0.491,0.657L13.289,26.2z"/>
<path fill="#FF4A3D" d="M15.719,31.878c0.573-0.058,0.99-0.575,0.937-1.154c-0.055-0.579-0.561-1.009-1.134-0.959
	c-0.574,0.051-0.998,0.568-0.941,1.154C14.634,31.505,15.147,31.934,15.719,31.878"/>
<path fill="#FF4A3D" d="M14.464,38.096c0.083,0.336,0.417,0.539,0.745,0.454c0.019-0.007,1.919-0.477,3.417,0.495
	c0.906,0.586,1.492,1.591,1.762,2.996c0.882,4.601-3.571,5.742-3.772,5.793c-0.328,0.08-0.53,0.435-0.444,0.755
	c0.082,0.335,0.414,0.541,0.741,0.459c2.037-0.516,5.591-2.67,4.678-7.238c-0.334-1.746-1.102-3.019-2.303-3.8
	c-1.938-1.265-4.283-0.702-4.384-0.674c-0.301,0.077-0.493,0.372-0.454,0.682L14.464,38.096z"/>
<path fill="#FF4A3D" d="M17.179,43.637c0.568-0.085,0.961-0.622,0.877-1.199c-0.083-0.575-0.611-0.979-1.181-0.899
	c-0.57,0.079-0.967,0.617-0.883,1.198C16.077,43.318,16.609,43.723,17.179,43.637"/>
<path fill="#FF4A3D" d="M16.233,49.91c0.102,0.331,0.444,0.518,0.769,0.418c0.018-0.01,1.892-0.571,3.437,0.324
	c0.933,0.539,1.568,1.516,1.907,2.904c1.107,4.551-3.281,5.912-3.481,5.974c-0.323,0.098-0.508,0.461-0.405,0.776
	c0.099,0.331,0.439,0.521,0.764,0.422c2.008-0.619,5.449-2.944,4.313-7.462c-0.422-1.726-1.249-2.961-2.488-3.681
	c-1.998-1.166-4.314-0.49-4.411-0.457c-0.299,0.092-0.475,0.396-0.421,0.704L16.233,49.91z"/>
<path fill="#FF4A3D" d="M19.221,55.309c0.565-0.114,0.926-0.669,0.816-1.242c-0.112-0.568-0.66-0.945-1.225-0.84
	c-0.565,0.108-0.936,0.665-0.821,1.242C18.102,55.047,18.657,55.423,19.221,55.309"/>
<path fill="#FF4A3D" d="M18.587,61.621c0.117,0.325,0.469,0.494,0.788,0.377c0.018-0.008,1.858-0.662,3.447,0.154
	c0.957,0.493,1.645,1.434,2.053,2.804c1.337,4.488-2.978,6.074-3.174,6.144c-0.317,0.114-0.482,0.486-0.364,0.797
	c0.116,0.325,0.466,0.498,0.784,0.384c1.974-0.724,5.291-3.224,3.926-7.673c-0.507-1.702-1.396-2.894-2.668-3.551
	c-2.055-1.063-4.332-0.273-4.429-0.235c-0.295,0.106-0.455,0.42-0.386,0.725L18.587,61.621z"/>
<path fill="#FF4A3D" d="M21.841,66.867c0.558-0.144,0.895-0.718,0.753-1.281c-0.14-0.564-0.706-0.913-1.264-0.778
	c-0.561,0.136-0.901,0.712-0.761,1.282C20.714,66.661,21.283,67.009,21.841,66.867"/>
<path fill="#FF4A3D" d="M21.534,73.205c0.135,0.319,0.494,0.472,0.806,0.337c0.018-0.009,1.823-0.757,3.453-0.025
	c0.979,0.442,1.716,1.344,2.194,2.691c1.571,4.408-2.646,6.223-2.839,6.305c-0.311,0.13-0.457,0.511-0.321,0.815
	c0.134,0.319,0.494,0.473,0.805,0.341c1.931-0.83,5.104-3.504,3.509-7.871c-0.597-1.671-1.545-2.814-2.851-3.403
	c-2.106-0.957-4.341-0.05-4.436-0.007c-0.287,0.121-0.431,0.441-0.347,0.743L21.534,73.205z"/>
<path fill="#FF4A3D" d="M25.061,78.274c0.548-0.172,0.855-0.763,0.684-1.318c-0.169-0.558-0.753-0.876-1.305-0.711
	c-0.552,0.166-0.86,0.758-0.69,1.32C23.924,78.129,24.512,78.446,25.061,78.274"/>
<path fill="#FF4A3D" d="M25.095,84.625c0.152,0.313,0.521,0.441,0.825,0.292c0.016-0.013,1.78-0.858,3.445-0.214
	c1.006,0.385,1.785,1.248,2.341,2.563c1.814,4.308-2.287,6.362-2.477,6.455c-0.304,0.15-0.426,0.539-0.273,0.835
	c0.152,0.312,0.521,0.442,0.823,0.293c1.881-0.941,4.892-3.794,3.056-8.058c-0.688-1.634-1.701-2.721-3.034-3.237
	c-2.157-0.84-4.336,0.187-4.429,0.235c-0.28,0.137-0.408,0.466-0.308,0.762L25.095,84.625z"/>
<path fill="#FF4A3D" d="M28.899,89.495c0.537-0.201,0.812-0.811,0.61-1.356c-0.204-0.546-0.801-0.833-1.343-0.637
	c-0.54,0.196-0.82,0.806-0.615,1.357C27.756,89.412,28.359,89.696,28.899,89.495"/>
<path fill="#FF4A3D" d="M29.3,95.837c0.17,0.303,0.547,0.411,0.84,0.244c0.018-0.014,1.728-0.96,3.427-0.417
	c1.028,0.327,1.857,1.14,2.49,2.419c2.068,4.187-1.896,6.491-2.081,6.595c-0.293,0.167-0.393,0.566-0.222,0.851
	c0.173,0.302,0.548,0.409,0.841,0.241c1.819-1.057,4.646-4.087,2.559-8.228c-0.781-1.588-1.857-2.611-3.219-3.049
	c-2.203-0.711-4.316,0.437-4.408,0.492c-0.27,0.152-0.38,0.489-0.261,0.779L29.3,95.837z"/>
<path fill="#FF4A3D" d="M33.387,100.476c0.523-0.233,0.761-0.856,0.527-1.391c-0.236-0.533-0.851-0.784-1.378-0.556
	c-0.529,0.228-0.772,0.854-0.532,1.393C32.241,100.462,32.86,100.711,33.387,100.476"/>
<path fill="#FF4A3D" d="M34.177,106.785c0.19,0.292,0.572,0.378,0.855,0.191c0.015-0.012,1.664-1.065,3.393-0.628
	c1.047,0.26,1.926,1.019,2.637,2.255c2.331,4.04-1.47,6.598-1.646,6.715c-0.282,0.187-0.354,0.589-0.166,0.864
	c0.188,0.291,0.575,0.374,0.854,0.186c1.744-1.176,4.362-4.385,2.019-8.375c-0.88-1.534-2.018-2.484-3.403-2.838
	c-2.241-0.571-4.282,0.705-4.368,0.767c-0.262,0.17-0.349,0.512-0.214,0.795L34.177,106.785z"/>
<path fill="#FF4A3D" d="M38.553,111.162c0.509-0.267,0.703-0.904,0.435-1.422c-0.268-0.517-0.896-0.728-1.409-0.466
	c-0.514,0.26-0.715,0.9-0.442,1.423C37.408,111.222,38.043,111.429,38.553,111.162"/>
<path fill="#FF4A3D" d="M39.757,117.409c0.207,0.281,0.593,0.341,0.864,0.137c0.013-0.015,1.589-1.174,3.346-0.857
	c1.058,0.192,1.987,0.887,2.782,2.071c2.601,3.865-1.011,6.683-1.18,6.814c-0.269,0.206-0.311,0.611-0.102,0.872
	c0.212,0.276,0.599,0.333,0.866,0.126c1.657-1.298,4.04-4.68,1.432-8.495c-0.987-1.465-2.177-2.34-3.587-2.596
	c-2.271-0.423-4.227,0.989-4.307,1.054c-0.249,0.187-0.313,0.535-0.158,0.808L39.757,117.409z"/>
<path fill="#FF4A3D" d="M44.42,121.484c0.491-0.302,0.636-0.948,0.337-1.447c-0.301-0.499-0.947-0.664-1.44-0.37
	c-0.495,0.295-0.647,0.945-0.343,1.451C43.277,121.625,43.932,121.786,44.42,121.484"/>
<path fill="#FF4A3D" d="M46.061,127.639c0.229,0.263,0.618,0.297,0.872,0.073c0.014-0.016,1.503-1.283,3.275-1.091
	c1.072,0.113,2.047,0.74,2.923,1.863c2.876,3.66-0.514,6.74-0.672,6.882c-0.252,0.226-0.264,0.633-0.036,0.879
	c0.23,0.26,0.62,0.29,0.871,0.063c1.557-1.421,3.676-4.97,0.801-8.577c-1.082-1.393-2.339-2.172-3.759-2.331
	c-2.299-0.255-4.146,1.285-4.223,1.357c-0.235,0.203-0.276,0.557-0.102,0.818L46.061,127.639z"/>
<path fill="#FF4A3D" d="M51.008,131.37c0.466-0.336,0.569-0.995,0.229-1.469c-0.338-0.475-0.99-0.595-1.462-0.264
	c-0.472,0.327-0.58,0.991-0.238,1.473C49.882,131.591,50.542,131.707,51.008,131.37"/>
<path fill="#FF4A3D" d="M53.104,137.388c0.247,0.247,0.639,0.25,0.875,0.009c0.015-0.019,1.399-1.391,3.186-1.335
	c1.074,0.032,2.095,0.584,3.055,1.633c3.142,3.43,0.01,6.759-0.142,6.911c-0.235,0.243-0.219,0.648,0.022,0.873
	c0.247,0.239,0.636,0.236,0.871-0.007c1.465-1.518,3.288-5.229,0.152-8.602c-1.188-1.301-2.497-1.985-3.924-2.035
	c-2.311-0.082-4.041,1.596-4.111,1.672c-0.22,0.221-0.231,0.574-0.037,0.822L53.104,137.388z"/>
<path fill="#FF4A3D" d="M58.322,140.738c0.438-0.371,0.491-1.037,0.117-1.483c-0.375-0.445-1.031-0.517-1.478-0.152
	c-0.445,0.363-0.506,1.035-0.124,1.486C57.217,141.044,57.883,141.11,58.322,140.738"/>
<path fill="#FF4A3D" d="M60.847,146.56c0.259,0.227,0.649,0.202,0.87-0.054c0.012-0.017,1.305-1.485,3.093-1.54
	c1.078-0.032,2.131,0.469,3.152,1.478c3.333,3.326,0.253,6.762,0.118,6.912c-0.228,0.249-0.199,0.654,0.05,0.872
	c0.253,0.232,0.643,0.219,0.87-0.032c1.405-1.554,3.174-5.332-0.175-8.621c-1.272-1.255-2.626-1.882-4.063-1.836
	c-2.314,0.062-3.916,1.868-3.983,1.947c-0.203,0.235-0.193,0.587,0.014,0.818L60.847,146.56z"/>
<path fill="#FF4A3D" d="M66.208,149.572c0.423-0.39,0.445-1.056,0.052-1.485c-0.394-0.428-1.059-0.461-1.483-0.074
	c-0.425,0.388-0.448,1.053-0.053,1.485C65.12,149.929,65.785,149.962,66.208,149.572"/>
<path fill="#FF4A3D" d="M68.908,155.288c0.266,0.219,0.655,0.182,0.869-0.08c0.012-0.017,1.26-1.524,3.044-1.631
	c1.074-0.064,2.146,0.401,3.195,1.38c3.433,3.218,0.47,6.747,0.337,6.904c-0.218,0.257-0.177,0.661,0.077,0.871
	c0.262,0.225,0.649,0.199,0.868-0.058c1.356-1.603,3-5.434-0.446-8.612c-1.308-1.217-2.682-1.799-4.116-1.712
	c-2.311,0.134-3.858,1.984-3.923,2.066c-0.196,0.242-0.177,0.593,0.037,0.818L68.908,155.288z"/>
<path fill="#FF4A3D" d="M74.36,158.137c0.41-0.402,0.412-1.069,0.007-1.487c-0.406-0.416-1.072-0.429-1.484-0.029
	c-0.413,0.401-0.416,1.068-0.008,1.487C73.284,158.528,73.948,158.541,74.36,158.137"/>
<path fill="#FF4A3D" d="M77.247,163.766c0.273,0.209,0.661,0.161,0.865-0.109c0.012-0.016,1.21-1.564,2.987-1.729
	c1.071-0.097,2.162,0.325,3.239,1.272c3.54,3.093,0.704,6.727,0.577,6.889c-0.209,0.264-0.153,0.666,0.109,0.866
	c0.271,0.215,0.658,0.174,0.868-0.09c1.295-1.649,2.798-5.535-0.751-8.588c-1.341-1.176-2.741-1.702-4.165-1.573
	c-2.309,0.213-3.796,2.112-3.856,2.195c-0.188,0.248-0.155,0.597,0.065,0.815L77.247,163.766z"/>
<path fill="#FF4A3D" d="M82.795,166.431c0.395-0.417,0.375-1.082-0.048-1.483c-0.42-0.402-1.083-0.395-1.483,0.02
	c-0.399,0.414-0.382,1.083,0.042,1.488C81.732,166.86,82.399,166.848,82.795,166.431"/>
<path fill="#FF4A3D" d="M85.879,171.958c0.281,0.202,0.666,0.139,0.86-0.138c0.011-0.017,1.151-1.606,2.925-1.838
	c1.066-0.139,2.168,0.248,3.282,1.148c3.648,2.956,0.966,6.693,0.844,6.862c-0.199,0.273-0.129,0.675,0.144,0.864
	c0.279,0.203,0.665,0.147,0.864-0.126c1.229-1.701,2.574-5.637-1.081-8.552c-1.389-1.119-2.798-1.6-4.222-1.413
	c-2.295,0.292-3.715,2.244-3.771,2.33c-0.18,0.254-0.135,0.603,0.094,0.814L85.879,171.958z"/>
<path fill="#FF4A3D" d="M91.525,174.421c0.379-0.431,0.331-1.093-0.102-1.481c-0.436-0.387-1.101-0.353-1.484,0.075
	c-0.383,0.43-0.339,1.095,0.101,1.485C90.476,174.892,91.145,174.854,91.525,174.421"/>
<path fill="#FF4A3D" d="M94.827,179.826c0.29,0.19,0.671,0.113,0.854-0.173c0.01-0.018,1.084-1.648,2.847-1.954
	c1.063-0.183,2.177,0.16,3.327,1.011c3.766,2.797,1.252,6.645,1.138,6.82c-0.188,0.282-0.098,0.678,0.183,0.856
	c0.288,0.191,0.671,0.119,0.857-0.162c1.152-1.758,2.317-5.743-1.448-8.498c-1.433-1.058-2.859-1.48-4.273-1.236
	c-2.279,0.384-3.621,2.391-3.675,2.479c-0.17,0.262-0.111,0.609,0.127,0.81L94.827,179.826z"/>
<path fill="#FF4A3D" d="M100.574,182.057c0.36-0.448,0.284-1.108-0.165-1.476c-0.45-0.368-1.113-0.307-1.479,0.137
	c-0.366,0.445-0.293,1.109,0.161,1.48C99.547,182.571,100.214,182.505,100.574,182.057"/>
<path fill="#FF4A3D" d="M104.113,187.317c0.297,0.178,0.678,0.08,0.848-0.211c0.008-0.018,1.011-1.699,2.756-2.082
	c1.05-0.228,2.181,0.056,3.367,0.856c3.891,2.608,1.57,6.578,1.466,6.756c-0.173,0.29-0.063,0.683,0.224,0.848
	c0.296,0.18,0.678,0.086,0.85-0.204c1.061-1.81,2.032-5.856-1.857-8.416c-1.475-0.992-2.921-1.342-4.32-1.038
	c-2.261,0.489-3.511,2.551-3.561,2.642c-0.158,0.269-0.083,0.614,0.163,0.804L104.113,187.317z"/>
<path fill="#FF4A3D" d="M109.962,189.283c0.339-0.464,0.232-1.122-0.236-1.466c-0.468-0.345-1.125-0.256-1.47,0.205
	c-0.344,0.461-0.243,1.124,0.229,1.472C108.961,189.842,109.622,189.748,109.962,189.283"/>
<path fill="#FF4A3D" d="M113.758,194.367c0.308,0.161,0.682,0.048,0.836-0.254c0.009-0.019,0.924-1.743,2.648-2.217
	c1.038-0.285,2.178-0.053,3.404,0.679c4.017,2.395,1.925,6.482,1.829,6.667c-0.156,0.3-0.024,0.686,0.273,0.835
	c0.305,0.163,0.681,0.048,0.836-0.251c0.957-1.869,1.699-5.956-2.311-8.303c-1.523-0.909-2.982-1.184-4.364-0.809
	c-2.233,0.602-3.381,2.725-3.426,2.818c-0.144,0.276-0.051,0.615,0.206,0.794L113.758,194.367z"/>
<path fill="#FF4A3D" d="M119.706,196.032c0.314-0.482,0.172-1.13-0.313-1.452c-0.483-0.322-1.139-0.195-1.458,0.283
	c-0.32,0.479-0.182,1.131,0.309,1.458C118.734,196.647,119.393,196.514,119.706,196.032"/>
<path fill="#FF4A3D" d="M123.783,200.905c0.315,0.144,0.683,0.01,0.82-0.3c0.007-0.022,0.822-1.793,2.517-2.366
	c1.02-0.342,2.171-0.18,3.436,0.478c4.147,2.141,2.32,6.351,2.235,6.544c-0.138,0.309,0.02,0.685,0.327,0.815
	c0.317,0.141,0.684,0.006,0.819-0.303c0.835-1.931,1.313-6.045-2.816-8.143c-1.571-0.817-3.042-1.005-4.399-0.551
	c-2.193,0.728-3.221,2.911-3.26,3.007c-0.128,0.283-0.016,0.618,0.251,0.781L123.783,200.905z"/>
<path fill="#FF4A3D" d="M129.825,202.224c0.283-0.5,0.104-1.141-0.4-1.431c-0.504-0.29-1.147-0.129-1.439,0.368
	c-0.291,0.495-0.115,1.144,0.396,1.438C128.893,202.893,129.541,202.724,129.825,202.224"/>
<path fill="#FF4A3D" d="M134.206,206.838c0.325,0.122,0.684-0.035,0.801-0.353c0.005-0.02,0.707-1.846,2.356-2.522
	c0.997-0.411,2.153-0.325,3.459,0.245c4.273,1.848,2.757,6.173,2.687,6.372c-0.114,0.318,0.069,0.682,0.386,0.79
	c0.327,0.12,0.683-0.042,0.796-0.359c0.693-1.991,0.869-6.121-3.379-7.926c-1.618-0.707-3.095-0.795-4.419-0.256
	c-2.143,0.874-3.026,3.109-3.061,3.21c-0.109,0.291,0.022,0.622,0.301,0.766L134.206,206.838z"/>
<path fill="#FF4A3D" d="M140.331,207.757c0.249-0.517,0.025-1.145-0.498-1.4c-0.521-0.258-1.154-0.051-1.411,0.463
	c-0.257,0.515-0.036,1.147,0.492,1.41C139.446,208.488,140.082,208.276,140.331,207.757"/>
<path fill="#FF4A3D" d="M145.037,212.052c0.335,0.101,0.682-0.082,0.775-0.408c0.003-0.022,0.567-1.888,2.164-2.691
	c0.962-0.484,2.119-0.485,3.463-0.021c4.391,1.506,3.243,5.931,3.188,6.138c-0.089,0.326,0.127,0.675,0.451,0.757
	c0.337,0.093,0.68-0.098,0.766-0.425c0.521-2.042,0.354-6.165-4.004-7.627c-1.665-0.573-3.139-0.555-4.418,0.084
	c-2.07,1.024-2.794,3.326-2.818,3.426c-0.089,0.299,0.07,0.614,0.359,0.74L145.037,212.052z"/>
<path fill="#FF4A3D" d="M151.226,212.509c0.208-0.537-0.065-1.14-0.605-1.358c-0.541-0.216-1.156,0.041-1.373,0.572
	c-0.218,0.535,0.054,1.146,0.602,1.366C150.4,213.31,151.019,213.045,151.226,212.509"/>
<path fill="#FF4A3D" d="M156.281,216.411c0.343,0.073,0.673-0.139,0.738-0.471c0-0.021,0.408-1.933,1.928-2.867
	c0.916-0.563,2.067-0.668,3.443-0.325c4.494,1.098,3.776,5.603,3.744,5.817c-0.06,0.333,0.19,0.66,0.522,0.711
	c0.347,0.06,0.67-0.165,0.724-0.498c0.316-2.082-0.243-6.164-4.694-7.218c-1.702-0.422-3.163-0.277-4.383,0.472
	c-1.974,1.194-2.505,3.547-2.521,3.649c-0.063,0.305,0.122,0.607,0.421,0.709L156.281,216.411z"/>
<path fill="#FF4A3D" d="M162.497,216.33c0.158-0.551-0.167-1.135-0.726-1.3c-0.559-0.164-1.148,0.14-1.318,0.691
	c-0.169,0.549,0.153,1.141,0.725,1.308C161.747,217.198,162.339,216.885,162.497,216.33"/>
<path fill="#FF4A3D" d="M167.912,219.745c0.352,0.036,0.66-0.208,0.691-0.545c-0.002-0.022,0.216-1.962,1.635-3.041
	c0.856-0.654,1.987-0.873,3.387-0.676c4.564,0.616,4.361,5.158,4.351,5.381c-0.02,0.336,0.266,0.634,0.604,0.646
	c0.353,0.022,0.65-0.239,0.664-0.576c0.074-2.111-0.941-6.084-5.447-6.663c-1.728-0.242-3.16,0.053-4.3,0.913
	c-1.844,1.387-2.147,3.773-2.151,3.879c-0.033,0.311,0.181,0.594,0.49,0.667L167.912,219.745z"/>
<path fill="#FF4A3D" d="M174.108,219.034c0.099-0.566-0.286-1.111-0.86-1.216c-0.57-0.107-1.127,0.259-1.238,0.823
	c-0.114,0.564,0.271,1.118,0.856,1.227C173.451,219.976,174.008,219.603,174.108,219.034"/>
<path fill="#FF4A3D" d="M179.89,221.833c0.354-0.004,0.633-0.282,0.625-0.62c-0.005-0.022-0.011-1.971,1.271-3.212
	c0.771-0.749,1.863-1.1,3.271-1.08c4.575,0.037,4.995,4.546,5.016,4.771c0.027,0.336,0.352,0.595,0.691,0.559
	c0.354-0.029,0.614-0.325,0.582-0.661c-0.229-2.107-1.771-5.882-6.27-5.892c-1.731-0.028-3.112,0.435-4.142,1.422
	c-1.668,1.591-1.702,3.996-1.692,4.101c0.002,0.311,0.25,0.569,0.565,0.607L179.89,221.833z"/>
<path fill="#FF4A3D" d="M185.979,220.383c0.026-0.573-0.425-1.063-1.008-1.098c-0.58-0.036-1.087,0.397-1.132,0.97
	c-0.043,0.575,0.407,1.074,1.007,1.112C185.445,221.403,185.952,220.959,185.979,220.383"/>
<path fill="#FF4A3D" d="M192.115,222.388c0.354-0.053,0.595-0.367,0.537-0.702c-0.011-0.02-0.289-1.949,0.797-3.361
	c0.654-0.853,1.672-1.362,3.055-1.561c4.441-0.687,5.697,3.608,5.771,3.837c0.092,0.325,0.469,0.514,0.805,0.412
	c0.355-0.101,0.562-0.448,0.459-0.77c-0.308-1-1.071-2.356-2.244-3.362c-1.184-1.008-2.749-1.664-4.965-1.329
	c-1.688,0.245-2.971,0.899-3.844,2.024c-1.422,1.81-1.129,4.195-1.103,4.298c0.046,0.308,0.329,0.529,0.65,0.521L192.115,222.388z"
	/>
<path fill="#FF4A3D" d="M197.964,220.035c-0.068-0.57-0.595-0.98-1.175-0.923c-0.579,0.057-1.017,0.56-0.971,1.133
	c0.045,0.575,0.572,1.002,1.174,0.942C197.598,221.129,198.031,220.606,197.964,220.035"/>
<path fill="#FF4A3D" d="M204.267,221.729c0.236,0.276,0.632,0.314,0.884,0.089c0.014-0.018,1.497-1.287,3.285-1.084
	c1.082,0.119,2.071,0.751,2.979,1.884c2.985,3.693-0.332,6.837-0.489,6.983c-0.249,0.23-0.249,0.644-0.015,0.891
	c0.24,0.263,0.636,0.287,0.881,0.056c1.533-1.446,3.559-5.064,0.578-8.698c-1.125-1.4-2.39-2.186-3.819-2.352
	c-2.311-0.275-4.168,1.251-4.242,1.327c-0.236,0.204-0.271,0.566-0.089,0.838L204.267,221.729z"/>
<path fill="#FF4A3D" d="M209.349,225.554c0.461-0.344,0.546-1.011,0.194-1.492c-0.353-0.481-1.014-0.601-1.481-0.266
	c-0.467,0.335-0.559,1.008-0.201,1.498C208.218,225.784,208.888,225.899,209.349,225.554"/>
<path fill="#FF4A3D" d="M211.63,231.647c0.254,0.249,0.65,0.248,0.883,0.002c0.012-0.017,1.373-1.419,3.175-1.371
	c1.087,0.028,2.132,0.582,3.129,1.648c3.268,3.482,0.152,6.847,0.006,7c-0.23,0.246-0.204,0.659,0.046,0.888
	c0.257,0.246,0.652,0.243,0.884-0.003c1.431-1.541,3.228-5.292-0.043-8.724c-1.238-1.321-2.577-2.012-4.021-2.053
	c-2.333-0.072-4.03,1.64-4.098,1.718c-0.216,0.226-0.22,0.585-0.017,0.834L211.63,231.647z"/>
<path fill="#FF4A3D" d="M216.976,235.01c0.434-0.377,0.47-1.05,0.083-1.501c-0.386-0.453-1.056-0.52-1.495-0.15
	c-0.442,0.372-0.481,1.047-0.089,1.506C215.867,235.322,216.539,235.387,216.976,235.01"/>
<path fill="#FF4A3D" d="M219.655,240.916c0.272,0.229,0.664,0.205,0.882-0.056c0.012-0.017,1.278-1.505,3.08-1.571
	c1.087-0.04,2.166,0.45,3.228,1.455c3.477,3.288,0.55,6.828,0.414,6.988c-0.217,0.259-0.168,0.668,0.095,0.883
	c0.27,0.23,0.664,0.206,0.881-0.053c1.344-1.617,2.93-5.466-0.549-8.709c-1.317-1.247-2.703-1.856-4.146-1.806
	c-2.334,0.077-3.913,1.898-3.977,1.981c-0.201,0.238-0.18,0.596,0.037,0.832L219.655,240.916z"/>
<path fill="#FF4A3D" d="M225.192,243.933c0.411-0.403,0.409-1.076-0.008-1.503c-0.412-0.429-1.086-0.455-1.5-0.058
	c-0.418,0.398-0.416,1.073,0.002,1.507C224.104,244.311,224.779,244.335,225.192,243.933"/>
<path fill="#FF4A3D" d="M228.199,249.668c0.281,0.215,0.674,0.167,0.875-0.105c0.011-0.017,1.195-1.576,2.99-1.738
	c1.084-0.101,2.188,0.333,3.303,1.28c3.648,3.106,0.9,6.791,0.775,6.958c-0.205,0.27-0.134,0.676,0.137,0.877
	c0.281,0.215,0.674,0.171,0.877-0.098c1.26-1.681,2.654-5.611-0.998-8.671c-1.385-1.178-2.803-1.711-4.242-1.582
	c-2.325,0.204-3.8,2.114-3.859,2.198c-0.188,0.25-0.147,0.605,0.082,0.828L228.199,249.668z"/>
<path fill="#FF4A3D" d="M233.886,252.378c0.388-0.424,0.349-1.095-0.086-1.5c-0.436-0.407-1.109-0.397-1.502,0.023
	c-0.396,0.419-0.357,1.093,0.081,1.503C232.82,252.813,233.495,252.802,233.886,252.378"/>
<path fill="#FF4A3D" d="M237.18,257.95c0.291,0.2,0.68,0.132,0.868-0.15c0.008-0.017,1.114-1.633,2.898-1.885
	c1.076-0.152,2.202,0.226,3.361,1.118c3.798,2.929,1.225,6.741,1.108,6.913c-0.191,0.277-0.104,0.68,0.178,0.869
	c0.289,0.203,0.68,0.138,0.871-0.139c1.179-1.736,2.39-5.73-1.411-8.615c-1.441-1.11-2.885-1.573-4.317-1.373
	c-2.313,0.32-3.688,2.302-3.744,2.39c-0.175,0.258-0.116,0.611,0.122,0.821L237.18,257.95z"/>
<path fill="#FF4A3D" d="M242.987,260.372c0.369-0.441,0.297-1.109-0.157-1.494c-0.454-0.383-1.126-0.342-1.5,0.096
	c-0.373,0.438-0.306,1.111,0.153,1.498C241.942,260.86,242.617,260.814,242.987,260.372"/>
<path fill="#FF4A3D" d="M246.538,265.78c0.3,0.187,0.686,0.101,0.859-0.189c0.01-0.019,1.039-1.684,2.81-2.017
	c1.069-0.203,2.213,0.123,3.411,0.964c3.93,2.757,1.523,6.679,1.415,6.855c-0.18,0.287-0.074,0.686,0.217,0.861
	c0.298,0.188,0.683,0.108,0.86-0.178c1.104-1.786,2.14-5.83-1.793-8.543c-1.49-1.045-2.955-1.443-4.377-1.176
	c-2.297,0.427-3.577,2.471-3.629,2.561c-0.162,0.267-0.088,0.616,0.16,0.815L246.538,265.78z"/>
<path fill="#FF4A3D" d="M252.448,267.934c0.35-0.458,0.248-1.124-0.226-1.487c-0.472-0.361-1.14-0.291-1.492,0.164
	c-0.352,0.454-0.256,1.125,0.222,1.489C251.427,268.466,252.098,268.392,252.448,267.934"/>
<path fill="#FF4A3D" d="M256.176,272.578c0.261,0.144,0.58,0.058,0.716-0.191c0.006-0.015,0.806-1.446,2.277-1.79
	c0.888-0.208,1.855,0.023,2.891,0.684c3.388,2.17,1.511,5.538,1.425,5.689c-0.139,0.246-0.036,0.576,0.212,0.712
	c0.257,0.148,0.578,0.067,0.716-0.179c0.863-1.532,1.588-4.956-1.803-7.088c-1.285-0.823-2.527-1.101-3.708-0.828
	c-1.909,0.442-2.904,2.199-2.944,2.276c-0.126,0.229-0.053,0.52,0.163,0.677L256.176,272.578z"/>
<path fill="#FF4A3D" d="M261.201,274.166c0.275-0.395,0.168-0.95-0.24-1.236c-0.409-0.285-0.966-0.203-1.244,0.19
	c-0.28,0.393-0.173,0.951,0.237,1.239C260.366,274.648,260.926,274.561,261.201,274.166"/>
<path fill="#FF4A3D" d="M263.818,278.026c0.213,0.119,0.477,0.047,0.588-0.157c0.006-0.012,0.664-1.191,1.876-1.474
	c0.73-0.172,1.527,0.019,2.38,0.563c2.79,1.787,1.244,4.56,1.175,4.685c-0.115,0.203-0.031,0.474,0.173,0.586
	c0.212,0.122,0.477,0.055,0.59-0.147c0.711-1.262,1.309-4.081-1.484-5.837c-1.058-0.677-2.081-0.906-3.053-0.681
	c-1.572,0.364-2.392,1.811-2.425,1.874c-0.104,0.188-0.044,0.428,0.134,0.558L263.818,278.026z"/>
<path fill="#FF4A3D" d="M267.955,279.334c0.227-0.325,0.139-0.782-0.198-1.018c-0.337-0.234-0.796-0.167-1.024,0.157
	c-0.23,0.324-0.143,0.783,0.196,1.021C267.268,279.731,267.729,279.66,267.955,279.334"/>
<path fill="#FF4A3D" d="M270.02,282.896c0.188,0.104,0.42,0.042,0.518-0.138c0.005-0.011,0.584-1.047,1.65-1.296
	c0.643-0.151,1.344,0.017,2.094,0.496c2.454,1.572,1.095,4.011,1.033,4.121c-0.102,0.179-0.027,0.417,0.152,0.516
	c0.187,0.107,0.419,0.048,0.519-0.13c0.626-1.11,1.151-3.589-1.306-5.135c-0.931-0.596-1.831-0.797-2.686-0.599
	c-1.383,0.32-2.104,1.593-2.133,1.648c-0.092,0.166-0.039,0.376,0.117,0.491L270.02,282.896z"/>
<path fill="#FF4A3D" d="M273.66,284.046c0.199-0.286,0.122-0.688-0.175-0.896c-0.296-0.206-0.7-0.146-0.901,0.138
	c-0.202,0.286-0.125,0.689,0.173,0.898C273.055,284.396,273.461,284.333,273.66,284.046"/>
<g>
	<path fill="#FF4A3D" d="M100.374,260.025c11.233-4.085,10.146,11.658-1.713,9.468c-3.694-0.683-6.381-3.161-6.781-7.418
		c-0.678-7.201,3.545-10.286,6.83-11.927c7.279-3.638,18.546-3.515,22.354,7.326c5.527,15.732-11.479,28.769-11.479,28.769h15.163
		l4.11-6.377l4.682-17.097c0,0-2.618-6.47-4.379-9.217c-3.966-6.182-12.239-16.019-24.112-14.645
		c-17.147,1.985-23.443,20.625-17.207,30.403c6.237,9.779,20.101,8.422,25.345-0.365c5.349-9.481-3.977-18.778-12.764-15.376
		c-7.492,2.899-7.073,10.493-3.372,12.929c1.78,1.171,3.826,1.042,4.565,0.931c2.283-0.345,3.928-2.186,3.713-4.327
		C105.048,260.268,100.374,260.025,100.374,260.025"/>
	<path fill="#FF4A3D" d="M119.647,286.952l17.184,3.611c0,0,1.519-7.396,1.519-7.963s-1.373-4.045-5.097-1.652
		c-0.863,0.554-2.023-0.457-0.852-4.058c1.984-6.094,17.715-21.4,31.038-18.424c13.323,2.977,15.278,21.06,2.42,25.992
		c-4.182,1.321-7.988,0.926-10.792-0.612c-0.768-0.422-5.147-3.938-2.989-9.272c1.097-2.711,5.589-4.935,5.589-4.648
		c0,0.425-0.705,8.984,7.927,7.31c4.819-1.134,5.097-10.559-4.4-13.109c-9.494-2.551-14.291,6.339-14.291,6.339
		c-4.394,7.936-0.245,20.862,12.79,21.479c12.164,0.189,15.793-5.842,21.177-12.219c5.387-6.377,7.229-9.354,11.057-9.637
		c12.49,0.014,10.424-10.683,10.424-10.683s-7.173,6.807-19.495,0.196c-6.944-3.401-12.188-15.023-29.903-10.914
		c-17.715,4.11-24.659,15.448-24.659,15.448L119.647,286.952z"/>
	<g>
		<path fill="#FF4A3D" d="M146.844,242.701c-0.959,0.297-2.717,1.193-4.594,3.88c-2.81,4.023-7.726,3.501-7.458,1.828
			c0.406-2.543,4.072-15.046,4.072-15.046s2.383,1.8,2.112,4.727c-0.271,2.929-0.232,3.638-0.232,3.638s2.661-1.948,6.033,0.229
			C147.041,242.125,147.322,242.553,146.844,242.701z"/>
		<path fill="#FF4A3D" d="M127.444,237.9c0.709,0.711,1.848,2.323,2.254,5.575c0.61,4.87,5.202,6.7,5.746,5.096
			c0.827-2.439,3.413-15.209,3.413-15.209s-2.947,0.481-4.072,3.197c-1.126,2.716-1.491,3.326-1.491,3.326s-1.446-2.964-5.443-2.611
			C127.536,237.3,127.09,237.547,127.444,237.9z"/>
	</g>
	<g>
		<path fill="#FF4A3D" d="M85.878,232.252c5.27,2.978,15.255,4.275,16.6,4.987c-6.177,1.15-10.508,4.204-12.505,6.248
			c-1.466-0.741-5.989-2.852-11.084-5.69C80.915,235.7,83.315,233.86,85.878,232.252z"/>
		<path fill="#FF4A3D" d="M69.848,219.319c-2.673-2.355-0.93-6.918,0.314-7.4c-4.795,1.503-5.608,6.423,0.87,11.184
			c0.5,0.368,1.054,0.756,1.644,1.158c-2.255,1.665-4.3,3.466-6.121,5.417c-1.973-1.632-3.649-3.305-4.787-4.961
			c-6.235-9.069-0.473-17.998,8.314-17.713s11.001,9.052,7.953,11.843C75.808,220.888,72.335,221.512,69.848,219.319z"/>
	</g>
	<path fill="#FF4A3D" d="M58.062,253.042c2.35-13.695,9.242-23.552,21.828-30.456c7.543-3.65,16.651-6.967,19.081-7.834
		c3.523,1.894,7.226,3.766,11.132,5.6c-5.345,1.091-38.991,8.817-39.775,30.604c-0.85,23.667,12.09,28.749,15.632,29.174
		c3.544,0.426,0.1,3.544-3.302,4.394c-3.4,0.852-4.535,0.852-4.535,0.852s0.503,5.332-0.49,7.032
		c-0.992,1.701-8.721-3.489-8.721-3.489s-2.269,4.108-6.378,5.667c-4.111,1.56-0.846-1.574-1.129-6.676
		C61.121,282.808,54.658,269.088,58.062,253.042z"/>
	<circle fill="#FF4A3D" cx="162.894" cy="272.337" r="6.08"/>
	<path fill="#FF4A3D" d="M123.865,282.378l-6.402-4.214c0,0-4.943,6.078-12.317,10.616c-7.374,4.539-5.592,9.077,2.998,4.701
		c8.591-4.376,15.803-4.458,23.096-1.783c7.294,2.674,18.882,3.404,17.018,0.892c-1.863-2.513-8.59-5.917-10.292-10.292
		c-1.702-4.375-7.293,3.728-11.021,3.485c-3.728-0.243-3.079-3.08-3.079-3.08"/>
	<path fill="#FF4A3D" d="M127.839,285.659c0-0.361,0.796-6.011,1.014-6.301s5.287-6.012,5.287-6.012s-3.114,9.562-0.724,6.447
		c2.391-3.115,7.605-6.375,7.171-0.362c-0.435,6.012,2.246,8.837,5.216,11.01c2.97,2.173-12.024-1.304-12.387-1.666
		S127.839,285.659,127.839,285.659z"/>
	<path fill="#FF4A3D" d="M128.7,276.48l3.897,2.355c0,0,0.77-5.567,5.738-10.106c4.968-4.54-7.023-1.627-7.451-0.814
		C130.456,268.729,128.7,276.48,128.7,276.48z"/>
	<path fill="#FF4A3D" d="M215.583,293.011c-10.438,4.927-24.171-4.579-27.456-7.067c-1.818-1.377-5.171-1.675-7.805-1.668
		c0.313-0.376,0.625-0.754,0.934-1.131c0.493-0.6,0.992-1.208,1.509-1.819c0.802-0.948,1.524-1.822,2.188-2.623
		c3.711-4.484,5.015-5.948,7.076-6.134c0.129,0,0.248-0.014,0.376-0.016c0.516,3.501,1.899,8.863,10.575,13.061
		c6.663,3.694,16.74,0.206,14.345-6.419c-1.72-5.066-6.518-4.566-8.367-2.817c-1.291,1.222-0.942,3.112-0.942,3.112
		s2.801-4.551,5.797-0.614c2.035,2.674-1.301,5.789-4.869,5.388c-4.271-0.479-7.104-5.388-4.23-10.097
		c3.584-4.896,10.307-5.067,13.815-1.654c3.586,3.489,4.03,5.714,4.345,7.201C223.885,284.524,222.404,290.101,215.583,293.011z"/>
</g>
<path fill="#FF4A3D" d="M255.684,295.423c-34.087-26.318-61.304-53.998-63.607-56.767c-3.863,0.154-31.723,0.537-73.108-17.288
	c-46.909-20.203-68.523-46.338-74.272-54.242v128.297h-1.749V164.31c0-0.392,0.262-0.736,0.639-0.842
	c0.375-0.109,0.779,0.053,0.983,0.388c0.193,0.32,20.001,32.18,75.092,55.906c44.008,18.953,72.465,17.147,72.749,17.128
	c0.28-0.02,0.566,0.1,0.747,0.325c0.161,0.202,27.989,29.587,65.395,58.208H255.684z"/>
<path fill="#FF4A3D" d="M266.988,295.423c-38.803-28.929-68.657-62.013-68.816-62.209l-2.402-3.004l-3.829,0.28
	c-0.2,0.019-26.72,1.907-69.741-16.622c-41.875-18.033-73.897-59.495-85.67-76.392v157.295c0,0.227-0.037,0.442-0.092,0.652h-5.062
	c-0.054-0.21-0.092-0.426-0.092-0.652V128.804c0-1.171,0.776-2.201,1.903-2.521c1.126-0.32,2.33,0.143,2.949,1.14
	c0.369,0.596,37.553,59.842,88.137,81.627c41.303,17.788,67.019,16.227,67.275,16.208l5.215-0.382
	c0.869-0.049,1.701,0.303,2.24,0.978l3.26,4.076c0.149,0.185,30.618,33.437,67.753,61.212c0.516,0.385,1.041,0.758,1.55,1.153
	c1.546,1.201,2.848,2.234,3.944,3.128H266.988z"/>
</svg>
