<?xml version="1.0" encoding="utf-8"?>
<!-- Generator: Adobe Illustrator 15.1.0, SVG Export Plug-In . SVG Version: 6.00 Build 0)  -->
<!DOCTYPE svg PUBLIC "-//W3C//DTD SVG 1.1//EN" "http://www.w3.org/Graphics/SVG/1.1/DTD/svg11.dtd">
<svg version="1.1" id="Layer_1" xmlns="http://www.w3.org/2000/svg" xmlns:xlink="http://www.w3.org/1999/xlink" x="0px" y="0px"
	 width="22.746px" height="48.56px" viewBox="5.055 2.978 22.746 48.56" enable-background="new 5.055 2.978 22.746 48.56"
	 xml:space="preserve">
<polygon fill="#0F4A61" points="6.101,3.53 6.101,19.748 12.353,26.49 6.101,33.661 6.101,50.125 27.101,26.326 "/>
</svg>
