<?xml version="1.0" encoding="utf-8"?>
<!-- Generator: Adobe Illustrator 15.1.0, SVG Export Plug-In . SVG Version: 6.00 Build 0)  -->
<!DOCTYPE svg PUBLIC "-//W3C//DTD SVG 1.1//EN" "http://www.w3.org/Graphics/SVG/1.1/DTD/svg11.dtd">
<svg version="1.1" id="Layer_1" xmlns="http://www.w3.org/2000/svg" xmlns:xlink="http://www.w3.org/1999/xlink" x="0px" y="0px"
	 width="235.093px" height="260.599px" viewBox="0 0 235.093 260.599" enable-background="new 0 0 235.093 260.599"
	 xml:space="preserve">
<rect x="152.598" y="161.962" fill="#FFB85E" width="54.012" height="78.049"/>
<polygon fill="#079E8F" points="152.598,240.012 152.598,16.93 95.395,80.179 95.395,240.012 "/>
<rect x="38.19" y="111.011" fill="#FF4A3D" width="57.204" height="129.001"/>
</svg>
