<?xml version="1.0" encoding="utf-8"?>
<!-- Generator: Adobe Illustrator 15.1.0, SVG Export Plug-In . SVG Version: 6.00 Build 0)  -->
<!DOCTYPE svg PUBLIC "-//W3C//DTD SVG 1.1//EN" "http://www.w3.org/Graphics/SVG/1.1/DTD/svg11.dtd">
<svg version="1.1" id="Layer_1" xmlns="http://www.w3.org/2000/svg" xmlns:xlink="http://www.w3.org/1999/xlink" x="0px" y="0px"
	 width="146.667px" height="51.847px" viewBox="0 0 146.667 51.847" enable-background="new 0 0 146.667 51.847"
	 xml:space="preserve">
<g>
	<g>
		<path fill="#0F4B60" d="M65.493,31.159v-4.585h-3.682l-0.052,1.682c-0.03,0.913-0.112,1.62-0.246,2.121
			c-0.135,0.503-0.367,0.762-0.696,0.783h-0.254l-0.008,1.795h0.696l0.008-1.144h4.308v1.144h0.697v-1.795H65.493z M62.418,28.323
			l0.037-1.101h2.297v3.937h-2.956c0.205-0.186,0.353-0.518,0.445-1.003C62.334,29.672,62.393,29.062,62.418,28.323 M71.043,26.573
			v2.25h-3.007v-2.25h-0.749v5.237h0.749v-2.334h3.007v2.334h0.748v-5.237H71.043z M73.423,31.81h0.688l3.104-4.033v4.033h0.733
			v-5.237H77.26l-3.097,4.039v-4.039h-0.74V31.81z M87.163,31.81v-5.237h-0.618l-2.155,3.68l-2.184-3.68h-0.615v5.237h0.719v-3.794
			l1.894,3.157h0.343l1.897-3.179v3.816H87.163z M91.153,31.87c0.523,0,0.997-0.115,1.421-0.348
			c0.423-0.232,0.756-0.552,0.996-0.959c0.239-0.406,0.358-0.862,0.358-1.372c0-0.508-0.12-0.966-0.358-1.373
			c-0.239-0.406-0.572-0.727-0.996-0.957c-0.424-0.232-0.898-0.348-1.421-0.348c-0.529,0-1.005,0.116-1.428,0.348
			c-0.425,0.23-0.757,0.553-1,0.96c-0.243,0.41-0.362,0.866-0.362,1.369c0,0.503,0.119,0.96,0.362,1.369
			c0.243,0.408,0.575,0.729,1,0.962C90.148,31.755,90.625,31.87,91.153,31.87 M91.153,31.204c-0.385,0-0.733-0.087-1.044-0.263
			c-0.312-0.174-0.556-0.417-0.734-0.72c-0.176-0.308-0.265-0.651-0.265-1.03c0-0.378,0.089-0.721,0.265-1.028
			c0.178-0.306,0.422-0.549,0.734-0.722c0.311-0.175,0.659-0.262,1.044-0.262c0.384,0,0.729,0.087,1.036,0.262
			c0.308,0.173,0.549,0.416,0.726,0.722c0.178,0.307,0.265,0.65,0.265,1.028c0,0.379-0.087,0.723-0.265,1.03
			c-0.177,0.304-0.418,0.546-0.726,0.72C91.882,31.117,91.537,31.204,91.153,31.204 M97.482,31.87c0.409,0,0.784-0.07,1.126-0.209
			c0.341-0.14,0.631-0.345,0.872-0.614l-0.487-0.471c-0.399,0.419-0.89,0.629-1.473,0.629c-0.39,0-0.741-0.087-1.055-0.263
			c-0.316-0.174-0.561-0.417-0.738-0.72c-0.176-0.308-0.265-0.651-0.265-1.03c0-0.378,0.088-0.721,0.265-1.028
			c0.177-0.306,0.422-0.549,0.738-0.722c0.313-0.175,0.665-0.262,1.055-0.262c0.586,0,1.079,0.208,1.473,0.62l0.487-0.471
			c-0.241-0.269-0.529-0.471-0.869-0.608c-0.34-0.138-0.713-0.206-1.123-0.206c-0.524,0-0.997,0.116-1.42,0.348
			c-0.425,0.23-0.756,0.551-0.995,0.957c-0.239,0.406-0.358,0.864-0.358,1.373c0,0.51,0.119,0.966,0.358,1.372
			c0.239,0.407,0.569,0.727,0.991,0.959C96.486,31.755,96.958,31.87,97.482,31.87 M104.036,31.81h0.853l-1.96-2.701l1.871-2.536
			h-0.801l-1.646,2.274h-1.106v-2.274h-0.733v5.237h0.733v-2.304h1.092L104.036,31.81z M108.002,31.87
			c0.521,0,0.996-0.115,1.42-0.348c0.424-0.232,0.755-0.552,0.995-0.959c0.24-0.406,0.36-0.862,0.36-1.372
			c0-0.508-0.12-0.966-0.36-1.373c-0.239-0.406-0.571-0.727-0.995-0.957c-0.425-0.232-0.899-0.348-1.42-0.348
			c-0.531,0-1.007,0.116-1.43,0.348c-0.425,0.23-0.758,0.553-1,0.96c-0.241,0.41-0.362,0.866-0.362,1.369
			c0,0.503,0.121,0.96,0.362,1.369c0.242,0.408,0.575,0.729,1,0.962C106.995,31.755,107.472,31.87,108.002,31.87 M108.002,31.204
			c-0.386,0-0.733-0.087-1.045-0.263c-0.313-0.174-0.556-0.417-0.734-0.72c-0.176-0.308-0.265-0.651-0.265-1.03
			c0-0.378,0.088-0.721,0.265-1.028c0.179-0.306,0.422-0.549,0.734-0.722c0.312-0.175,0.659-0.262,1.045-0.262
			c0.382,0,0.728,0.087,1.034,0.262c0.307,0.173,0.549,0.416,0.726,0.722c0.177,0.307,0.266,0.65,0.266,1.028
			c0,0.379-0.089,0.723-0.266,1.03c-0.177,0.304-0.419,0.546-0.726,0.72C108.73,31.117,108.384,31.204,108.002,31.204
			 M115.25,29.093c0.259-0.099,0.46-0.248,0.602-0.448c0.142-0.2,0.214-0.443,0.214-0.726c0-0.435-0.161-0.766-0.483-0.998
			c-0.322-0.233-0.769-0.348-1.342-0.348h-2.252v5.237h2.395c0.632,0,1.115-0.125,1.447-0.375c0.331-0.25,0.498-0.602,0.498-1.055
			c0-0.339-0.092-0.618-0.273-0.834C115.872,29.329,115.604,29.178,115.25,29.093 M112.729,27.164h1.459
			c0.358,0,0.636,0.075,0.83,0.221c0.195,0.146,0.292,0.36,0.292,0.639s-0.096,0.491-0.288,0.636
			c-0.193,0.144-0.47,0.216-0.834,0.216h-1.459V27.164z M114.368,31.218h-1.639v-1.773h1.639c0.398,0,0.698,0.073,0.9,0.212
			c0.202,0.144,0.306,0.364,0.306,0.665C115.574,30.918,115.17,31.218,114.368,31.218 M119.918,31.87
			c0.409,0,0.784-0.07,1.125-0.209c0.343-0.14,0.633-0.345,0.873-0.614l-0.487-0.471c-0.398,0.419-0.889,0.629-1.473,0.629
			c-0.39,0-0.741-0.087-1.055-0.263c-0.314-0.174-0.561-0.417-0.738-0.72c-0.178-0.308-0.265-0.651-0.265-1.03
			c0-0.378,0.087-0.721,0.265-1.028c0.177-0.306,0.424-0.549,0.738-0.722c0.314-0.175,0.666-0.262,1.055-0.262
			c0.588,0,1.079,0.208,1.473,0.62l0.487-0.471c-0.24-0.269-0.529-0.471-0.868-0.608c-0.34-0.138-0.714-0.206-1.123-0.206
			c-0.524,0-0.998,0.116-1.421,0.348c-0.425,0.23-0.755,0.551-0.995,0.957c-0.239,0.406-0.358,0.864-0.358,1.373
			c0,0.51,0.119,0.966,0.358,1.372c0.24,0.407,0.57,0.727,0.991,0.959C118.922,31.755,119.396,31.87,119.918,31.87 M126.471,31.81
			h0.853l-1.959-2.701l1.87-2.536h-0.8l-1.646,2.274h-1.108v-2.274h-0.733v5.237h0.733v-2.304h1.093L126.471,31.81z M130.438,31.87
			c0.523,0,0.998-0.115,1.421-0.348c0.423-0.232,0.756-0.552,0.995-0.959c0.239-0.406,0.359-0.862,0.359-1.372
			c0-0.508-0.12-0.966-0.359-1.373c-0.239-0.406-0.572-0.727-0.995-0.957c-0.424-0.232-0.898-0.348-1.421-0.348
			c-0.528,0-1.005,0.116-1.429,0.348c-0.424,0.23-0.757,0.553-0.999,0.96c-0.241,0.41-0.362,0.866-0.362,1.369
			c0,0.503,0.121,0.96,0.362,1.369c0.242,0.408,0.575,0.729,0.999,0.962C129.432,31.755,129.909,31.87,130.438,31.87
			 M130.438,31.204c-0.385,0-0.732-0.087-1.044-0.263c-0.313-0.174-0.556-0.417-0.733-0.72c-0.177-0.308-0.266-0.651-0.266-1.03
			c0-0.378,0.088-0.721,0.266-1.028c0.178-0.306,0.421-0.549,0.733-0.722c0.312-0.175,0.659-0.262,1.044-0.262
			c0.384,0,0.729,0.087,1.035,0.262c0.307,0.173,0.549,0.416,0.726,0.722c0.178,0.307,0.267,0.65,0.267,1.028
			c0,0.379-0.089,0.723-0.267,1.03c-0.177,0.304-0.419,0.546-0.726,0.72C131.166,31.117,130.821,31.204,130.438,31.204
			 M134.423,31.81h0.688l3.106-4.033v4.033h0.732v-5.237h-0.688l-3.097,4.039v-4.039h-0.741V31.81z M136.676,26.205
			c0.404,0,0.717-0.09,0.939-0.269c0.221-0.18,0.336-0.431,0.341-0.755h-0.525c-0.005,0.195-0.076,0.345-0.212,0.454
			c-0.137,0.106-0.319,0.161-0.543,0.161c-0.235,0-0.416-0.055-0.549-0.161c-0.132-0.108-0.201-0.258-0.206-0.454h-0.531
			c0.005,0.33,0.119,0.583,0.34,0.759C135.952,26.116,136.267,26.205,136.676,26.205"/>
	</g>
	<polygon fill="#0F4B60" points="65.17,44.1 66.288,44.1 63.718,40.561 66.17,37.235 65.121,37.235 62.963,40.216 61.511,40.216 
		61.511,37.235 60.55,37.235 60.55,44.1 61.511,44.1 61.511,41.081 62.943,41.081 	"/>
	<path fill="#0F4B60" d="M73.25,38.87c-0.313-0.534-0.747-0.953-1.305-1.256c-0.556-0.304-1.176-0.457-1.862-0.457
		c-0.694,0-1.317,0.153-1.874,0.457c-0.557,0.304-0.992,0.724-1.308,1.26c-0.318,0.537-0.476,1.135-0.476,1.793
		c0,0.661,0.158,1.26,0.476,1.795c0.316,0.536,0.751,0.958,1.308,1.26c0.557,0.305,1.18,0.458,1.874,0.458
		c0.686,0,1.306-0.152,1.862-0.458c0.558-0.302,0.991-0.723,1.305-1.255c0.315-0.533,0.471-1.133,0.471-1.8
		C73.72,40.001,73.564,39.401,73.25,38.87z M72.393,42.018c-0.232,0.399-0.549,0.716-0.95,0.945
		c-0.403,0.228-0.857,0.343-1.359,0.343c-0.504,0-0.959-0.116-1.368-0.343c-0.409-0.229-0.73-0.546-0.96-0.945
		c-0.233-0.403-0.35-0.853-0.35-1.351c0-0.496,0.116-0.945,0.35-1.347c0.23-0.401,0.551-0.718,0.96-0.947
		c0.409-0.229,0.864-0.343,1.368-0.343c0.502,0,0.956,0.115,1.359,0.343c0.401,0.229,0.718,0.546,0.95,0.947
		c0.232,0.402,0.348,0.851,0.348,1.347C72.74,41.165,72.625,41.615,72.393,42.018z"/>
	<polygon fill="#0F4B60" points="80.062,37.235 80.062,40.186 76.12,40.186 76.12,37.235 75.139,37.235 75.139,44.1 76.12,44.1 
		76.12,41.04 80.062,41.04 80.062,44.1 81.043,44.1 81.043,37.235 	"/>
	<polygon fill="#0F4B60" points="87.416,44.1 88.534,44.1 85.966,40.561 88.417,37.235 87.367,37.235 85.209,40.216 83.758,40.216 
		83.758,37.235 82.797,37.235 82.797,44.1 83.758,44.1 83.758,41.081 85.19,41.081 	"/>
	<path fill="#0F4B60" d="M94.647,37.235l-2.286,4.354l-2.226-4.354h-1.05l2.765,5.208l-0.156,0.245
		c-0.281,0.458-0.637,0.686-1.069,0.686c-0.188,0-0.405-0.042-0.647-0.127l-0.254,0.784c0.313,0.137,0.621,0.206,0.921,0.206
		c0.386,0,0.743-0.111,1.07-0.333c0.327-0.224,0.61-0.56,0.854-1.011l3.049-5.658H94.647z"/>
	<path fill="#0F4B60" d="M101.114,37.873c-0.508-0.426-1.209-0.638-2.098-0.638h-2.677V44.1h0.98v-2.079h1.697
		c0.888,0,1.589-0.213,2.098-0.638c0.511-0.425,0.767-1.011,0.767-1.755C101.88,38.882,101.625,38.298,101.114,37.873z
		 M100.408,40.771c-0.327,0.264-0.8,0.397-1.421,0.397h-1.668v-3.08h1.668c0.621,0,1.094,0.134,1.421,0.398
		c0.328,0.266,0.491,0.645,0.491,1.142S100.736,40.507,100.408,40.771z"/>
	<polygon fill="#0F4B60" points="104.116,43.247 104.116,41.03 107.558,41.03 107.558,40.196 104.116,40.196 104.116,38.087 
		107.979,38.087 107.979,37.235 103.135,37.235 103.135,44.1 108.117,44.1 108.117,43.247 	"/>
	<polygon fill="#0F4B60" points="114.581,37.235 114.581,40.186 110.637,40.186 110.637,37.235 109.656,37.235 109.656,44.1 
		110.637,44.1 110.637,41.04 114.581,41.04 114.581,44.1 115.561,44.1 115.561,37.235 	"/>
	<polygon fill="#0F4B60" points="123.17,43.247 123.17,37.235 122.199,37.235 122.199,43.247 118.375,43.247 118.375,37.235 
		117.403,37.235 117.403,44.1 123.317,44.1 123.317,45.659 124.229,45.659 124.229,43.247 	"/>
	<polygon fill="#0F4B60" points="125.256,44.1 126.158,44.1 130.228,38.815 130.228,44.1 131.189,44.1 131.189,37.235 
		130.288,37.235 126.227,42.53 126.227,37.235 125.256,37.235 	"/>
	<polygon fill="#0F4B60" points="132.998,44.1 133.9,44.1 137.971,38.815 137.971,44.1 138.932,44.1 138.932,37.235 138.03,37.235 
		133.969,42.53 133.969,37.235 132.998,37.235 	"/>
	<polygon fill="#089D8E" points="41.908,37.047 38.446,37.047 38.446,44.103 53.18,44.103 53.18,26.488 	"/>
	<polygon fill="#FF4B3E" points="35.562,37.047 23.708,28.511 23.708,44.103 38.446,44.103 38.446,37.047 	"/>
	<polygon fill="#FFB85F" points="37.918,29.741 38.446,29.741 38.446,14.791 23.708,14.791 23.708,19.509 	"/>
	<polygon fill="#53AFE2" points="39.028,29.741 53.18,16.489 53.18,9.492 38.446,9.492 38.446,29.741 	"/>
	<polygon fill="#0F4B60" points="67.825,2.776 39.028,29.741 37.918,29.741 17.603,15.112 9.099,23.083 9.099,28.307 17.921,20.038 
		36.689,33.553 40.527,33.553 67.825,7.983 	"/>
</g>
</svg>
