<?xml version="1.0" encoding="utf-8"?>
<!-- Generator: Adobe Illustrator 17.1.0, SVG Export Plug-In . SVG Version: 6.00 Build 0)  -->
<!DOCTYPE svg PUBLIC "-//W3C//DTD SVG 1.1//EN" "http://www.w3.org/Graphics/SVG/1.1/DTD/svg11.dtd">
<svg version="1.1" id="Layer_1" xmlns="http://www.w3.org/2000/svg" xmlns:xlink="http://www.w3.org/1999/xlink" x="0px" y="0px"
	 viewBox="0 0 77.6 53.8" enable-background="new 0 0 77.6 53.8" xml:space="preserve">
<g>
	<defs>
		<rect id="SVGID_1_" y="0" width="77.6" height="53.8"/>
	</defs>
	<clipPath id="SVGID_2_">
		<use xlink:href="#SVGID_1_"  overflow="visible"/>
	</clipPath>
	<path clip-path="url(#SVGID_2_)" fill="#FF4A3D" d="M4.8,0C4.8,0,0,0,0,4.8v44.3c0,0,0,4.8,4.8,4.8h68.1c0,0,4.8,0,4.8-4.8V4.8
		c0,0,0-4.8-4.8-4.8H4.8z"/>
</g>
<polygon fill="#FFFFFF" points="51.9,26.5 34.8,7.9 34.8,21.2 39.9,26.6 34.8,32.5 34.8,45.9 "/>
</svg>
