<?xml version="1.0" encoding="utf-8"?>
<!-- Generator: Adobe Illustrator 15.1.0, SVG Export Plug-In . SVG Version: 6.00 Build 0)  -->
<!DOCTYPE svg PUBLIC "-//W3C//DTD SVG 1.1//EN" "http://www.w3.org/Graphics/SVG/1.1/DTD/svg11.dtd">
<svg version="1.1" id="Layer_1" xmlns="http://www.w3.org/2000/svg" xmlns:xlink="http://www.w3.org/1999/xlink" x="0px" y="0px"
	 width="733.605px" height="376.696px" viewBox="0 -116.098 733.605 376.696" enable-background="new 0 -116.098 733.605 376.696"
	 xml:space="preserve">
<g>
	<g opacity="0.13">
		<g>
			<polygon fill="#53AEE1" points="715.269,-81.741 575.385,-81.741 493.748,1.581 416.084,-30.156 329.437,55.711 246.847,19.054 
				119.596,126.516 11.554,126.516 11.554,233.459 133.17,233.459 133.525,233.874 134.016,233.459 136.004,233.459 
				136.004,231.776 262.021,125.371 349.346,164.12 437.385,76.871 510.396,106.705 715.708,-81.213 			"/>
		</g>
	</g>
</g>
</svg>
