<?xml version="1.0" encoding="utf-8"?>
<!-- Generator: Adobe Illustrator 15.1.0, SVG Export Plug-In . SVG Version: 6.00 Build 0)  -->
<!DOCTYPE svg PUBLIC "-//W3C//DTD SVG 1.1//EN" "http://www.w3.org/Graphics/SVG/1.1/DTD/svg11.dtd">
<svg version="1.1" id="Layer_1" xmlns="http://www.w3.org/2000/svg" xmlns:xlink="http://www.w3.org/1999/xlink" x="0px" y="0px"
	 width="181.782px" height="197.718px" viewBox="-25.163 -4.67 181.782 197.718"
	 enable-background="new -25.163 -4.67 181.782 197.718" xml:space="preserve">
<g>
	<path fill="#CBE7F6" d="M65.488,180.924c49.512,0,89.649-40.133,89.649-89.648c0-49.508-40.137-89.648-89.649-89.648
		s-89.649,40.141-89.649,89.648C-24.162,140.791,15.975,180.924,65.488,180.924"/>
	<path fill="#FF4A3D" d="M91.31,34.932C60.307,22.573,24.545,36.033,9.674,66.518c-3.957,8.117-6.047,16.664-6.449,25.148
		l18.496-0.805c0.465-5.508,1.922-11.016,4.488-16.273C37.338,51.76,64.87,42.276,87.698,53.408
		c0.004,0.008,0.011,0.016,0.015,0.023L91.31,34.932z"/>
</g>
<polygon fill="#FF4A3D" points="62.37,-5.167 62.37,22.664 78.054,40.738 102.399,40.738 "/>
<polygon fill="#FF4A3D" points="102.399,40.738 78.054,40.738 62.37,58.811 62.37,86.642 "/>
<g>
	<path fill="#0F4B60" d="M42.311,153.127c31.003,12.359,66.766-1.102,81.637-31.586c3.957-8.117,6.047-16.664,6.448-25.148
		L111.9,97.198c-0.465,5.508-1.922,11.016-4.487,16.273c-11.129,22.828-38.661,32.313-61.489,21.18
		c-0.004-0.008-0.011-0.016-0.015-0.023L42.311,153.127z"/>
</g>
<polygon fill="#079E8F" points="71.252,193.229 71.252,165.398 55.568,147.324 31.222,147.324 "/>
<polygon fill="#079E8F" points="31.222,147.324 55.568,147.324 71.252,129.252 71.252,101.42 "/>
</svg>
