<?xml version="1.0" encoding="utf-8"?>
<!-- Generator: Adobe Illustrator 15.1.0, SVG Export Plug-In . SVG Version: 6.00 Build 0)  -->
<!DOCTYPE svg PUBLIC "-//W3C//DTD SVG 1.1//EN" "http://www.w3.org/Graphics/SVG/1.1/DTD/svg11.dtd">
<svg version="1.1" id="Layer_1" xmlns="http://www.w3.org/2000/svg" xmlns:xlink="http://www.w3.org/1999/xlink" x="0px" y="0px"
	 width="467.977px" height="370.481px" viewBox="0 0 467.977 370.481" enable-background="new 0 0 467.977 370.481"
	 xml:space="preserve">
<g>
	<rect x="166.894" y="229.9" fill="#079D8E" width="84" height="84"/>
	<polygon fill="#0F4B60" points="388.957,167.9 379.736,167.9 352.104,167.9 336.519,167.9 327.299,167.9 172.894,295.608 
		182.115,295.608 197.702,295.608 225.33,295.608 234.551,295.608 250.138,295.608 404.545,167.9 	"/>
	<path fill="#FFB75E" d="M123.276,187.864c0,0-12.692,2.463-16.328,3.355c-3.637,0.892-9.345,3.833-6.305,3.615
		c3.04-0.217,7.976-1.812,7.976-1.812s-4.226,2.405-5.855,2.987c-1.629,0.581-4.613,3.533-3.195,3.408
		c1.417-0.125,7.746-3.457,7.922-2.8c0.176,0.658-4.434,3.283-6.243,4.114c-1.81,0.832-3.501,2.242-1.333,2.236
		c2.168-0.006,10.717-5.433,10.069-3.998c-0.646,1.436-6.494,3.935-6.613,4.685c-0.118,0.75,1.698,0.758,3.802-0.167
		c2.104-0.925,9.359-6.136,9.27-4.683c-0.091,1.454-3.017,3.158-3.541,4.263c-0.525,1.105,0.477,1.403,1.844,0.711
		c1.368-0.692,4.558-3.612,5.505-5.629c0.948-2.016,2.437-4.787,3.326-5.555c0.892-0.767,2.263-2.367,2.263-2.367L123.276,187.864z"
		/>
	<path fill="#0F4B60" d="M263.347,280.357c0.343-0.086,9.596-2.742,11.48-0.429s2.484,13.879,1.627,19.19
		c-0.856,5.313,0.515,17.478-2.998,18.507s-4.369-10.709-5.568-15.935c-1.2-5.227-7.282-10.453-7.282-10.453L263.347,280.357z"/>
	<path fill="#0F4B60" d="M159.962,294.726c0,0,5.488,7.623,6.631,10.213c1.145,2.593,0.383,8.005-3.733,11.282
		c-4.117,3.277-18.294,15.016-19.742,14.635s-1.296-4.115,1.144-8.385c2.438-4.268,6.631-13.949,6.783-16.541
		c0.152-2.591,0-6.173,0-6.173L159.962,294.726z"/>
	<path fill="#54AFE2" d="M219.161,205.938c0,1.015-8.319,48.089-8.319,58.64s-11.16,10.754,4.667,11.361
		c15.826,0.609,49.509-0.607,49.509,0c0,0.609,0.202,14.408-1.015,17.451c-1.218,3.043-42.61,2.029-53.161,1.623
		s-20.492-13.594-21.507-21.101c-1.015-7.508-3.45-40.379-3.45-40.379s-24.348,4.465-33.479,8.522
		c-9.13,4.058-14.609,12.174-10.348,17.651c4.261,5.479,21.711,36.726,21.711,36.726s-8.929,6.695-12.986,7.912
		c-4.059,1.218-31.044-43.217-32.464-51.74c-1.421-8.521,1.623-15.217,7.507-20.289s39.769-25.566,46.059-30.233
		C178.174,197.416,219.161,205.938,219.161,205.938"/>
	<path fill="#FFB75E" d="M205.208,120.916c0,0-4.573-10.102-2.871-12.867c1.7-2.765,7.55-7.87,5.529-11.166
		c-2.021-3.297-6.594-0.851-6.594-0.851s3.829-7.551-0.957-12.123c-4.785-4.573-14.037-3.722-15.951-0.744
		c-1.914,2.977-4.892,18.078-4.679,22.225c0.212,4.147,3.19,7.125,5.529,7.869c2.34,0.745,3.51,1.064,3.51,1.383
		c0,0.319-1.17,10.527-1.595,11.059c-0.427,0.532-1.489,3.297,4.146,3.616C196.912,129.636,202.974,129.636,205.208,120.916"/>
	<path fill="#079D8E" d="M231.58,131.273c0,0,12.917-25.009,18.551-32.979c5.635-7.971,12.505-20.75,12.505-20.75l-9.069-6.596
		c0,0-11.817,23.36-25.696,33.941s-23.361,15.803-23.361,15.803s-7.008,8.657-11.268,8.108c-4.26-0.55-5.359-3.848-5.359-3.848
		s-13.604,0-19.513,7.283c-5.909,7.283-20.75,33.667-28.583,40.95c-7.833,7.283-20.2,14.154-20.2,14.154l2.252,7.525
		c0,0,16.986-5.189,30.041-14.533c13.055-9.345,23.773-25.559,23.773-25.559s-5.36,29.956-6.871,35.178
		c-1.512,5.221-3.161,15.801,0.824,17.452c3.984,1.649,23.772,5.635,31.469,6.185c7.695,0.549,17.864-0.275,18.826-0.688
		c0.961-0.412,3.298-10.993,2.336-25.834C221.274,172.223,221.548,156.558,231.58,131.273"/>
	<path fill="#FFB75E" d="M254.247,72.724c0-0.211,2.68-3.877,1.34-7.332c-1.34-3.454-3.455-11.984-2.045-11.491
		c1.409,0.494,0.917,2.891,2.114,4.019c1.199,1.128,2.187-1.058,2.469-3.173c0.281-2.114,0.986-9.447,2.044-8.953
		c1.057,0.493,0.563,4.018,0.563,5.851s0.846,2.679,1.128,0.494c0.282-2.186,1.128-8.953,2.326-8.178
		c1.199,0.775,0.565,2.961,0.283,4.582c-0.283,1.622-0.988,5.923-0.142,4.513c0.846-1.411,1.974-7.896,2.961-7.121
		c0.986,0.776,0.141,3.808-0.282,5.217c-0.422,1.409-1.763,4.653-0.564,4.3c1.199-0.353,1.764-5.005,2.538-5.076
		c0.776-0.07,1.271,1.128,0.987,2.538c-0.282,1.411-2.82,8.671-4.089,10.575c-1.27,1.903-3.103,2.256-3.596,3.595
		s-2.961,8.107-3.03,8.319C259.181,75.614,254.247,72.724,254.247,72.724"/>
	<path fill="#0F4B60" d="M202.869,112.619c0,0,3.427-3.509,6.038-4.325s4.487-4.324,3.671-7.914
		c-0.815-3.59,0.408-5.711,1.714-8.077c1.306-2.367,2.366-6.772-2.773-9.22c-5.142-2.448-4.406-9.954-7.425-11.831
		c-3.02-1.876-4.324-0.244-9.303,1.388c-4.977,1.631-7.588-1.306-9.872-1.388c-2.284-0.081-9.057,2.774-6.363,7.344
		c2.691,4.568,4.079,6.527,4.079,6.527s0.326,1.631,2.284,0c1.958-1.632,6.772-4.651,11.261-2.448
		c4.486,2.203,6.281,8.241,4.976,10.852c-1.305,2.611-1.223,4.079,0.082,3.263c1.306-0.816,8.159-2.856,6.854,2.366
		c-1.307,5.222-5.994,4.345-6.239,6.467C201.607,107.744,202.869,112.619,202.869,112.619"/>
	<path fill="#0F4B60" d="M206.156,87.526l-4.564,6.787c0,0-0.818-8.659-4.68-7.84c-3.862,0.819-3.277-0.585-5.266-1.638
		c-1.99-1.054-2.342,2.106-5.149,0.702c-2.81-1.405-4.798-4.447-1.404-6.202c3.394-1.755,14.979-0.117,16.148,1.053
		S206.156,87.526,206.156,87.526"/>
	<path fill="#0F4B60" d="M195.883,96.457c0,0-0.097-1.343-1.056-1.824c-0.961-0.48-1.969-0.24-1.969-0.24s-0.24,0.432,0.672,0.768
		S195.883,96.457,195.883,96.457"/>
	<path fill="#0F4B60" d="M183.616,91.293c0,0,2.832,0.096,2.496,0.96c-0.337,0.864-1.057-0.145-2.017-0.096
		C183.135,92.206,182.799,91.198,183.616,91.293"/>
	<path fill="#FFFFFF" d="M190.888,103.282c0,0-5.57-0.919-6.891-1.896c-1.321-0.976-2.184-2.066-2.184-2.066s0.746,3.674,2.643,5.11
		C186.351,105.866,190.888,103.282,190.888,103.282"/>
</g>
</svg>
