<?xml version="1.0" encoding="utf-8"?>
<!-- Generator: Adobe Illustrator 15.1.0, SVG Export Plug-In . SVG Version: 6.00 Build 0)  -->
<!DOCTYPE svg PUBLIC "-//W3C//DTD SVG 1.1//EN" "http://www.w3.org/Graphics/SVG/1.1/DTD/svg11.dtd">
<svg version="1.1" id="Layer_1" xmlns="http://www.w3.org/2000/svg" xmlns:xlink="http://www.w3.org/1999/xlink" x="0px" y="0px"
	 width="991.45px" height="418.479px" viewBox="0 0 991.45 418.479" enable-background="new 0 0 991.45 418.479"
	 xml:space="preserve">
<polygon fill="#0F4B60" points="289.945,198.39 230.319,244.734 230.277,245.134 284.434,250.828 "/>
<rect x="188.884" y="136.4" fill="#079D8E" width="48.837" height="49.248"/>
<rect x="207.303" y="287.4" fill="#FFB75E" width="162.081" height="54.173"/>
<polygon fill="#FFB75E" points="274.797,164.562 328.971,164.562 328.971,25.4 274.797,77.452 "/>
<polygon fill="#53AEE1" points="504.206,336.648 504.206,287.4 759.384,287.4 712.064,336.648 "/>
<rect x="691.884" y="314.152" fill="#FF4A3D" width="48.837" height="49.248"/>
<polygon fill="#0F4B60" points="818.577,197.715 782.741,225.329 751.404,192.782 711.313,223.921 673.065,185.4 672.539,185.922 
	667.884,239.134 707.43,278.966 747.192,248.082 778.453,280.554 813.704,253.411 "/>
<polygon fill="#FF4A3D" points="672.795,169.816 748.844,168.854 662.39,82.4 623.884,120.905 "/>
<rect x="318.13" y="54.081" transform="matrix(-0.0523 -0.9986 0.9986 -0.0523 284.6515 522.7173)" fill="#FF4A3D" width="144.432" height="144.431"/>
<text transform="matrix(0.999 -0.0436 0.0436 0.999 346.5527 173.8667)" fill="#FFFFFF" font-family="'Montserrat-ExtraBold'" font-size="119.439">К</text>
<rect x="324.738" y="220.632" transform="matrix(-0.0523 -0.9986 0.9986 -0.0523 125.284 704.5844)" fill="#0F4B60" width="144.432" height="144.431"/>
<text transform="matrix(0.9986 -0.0523 0.0523 0.9986 351.2876 341.4458)" fill="#FFFFFF" font-family="'Montserrat-ExtraBold'" font-size="119.439">И</text>
<rect x="495.471" y="218.368" transform="matrix(0.0349 -0.9994 0.9994 0.0349 257.466 847.7835)" fill="#079D8E" width="144.432" height="144.433"/>
<text transform="matrix(0.9997 0.0262 -0.0262 0.9997 530.9873 329.1011)" fill="#FFFFFF" font-family="'Montserrat-ExtraBold'" font-size="119.439">З</text>
<rect x="514.976" y="56.496" transform="matrix(0.0349 -0.9994 0.9994 0.0349 438.0651 711.0537)" fill="#53AEE1" width="144.432" height="144.432"/>
<text transform="matrix(0.9994 0.0349 -0.0349 0.9994 540.3135 171.7417)" fill="#FFFFFF" font-family="'Montserrat-ExtraBold'" font-size="119.439">В</text>
<path fill="#FFB75E" d="M950.776,131.176c0,0,0.519-5.146-0.273-6.97c-0.793-1.825-4.673-7.005-4.763-9.15
	c-0.089-2.146,0.426-3.155,1.104-2.077c0.678,1.079,1.948,4.559,2.634,3.237c0.684-1.324-1.013-9.858-0.241-10.77
	c0.771-0.913,1.429-0.238,1.629,1.52c0.2,1.757,0.761,5.024,1.412,5.165c0.652,0.141-1.492-10.312,0.366-10.234
	s1.543,8.116,1.914,8.959c0.372,0.843,0.357-7.232,1.167-8.474c0.809-1.243,1.647-0.414,1.438,1.431
	c-0.21,1.845-1.488,8.371-0.361,8.433c1.129,0.062,1.371-4.982,2.242-5.616c0.873-0.635,1.588,0.114,0.949,3.378
	c-0.638,3.263-1.339,10.589-2.244,12.087c-0.904,1.499-1.563,9.631-1.563,9.631l-5.234-0.33"/>
<path fill="#FF4A3D" d="M881.073,351.708c0,0-1.893,6.464-5.753,11.034s-9.068,11.941-3.232,11.45
	c5.837-0.491,8.744-6.839,11.246-9.638c2.503-2.799,4.498-5.653,4.704-8.584c0.206-2.932-0.488-6.992-0.488-6.992l-6.039,2.266
	L881.073,351.708z"/>
<path fill="#FF4A3D" d="M867.312,329.255c0.343,0.039,5.137,3.836,2.861,6.479c-2.275,2.644-4.865,3.974-5.064,6.736
	c-0.197,2.764,0.901,10.438-4.926,12.676c-5.828,2.238-7.653-1.104-5.927-2.998c1.724-1.894,4.29-4.039,4.796-11.528
	c0.504-7.489-0.44-11.427-0.44-11.427L867.312,329.255z"/>
<path fill="#54AFE2" d="M868.72,237.962l-4.67,5.684c0,0-25.102,24.563-30.018,32.412c-4.916,7.849-4.238,16.336,3.19,28.151
	s21.718,30.81,21.718,30.81s9.843-4.545,9.945-5.447c0.104-0.902-13.796-23.327-14.486-34.922
	c-0.688-11.598,11.29-20.469,16.734-23.323c5.444-2.853,7.331-3.369,7.331-3.369s1.213,18.237,2.94,31.962
	c1.727,13.725,2.293,26.403,1.343,36.35c-0.95,9.947-3.377,16.801-3.377,16.801s7.532,2.869,9.848,0.208
	c2.314-2.662,12.08-30.615,11.715-43.455c-0.366-12.839,9.84-39.83,9.83-50.981c-0.008-11.152-4.029-22.397-6.706-26.176
	C901.38,228.886,868.72,237.962,868.72,237.962"/>
<path fill="#0F4B60" d="M856.638,348.489c0,0,0.864-0.114,1.68,0.191c0.813,0.307,2.135-0.554,1.244-1.132
	c-0.891-0.58-1.775-0.733-2.027-0.391C857.281,347.5,856.638,348.489,856.638,348.489"/>
<path fill="#0F4B60" d="M858.349,343.265l-0.22,1.463c0,0,1.27,0.039,1.981,0.332c0.711,0.293,1.645-0.451,0.649-1.043
	C859.765,343.427,858.349,343.265,858.349,343.265"/>
<path fill="#0F4B60" d="M872.516,366.037c0,0,1.505-0.224,2.28,0.752c0.776,0.977,1.992-0.166,1.129-0.808
	c-0.864-0.642-2.604-1.381-2.604-1.381L872.516,366.037z"/>
<path fill="#0F4B60" d="M876.129,360.729l-0.99,1.761c0,0,2.514,0.435,3.004,1.328c0.49,0.895,1.263-1.137,0.479-1.621
	C877.841,361.712,876.129,360.729,876.129,360.729"/>
<path fill="#FFB75E" d="M843.69,108.06c0,0-0.742-1.869,0.051-3.244c0.794-1.375,6.064-6.255,7.078-8.433
	c1.012-2.178,0.584-4.012-0.615-2.428c-1.2,1.584-2.969,3.677-2.781,2.041c0.186-1.636,2.774-9.243,3.091-10.353
	c0.317-1.111-0.769-2.764-1.192-1.283s-3.052,8.318-3.279,7.528c-0.229-0.791,1.352-8.513,1.352-8.513s-1.111-1.974-1.558-0.304
	c-0.445,1.67-1.51,7.666-2.048,7.349c-0.538-0.316,1.05-7.527,0.189-7.816c-0.859-0.289-1.429,0.219-1.785,2.791
	c-0.355,2.573-0.307,4.936-1.301,5.269c-0.992,0.333-0.101-5.811-1.004-5.722c-0.902,0.088-1.689,1.4-1.523,4.988
	c0.165,3.587-0.334,9.074-0.122,11.137c0.211,2.063-0.101,5.342-0.438,6.641c-0.339,1.3,0.418,3.042,0.971,3.233
	C839.325,111.132,843.69,108.06,843.69,108.06"/>
<path fill="#079D8E" d="M875.247,161.895c-0.663-0.075-14.31-3.979-21.209-11.14c-6.9-7.159-8.868-34.055-8.657-37.386
	c0.212-3.331,1.526-6.033-0.792-6.297s-7.967-0.74-8.024-0.243c-0.057,0.497-9.62,18.194,0.393,37.787
	c10.012,19.593,20.231,31.492,21.241,38.821c1.011,7.328,3.479,32.771,4.045,41.054c0.565,8.285,0.573,18.518,3.295,19.666
	c2.722,1.149,45.561-2.357,45.464-7.4s0.521-54.625,5.439-56.581c4.921-1.956,27.097-8.152,32.558-19.272s9.457-31.465,9.457-31.465
	l-11.539-0.308c0,0-5.834,26.174-22.953,33.618c-17.12,7.443-33.373,1.397-33.373,1.397s-14.485,6.402-15.089-1.551"/>
<path fill="#0F4B60" d="M878.034,158.783c-1.232-0.367-4.822-1.843-8.236-4.675c-3.414-2.833-4.577-3.972-3.223-14.598
	c1.354-10.626,6.771-19.064,14.324-18.491c7.553,0.573,10.083,3.593,16.613,3.043c6.531-0.55,5.606-7.554,19.379,1.49
	c13.774,9.043,10.373-3.994,15.602-6.991c5.228-2.998,11.214,5.015,6.185,10.048c-5.027,5.032-4.658,8.093-4.251,14.608
	c0.408,6.514-0.996,12.535-9.311,13.6c-8.315,1.065-13.337,3.51-21.87,3.976C894.712,161.258,886.654,161.346,878.034,158.783"/>
<path fill="#FFB75E" d="M874.838,163.373c0,0,3.082-5.002,1.134-7.081c-1.948-2.079-7.45-10.354-4.251-18.292
	c3.198-7.939,9.055-10.44,14.062-9.323c5.008,1.117,4.618,7.409,4.249,10.645c-0.368,3.235-1.999,7.966,0.124,7.552
	c2.123-0.414,4.217-3.453,5.542-1.663c1.326,1.79,1.103,4.714-1.575,6.157c-2.678,1.443-3.812-0.106-4.648,3.403
	c-0.837,3.51-1.324,10.665-1.324,10.665s-2.342,1.372-7.568,1.214C875.356,166.491,874.764,164.021,874.838,163.373"/>
<path fill="#0F4B60" d="M876.813,125.164c-0.616,0.349-3.799,2.551-4.901,4.415c-1.103,1.864-1.351,4.506-1.387,4.816
	c-0.035,0.311,3.356,1.325,7.273,1.876c3.917,0.551,3.989,0.821,4.717-0.039c0.727-0.859,1.767-1.264,1.767-1.264
	s-1.714,0.329,0.873,1.985c2.587,1.655,6.439,2.303,9.071,2.185c2.632-0.12,3.244-1.359,4.271-3.493
	c1.029-2.134-2.017-8.031-3.621-9.104c-1.606-1.073-3.625-2.192-6.973-2.679C884.555,123.376,876.813,125.164,876.813,125.164"/>
<path fill="#FFFFFF" d="M874.545,145.064c0,0,6.573,1.587,8.746,0.892c2.174-0.695-1.756,3.464-5.081,3.243
	C874.884,148.977,874.545,145.064,874.545,145.064"/>
<path fill="#0F4B60" d="M873.354,137.903c0,0,1.905-1.259,3.004-0.282c1.102,0.977,0.188,1.395-0.304,1.008
	C875.563,138.242,874.276,137.641,873.354,137.903"/>
<path fill="#0F4B60" d="M882.103,139.381c0,0,1.381-1.1,3.046-0.543c1.664,0.556,1.489,1.636,1.489,1.636s-1.141-1.021-2.187-1.035
	C883.406,139.425,882.486,139.687,882.103,139.381"/>
<path fill="#0F4B60" d="M869.687,158.442l4.816,2.888c0,0-8.762,24.889-10.303,31.575c-1.542,6.687-2.493,16.403-2.493,16.403
	s-5.31-10.897-2.999-22.954C861.017,174.296,869.687,158.442,869.687,158.442"/>
<path fill="#0F4B60" d="M892.26,162.885l7.768,0.261c0,0-4.773,18.639,0.146,27.464c4.92,8.826,10.636,14.78,10.636,14.78
	s1.221-20.291,4.258-23.688c3.038-3.396,5.862-3.543,5.862-3.543s4.324,8.602,4.366,30.128c0.042,21.526-7.773,25.782-9.421,27.935
	c-1.649,2.15-4.403,1.682-4.403,1.682l-1.235-23.379c0,0-12.763-7.067-17.358-21.47C888.282,178.651,890.331,167.5,892.26,162.885"
	/>
<g>
	<path fill="#FFB75E" d="M185.498,227.351c0,0,12.344,2.396,15.881,3.264c3.536,0.867,9.088,3.727,6.131,3.516
		s-7.757-1.763-7.757-1.763s4.11,2.341,5.695,2.905s4.487,3.436,3.108,3.314c-1.378-0.121-7.534-3.361-7.705-2.723
		c-0.171,0.639,4.312,3.191,6.072,4.001s3.405,2.181,1.296,2.175c-2.108-0.006-10.422-5.285-9.793-3.888
		c0.629,1.396,6.316,3.826,6.432,4.556c0.115,0.729-1.651,0.737-3.697-0.162c-2.046-0.899-9.103-5.969-9.015-4.555
		s2.934,3.071,3.444,4.146c0.51,1.074-0.464,1.363-1.794,0.69s-4.432-3.513-5.354-5.474s-2.369-4.656-3.235-5.402
		c-0.866-0.747-2.2-2.303-2.2-2.303L185.498,227.351z"/>
	<path fill="#079D8E" d="M49.268,317.308c-0.334-0.083-9.333-2.666-11.166-0.418c-1.833,2.25-2.416,13.5-1.583,18.666
		s-0.5,16.998,2.916,17.998c3.417,1,4.25-10.416,5.416-15.498c1.167-5.084,7.083-10.166,7.083-10.166L49.268,317.308z"/>
	<path fill="#079D8E" d="M149.817,331.283c0,0-5.338,7.412-6.45,9.934c-1.112,2.52-0.37,7.784,3.633,10.971
		c4.003,3.188,17.792,14.605,19.2,14.234c1.409-0.37,1.261-4.003-1.112-8.154c-2.372-4.152-6.449-13.566-6.597-16.088
		c-0.149-2.52,0-6.004,0-6.004L149.817,331.283z"/>
	<path fill="#0F4B60" d="M92.243,244.929c0,0.988,8.091,46.771,8.091,57.031c0,10.262,10.854,10.459-4.539,11.051
		c-15.392,0.593-48.151-0.592-48.151,0c0,0.593-0.197,14.012,0.987,16.972s41.441,1.974,51.703,1.579s19.931-13.223,20.917-20.523
		c0.987-7.302,3.355-39.271,3.355-39.271s23.681,4.342,32.561,8.288c8.88,3.947,14.209,11.841,10.064,17.169
		c-4.144,5.327-21.115,35.718-21.115,35.718s8.683,6.512,12.63,7.696c3.947,1.184,30.193-42.033,31.574-50.321
		c1.381-8.288-1.579-14.801-7.301-19.734c-5.723-4.934-38.678-24.865-44.796-29.404C132.105,236.641,92.243,244.929,92.243,244.929"
		/>
	<path fill="#FFB75E" d="M105.813,162.239c0,0,4.448-9.825,2.793-12.515c-1.655-2.689-7.344-7.653-5.379-10.86
		c1.965-3.206,6.413-0.827,6.413-0.827s-3.724-7.344,0.931-11.791c4.654-4.446,13.652-3.619,15.514-0.723
		c1.861,2.896,4.757,17.582,4.551,21.616c-0.207,4.033-3.104,6.929-5.379,7.653s-3.413,1.035-3.413,1.345
		c0,0.31,1.138,10.239,1.552,10.756s1.448,3.206-4.034,3.516C113.881,170.72,107.985,170.72,105.813,162.239"/>
	<path fill="#53AEE1" d="M80.164,172.313c0,0-12.563-24.324-18.042-32.076c-5.48-7.751-12.162-20.18-12.162-20.18l8.82-6.415
		c0,0,11.494,22.719,24.992,33.01c13.499,10.291,22.721,15.37,22.721,15.37s6.816,8.42,10.959,7.885
		c4.143-0.534,5.212-3.742,5.212-3.742s13.231,0,18.978,7.084c5.747,7.083,20.181,32.743,27.799,39.826
		c7.618,7.084,19.646,13.767,19.646,13.767l-2.19,7.318c0,0-16.521-5.047-29.217-14.135c-12.697-9.088-23.121-24.858-23.121-24.858
		s5.212,29.136,6.682,34.214c1.47,5.078,3.074,15.369-0.802,16.973c-3.876,1.604-23.121,5.48-30.605,6.015
		s-17.374-0.267-18.31-0.668s-3.208-10.692-2.272-25.126S89.92,196.904,80.164,172.313"/>
	<path fill="#FFB75E" d="M58.119,115.369c0-0.206-2.606-3.771-1.303-7.13c1.303-3.36,3.36-11.656,1.988-11.177
		c-1.371,0.48-0.891,2.812-2.057,3.909c-1.165,1.097-2.125-1.029-2.399-3.085c-0.274-2.058-0.96-9.189-1.988-8.708
		c-1.029,0.48-0.549,3.908-0.549,5.691c0,1.782-0.822,2.604-1.097,0.479s-1.097-8.707-2.263-7.953
		c-1.165,0.754-0.549,2.879-0.274,4.456c0.274,1.578,0.96,5.76,0.137,4.389s-1.92-7.68-2.88-6.925
		c-0.96,0.754-0.137,3.703,0.274,5.074c0.412,1.371,1.715,4.525,0.549,4.182c-1.166-0.343-1.714-4.869-2.468-4.937
		s-1.235,1.097-0.96,2.468c0.274,1.372,2.743,8.434,3.977,10.285c1.234,1.852,3.017,2.194,3.497,3.497
		c0.479,1.302,2.879,7.885,2.948,8.09C53.319,118.18,58.119,115.369,58.119,115.369"/>
	<path fill="#0F4B60" d="M108.087,154.169c0,0-3.333-3.412-5.872-4.206c-2.539-0.793-4.365-4.205-3.571-7.697
		c0.794-3.492-0.397-5.555-1.666-7.856c-1.27-2.301-2.302-6.586,2.698-8.967c4.999-2.38,4.285-9.681,7.221-11.506
		c2.936-1.825,4.205-0.238,9.046,1.349c4.841,1.587,7.38-1.27,9.602-1.349c2.222-0.08,8.808,2.698,6.189,7.142
		c-2.618,4.444-3.967,6.348-3.967,6.348s-0.318,1.587-2.222,0c-1.905-1.587-6.587-4.523-10.951-2.381
		c-4.364,2.143-6.11,8.015-4.841,10.555c1.27,2.539,1.191,3.967-0.079,3.173c-1.27-0.793-7.935-2.777-6.666,2.302
		c1.27,5.078,5.83,4.226,6.068,6.289C109.314,149.428,108.087,154.169,108.087,154.169"/>
	<path fill="#0F4B60" d="M104.891,129.765l4.438,6.601c0,0,0.797-8.422,4.553-7.625c3.756,0.796,3.187-0.569,5.121-1.594
		c1.935-1.024,2.276,2.049,5.008,0.683c2.731-1.365,4.666-4.324,1.366-6.031c-3.301-1.708-14.568-0.115-15.706,1.024
		C108.533,123.961,104.891,129.765,104.891,129.765"/>
	<path fill="#0F4B60" d="M114.882,138.451c0,0,0.093-1.306,1.027-1.773c0.934-0.468,1.914-0.234,1.914-0.234s0.234,0.42-0.653,0.747
		C116.283,137.518,114.882,138.451,114.882,138.451"/>
	<path fill="#0F4B60" d="M126.813,133.429c0,0-2.754,0.093-2.428,0.934c0.327,0.84,1.028-0.141,1.961-0.094
		C127.28,134.316,127.607,133.335,126.813,133.429"/>
	<path fill="#FFFFFF" d="M119.74,145.088c0,0,5.417-0.894,6.702-1.843c1.285-0.949,2.123-2.011,2.123-2.011
		s-0.726,3.574-2.569,4.971C124.151,147.603,119.74,145.088,119.74,145.088"/>
	<path fill="#0F4B60" d="M36.147,316.865c0.483-1.289,2.918-3.891,2.918-0.973s-1.945,31.123-0.973,34.041
		c0.973,2.916,1.945,0.971,2.918,1.943c0.972,0.973,0.972,0,0,0.973c-0.973,0.973-2.918,1.945-3.89,0
		C36.147,350.904,33.229,324.646,36.147,316.865"/>
	<path fill="#0F4B60" d="M142.158,345.07c0,0,0-4.863,0.973-3.891c0.972,0.973,0,4.863,2.917,8.754
		c2.918,3.889,17.507,12.643,18.479,13.615c0.973,0.973,0.973-2.918,1.945-1.945c0.973,0.973,1.946,4.863,0,4.863
		c-1.945,0-19.451-11.672-19.451-12.645S141.185,348.96,142.158,345.07"/>
</g>
</svg>
