PHONE_NUMBER,ACTIVATION_DATE,DEACTIVATION_DATE,USER,POST_PAID,PREPAID
906377696,2016-02-03,2015-06-07,1,TRUE,
906377696,2016-07-03,2015-08-07,1,,
906377696,2016-09-07,2016-11-01,2,,TRUE
906377696,2017-02-03,2018-06-01,2,TRUE,
906388698,2016-06-07,2016-09-01,3,TRUE,
906378698,2016-02-03,2015-06-07,4,TRUE,
906388698,2016-09-01,2017-09-01,3,,TRUE
906378698,2016-06-07,2015-10-07,4,,TRUE
906388698,2017-09-01,2017-11-01,5,TRUE,
906311228,2018-02-01,,6,,TRUE
906322228,2018-02-01,2018-06-01,7,TRUE,
906322228,2019-07-01,,8,TRUE,
