0000000
0000000
1111111
0000000
0000000
0000000
1111111
0000000
0000000
0000000
1111111
0000000
0000000
0000000
1111111
0000000
0000000
0000000
1111111
0000000
0000000
0000000
0000000
1111111
0000000
0000000
0000000
1111111
0000000
0000000
0000000
1111111
0000000
0000000
0000000
1111111
0101010
0000000
0000000
0000000
1010101
0000000
0000000
0000000
1010101
0101010
0000000
0000000
0000000
1111111
0011100
0000000
0000000
0000000
1100011
0010100
0000000
0000000
0000000
1101011
0000000
0000000
0000000
1111111
0000000
0000000
0000000
1111111
0000000
0000000
0000000
1111000
0001111
0000000
0000000
1111000
0000000
0000000
0000000
0011111
0000000
0000000
0000000
1111111
0000000
0000000
0000000
1111000
0000000
0000000
0001111
0000000
0000000
0000000