Copyright 1986-2016 Xilinx, Inc. All Rights Reserved.
------------------------------------------------------------------------------------
| Tool Version : Vivado v.2016.2 (win64) Build 1577090 Thu Jun  2 16:32:40 MDT 2016
| Date         : Thu Oct 13 22:59:51 2016
| Host         : yenpin-NB running 64-bit major release  (build 9200)
| Command      : report_control_sets -verbose -file Lab4_2_control_sets_placed.rpt
| Design       : Lab4_2
| Device       : xc7a35t
------------------------------------------------------------------------------------

Control Set Information

Table of Contents
-----------------
1. Summary
2. Flip-Flop Distribution
3. Detailed Control Set Information

1. Summary
----------

+----------------------------------------------------------+-------+
|                          Status                          | Count |
+----------------------------------------------------------+-------+
| Number of unique control sets                            |     6 |
| Unused register locations in slices containing registers |    27 |
+----------------------------------------------------------+-------+


2. Flip-Flop Distribution
-------------------------

+--------------+-----------------------+------------------------+-----------------+--------------+
| Clock Enable | Synchronous Set/Reset | Asynchronous Set/Reset | Total Registers | Total Slices |
+--------------+-----------------------+------------------------+-----------------+--------------+
| No           | No                    | No                     |              49 |           15 |
| No           | No                    | Yes                    |               0 |            0 |
| No           | Yes                   | No                     |               0 |            0 |
| Yes          | No                    | No                     |               4 |            1 |
| Yes          | No                    | Yes                    |               8 |            2 |
| Yes          | Yes                   | No                     |               0 |            0 |
+--------------+-----------------------+------------------------+-----------------+--------------+


3. Detailed Control Set Information
-----------------------------------

+------------------+----------------------+------------------+------------------+----------------+
|   Clock Signal   |     Enable Signal    | Set/Reset Signal | Slice Load Count | Bel Load Count |
+------------------+----------------------+------------------+------------------+----------------+
|  d2/enable       |                      |                  |                1 |              1 |
|  c1/count_reg[0] | la1/able             | d1/re            |                1 |              4 |
|  c1/count_reg[0] | la1/en2              | d1/re            |                1 |              4 |
|  c2/CLK          | de1/value[3]_i_1_n_0 |                  |                1 |              4 |
|  c2/CLK          |                      |                  |                3 |             10 |
|  clk_IBUF_BUFG   |                      |                  |               11 |             38 |
+------------------+----------------------+------------------+------------------+----------------+


