sv xil_defaultlib "C:/Xi/Vivado/2016.2/data/ip/xpm/xpm_memory/hdl/xpm_memory_base.sv" 
sv xil_defaultlib "C:/Xi/Vivado/2016.2/data/ip/xpm/xpm_memory/hdl/xpm_memory_dpdistram.sv" 
sv xil_defaultlib "C:/Xi/Vivado/2016.2/data/ip/xpm/xpm_memory/hdl/xpm_memory_dprom.sv" 
sv xil_defaultlib "C:/Xi/Vivado/2016.2/data/ip/xpm/xpm_memory/hdl/xpm_memory_sdpram.sv" 
sv xil_defaultlib "C:/Xi/Vivado/2016.2/data/ip/xpm/xpm_memory/hdl/xpm_memory_spram.sv" 
sv xil_defaultlib "C:/Xi/Vivado/2016.2/data/ip/xpm/xpm_memory/hdl/xpm_memory_sprom.sv" 
sv xil_defaultlib "C:/Xi/Vivado/2016.2/data/ip/xpm/xpm_memory/hdl/xpm_memory_tdpram.sv" 
verilog blk_mem_gen_v8_3_3 "../../../ipstatic/blk_mem_gen_v8_3_3/simulation/blk_mem_gen_v8_3.v" 
verilog xil_defaultlib "../../../../project_1.srcs/sources_1/ip/blk_mem_gen_5_1/sim/blk_mem_gen_5.v" 

verilog xil_defaultlib "glbl.v"

nosort
