memory_initialization_radix=16;
memory_initialization_vector=
000,
000,
000,
000,
000,
000,
000,
000,
000,
000,
000,
000,
000,
000,
000,
000,
000,
000,
000,
000,
000,
000,
000,
100,
100,
100,
100,
100,
200,
200,
000,
000,
000,
000,
000,
000,
000,
000,
000,
000,
000,
000,
000,
000,
000,
000,
000,
000,
000,
000,
000,
000,
000,
100,
100,
100,
100,
100,
200,
200,
000,
000,
000,
000,
000,
000,
000,
000,
000,
000,
000,
000,
000,
000,
000,
000,
000,
000,
000,
000,
000,
000,
000,
100,
100,
100,
100,
100,
200,
200,
000,
000,
000,
000,
000,
000,
000,
000,
000,
000,
000,
000,
000,
000,
000,
000,
000,
000,
000,
000,
000,
000,
000,
100,
100,
100,
100,
200,
200,
200,
000,
000,
000,
000,
000,
000,
000,
000,
000,
000,
000,
000,
000,
000,
000,
000,
000,
000,
000,
000,
000,
000,
000,
100,
100,
100,
100,
200,
200,
200,
000,
000,
000,
000,
000,
000,
000,
000,
000,
000,
000,
000,
000,
000,
000,
000,
000,
000,
000,
000,
000,
000,
000,
100,
100,
100,
200,
200,
200,
200,
000,
000,
000,
000,
000,
000,
000,
000,
000,
000,
000,
000,
000,
000,
000,
000,
000,
000,
000,
000,
000,
000,
100,
100,
100,
100,
200,
200,
200,
200,
000,
000,
000,
000,
000,
000,
000,
000,
000,
000,
000,
000,
000,
000,
000,
000,
000,
000,
000,
000,
000,
000,
100,
100,
100,
200,
200,
200,
200,
200,
000,
000,
000,
000,
000,
000,
000,
000,
000,
000,
000,
000,
000,
000,
000,
000,
000,
000,
000,
000,
000,
100,
100,
100,
200,
200,
200,
200,
200,
200,
000,
000,
000,
000,
000,
000,
000,
000,
000,
000,
000,
000,
000,
000,
000,
000,
000,
000,
000,
000,
000,
100,
100,
100,
200,
200,
200,
200,
300,
300,
000,
000,
000,
000,
000,
000,
000,
000,
000,
000,
000,
000,
000,
000,
000,
000,
000,
000,
000,
000,
000,
100,
100,
100,
200,
200,
200,
300,
300,
300,
000,
000,
000,
000,
000,
000,
000,
000,
000,
000,
000,
000,
000,
000,
000,
000,
000,
000,
000,
000,
000,
100,
100,
100,
200,
200,
300,
300,
300,
300,
000,
000,
000,
000,
000,
000,
000,
000,
000,
000,
000,
000,
000,
000,
000,
000,
000,
000,
000,
000,
100,
100,
100,
200,
200,
200,
300,
300,
300,
400,
000,
000,
000,
000,
000,
000,
000,
000,
000,
000,
000,
000,
000,
000,
000,
000,
000,
000,
000,
000,
100,
100,
100,
200,
200,
300,
300,
300,
400,
400,
000,
000,
000,
000,
000,
000,
000,
000,
000,
000,
000,
000,
000,
000,
000,
000,
000,
000,
000,
100,
100,
100,
200,
200,
300,
300,
300,
400,
400,
400,
000,
000,
000,
000,
000,
000,
000,
000,
000,
000,
000,
000,
000,
000,
000,
000,
000,
000,
000,
100,
100,
100,
200,
200,
300,
300,
300,
400,
400,
400,
000,
000,
000,
000,
000,
000,
000,
000,
000,
000,
000,
000,
000,
000,
000,
000,
000,
000,
100,
100,
100,
100,
200,
200,
200,
300,
300,
400,
400,
611,
000,
000,
000,
000,
000,
000,
000,
000,
000,
000,
000,
000,
000,
000,
000,
000,
000,
100,
100,
100,
100,
100,
200,
200,
300,
300,
300,
400,
500,
833,
000,
000,
000,
000,
000,
000,
000,
000,
000,
000,
000,
000,
000,
000,
000,
000,
100,
100,
100,
100,
100,
200,
200,
200,
300,
300,
300,
400,
511,
A66,
000,
000,
000,
000,
000,
000,
000,
000,
000,
000,
000,
000,
000,
000,
000,
000,
100,
100,
100,
100,
100,
200,
200,
300,
300,
300,
400,
400,
622,
C88,
000,
000,
000,
000,
000,
000,
000,
000,
000,
000,
000,
000,
000,
000,
000,
000,
000,
100,
100,
100,
200,
200,
200,
300,
300,
400,
400,
411,
844,
EAA,
000,
000,
000,
000,
000,
000,
000,
000,
000,
000,
000,
000,
000,
000,
000,
000,
000,
100,
100,
100,
200,
200,
300,
300,
300,
400,
400,
522,
A66,
FCC,
000,
000,
000,
000,
000,
000,
000,
000,
000,
000,
000,
000,
000,
000,
000,
000,
000,
100,
100,
100,
200,
200,
300,
300,
300,
400,
401,
733,
C99,
FCD,
000,
000,
000,
000,
000,
000,
000,
000,
000,
000,
000,
000,
000,
000,
000,
000,
000,
100,
100,
100,
200,
300,
300,
300,
300,
400,
411,
855,
EBB,
FCC,
000,
000,
000,
000,
000,
000,
000,
000,
000,
000,
000,
000,
000,
000,
000,
000,
100,
100,
100,
200,
200,
300,
300,
400,
300,
400,
511,
A77,
FBC,
FCD,
000,
000,
000,
000,
000,
000,
000,
000,
000,
000,
000,
000,
000,
000,
000,
000,
100,
100,
100,
200,
200,
300,
300,
300,
300,
401,
744,
D9A,
FDD,
ECC,
000,
000,
000,
000,
000,
000,
000,
000,
000,
000,
000,
000,
100,
000,
000,
000,
100,
100,
100,
200,
200,
300,
300,
300,
411,
411,
966,
EBB,
FDD,
DAB,
000,
000,
000,
000,
000,
000,
000,
000,
000,
000,
000,
000,
100,
000,
000,
100,
100,
100,
100,
200,
200,
300,
300,
400,
511,
522,
B88,
FCD,
FDD,
CAA,
000,
000,
000,
000,
000,
000,
000,
000,
000,
000,
000,
100,
100,
100,
100,
100,
100,
100,
200,
200,
200,
300,
300,
400,
411,
633,
C99,
FDD,
FCD,
B89,
000,
000,
000,
000,
000,
000,
000,
000,
000,
000,
100,
100,
100,
100,
100,
100,
100,
100,
200,
200,
300,
300,
300,
300,
512,
855,
EBB,
FDD,
FCC,
A77,
000,
000,
000,
000,
000,
000,
000,
000,
000,
000,
100,
100,
100,
100,
100,
100,
100,
200,
200,
200,
300,
300,
400,
300,
522,
A77,
FCC,
FDD,
EBC,
856,
000,
000,
000,
000,
000,
000,
000,
000,
000,
000,
100,
100,
100,
100,
100,
100,
100,
200,
200,
200,
300,
300,
401,
401,
734,
C9A,
FDD,
FDD,
DAA,
745,
000,
000,
000,
000,
000,
000,
000,
000,
000,
000,
100,
100,
100,
100,
100,
100,
200,
200,
200,
200,
300,
300,
401,
401,
966,
EBC,
FDD,
FCD,
C89,
733,
000,
000,
000,
000,
000,
000,
000,
000,
000,
000,
100,
100,
100,
100,
100,
200,
200,
200,
200,
300,
300,
400,
400,
512,
B89,
FBC,
FCD,
FCD,
B78,
512,
000,
000,
000,
000,
000,
000,
000,
000,
000,
000,
100,
100,
100,
100,
100,
200,
200,
300,
300,
300,
300,
401,
400,
623,
DAB,
FCD,
FCD,
FBC,
A66,
501,
000,
000,
000,
000,
000,
000,
000,
000,
000,
000,
100,
100,
100,
100,
100,
200,
200,
300,
300,
300,
400,
401,
411,
855,
FCC,
FDD,
FCD,
EAA,
834,
501,
000,
000,
000,
000,
000,
000,
000,
000,
000,
000,
100,
100,
100,
100,
100,
200,
300,
300,
400,
400,
400,
400,
623,
B89,
FCD,
FDD,
FCD,
C89,
723,
601,
000,
000,
000,
000,
000,
000,
000,
000,
000,
000,
100,
100,
100,
100,
200,
200,
300,
300,
400,
400,
400,
400,
744,
EBB,
FDD,
FDD,
FCC,
B67,
612,
601,
000,
000,
000,
000,
000,
000,
000,
000,
000,
000,
100,
100,
100,
100,
200,
200,
200,
300,
400,
400,
400,
511,
966,
FCD,
FDD,
FDD,
FBC,
956,
612,
501,
000,
000,
000,
000,
000,
000,
000,
000,
000,
100,
100,
100,
100,
200,
200,
200,
300,
300,
400,
400,
500,
622,
B88,
FDD,
FDD,
FDD,
EAB,
845,
501,
500,
000,
000,
000,
000,
000,
000,
000,
000,
000,
100,
100,
100,
100,
200,
200,
200,
200,
300,
400,
400,
511,
955,
DBB,
FDD,
FDD,
FDD,
C89,
723,
501,
500,
000,
000,
000,
000,
000,
000,
000,
000,
000,
100,
100,
100,
200,
200,
200,
200,
300,
300,
400,
400,
612,
A77,
FCC,
FDD,
FDD,
FCC,
B77,
612,
500,
500,
000,
000,
000,
000,
000,
000,
000,
100,
100,
100,
100,
200,
200,
200,
300,
200,
300,
300,
401,
511,
733,
C99,
FDD,
FDD,
FDD,
EBB,
955,
501,
500,
500,
000,
000,
000,
000,
000,
000,
100,
100,
100,
100,
200,
200,
200,
200,
300,
300,
300,
300,
501,
622,
956,
EBB,
FDD,
FDD,
FDD,
DAA,
834,
501,
500,
500,
000,
000,
000,
000,
000,
000,
100,
100,
100,
100,
200,
200,
200,
200,
300,
300,
300,
300,
400,
622,
B78,
FCC,
FDD,
FDD,
FDD,
C99,
623,
501,
500,
400,
000,
000,
000,
000,
000,
100,
100,
100,
100,
100,
200,
200,
200,
300,
300,
300,
300,
400,
400,
733,
C9A,
FDD,
FDD,
FDD,
FDD,
A77,
512,
500,
500,
500,
000,
000,
000,
000,
000,
100,
100,
100,
100,
100,
200,
200,
200,
300,
300,
300,
400,
400,
400,
734,
DAA,
FDD,
EDD,
FDD,
FDD,
966,
512,
500,
500,
400,
000,
000,
000,
000,
000,
100,
100,
100,
100,
200,
200,
200,
300,
300,
300,
400,
400,
501,
511,
956,
ECC,
FDD,
FDD,
FEE,
EBB,
855,
511,
500,
500,
400,
000,
000,
000,
000,
000,
100,
100,
100,
100,
200,
200,
200,
300,
300,
400,
400,
400,
401,
633,
C89,
FDD,
FDD,
EDD,
FED,
CAA,
733,
511,
500,
500,
400,
100,
000,
000,
000,
000,
100,
100,
100,
200,
200,
200,
200,
300,
300,
400,
400,
401,
401,
956,
EBB,
FDD,
FDD,
FDD,
FED,
B98,
622,
511,
500,
400,
400,
000,
000,
000,
000,
100,
100,
100,
200,
200,
200,
200,
300,
300,
300,
400,
501,
511,
512,
B88,
FDD,
FEE,
FDD,
FDD,
FDC,
A67,
511,
400,
400,
400,
400,
000,
000,
000,
000,
000,
100,
100,
200,
200,
200,
200,
300,
300,
300,
400,
401,
400,
633,
DAA,
FDD,
FDD,
FDD,
FDD,
FCC,
855,
511,
400,
400,
400,
400,
000,
000,
000,
000,
100,
100,
100,
200,
200,
200,
300,
300,
300,
400,
400,
401,
401,
855,
ECC,
FDD,
FDD,
FDD,
FDD,
EBB,
734,
501,
400,
500,
400,
400,
000,
000,
000,
000,
100,
100,
100,
200,
200,
300,
300,
300,
300,
400,
400,
400,
522,
A77,
FDD,
FDD,
FDD,
FDD,
FDD,
C99,
723,
501,
500,
400,
400,
400,
000,
000,
000,
000,
100,
100,
100,
200,
200,
300,
300,
300,
300,
400,
400,
400,
633,
C9A,
FDD,
FDD,
FDD,
FDD,
FCD,
B77,
611,
501,
500,
400,
400,
400,
100,
100,
100,
100,
100,
100,
200,
200,
200,
300,
300,
300,
400,
401,
401,
401,
856,
ECD,
FEE,
EDD,
FEE,
FDD,
FBC,
955,
501,
500,
500,
400,
400,
400,
100,
100,
100,
100,
100,
100,
200,
200,
300,
300,
300,
300,
400,
501,
511,
623,
B89,
FDD,
FDE,
EDD,
FEE,
FDD,
EAB,
834,
501,
500,
400,
400,
300,
300,
100,
100,
100,
100,
100,
200,
200,
200,
200,
300,
300,
400,
400,
511,
512,
845,
DAB,
FDD,
FEE,
EDD,
FDD,
FCD,
D99,
622,
500,
500,
400,
400,
300,
300,
100,
100,
100,
100,
100,
200,
200,
200,
300,
300,
400,
400,
400,
511,
623,
A67,
ECC,
FDD,
FDE,
FDE,
FDD,
FCC,
B78,
611,
500,
500,
500,
400,
300,
300,
100,
100,
100,
100,
200,
200,
200,
200,
300,
300,
400,
400,
400,
622,
955,
C9A,
FDD,
EDD,
EDD,
FEE,
FDD,
FBC,
A56,
501,
500,
500,
500,
400,
300,
300,
100,
100,
100,
200,
200,
200,
200,
300,
300,
300,
400,
400,
511,
844,
C88,
EBB,
FDD,
FDD,
FDD,
FEE,
FDD,
EAB,
844,
501,
500,
500,
500,
400,
400,
300,
100,
100,
100,
200,
200,
200,
300,
300,
300,
400,
500,
400,
622,
A66,
DAA,
FCC,
FDD,
FDE,
FDD,
FDE,
FCD,
C99,
723,
501,
500,
500,
400,
400,
400,
300,
100,
100,
100,
200,
200,
200,
300,
300,
400,
400,
501,
400,
733,
C88,
EBB,
FDD,
FDD,
FDE,
FDE,
FDD,
FCC,
B77,
612,
601,
601,
500,
500,
400,
400,
300,
100,
100,
100,
200,
200,
300,
300,
400,
400,
400,
511,
400,
744,
DAA,
FCC,
FED,
FDD,
FDE,
FEE,
FDD,
EBC,
A66,
611,
611,
601,
500,
500,
400,
400,
400,
100,
100,
100,
200,
200,
300,
300,
400,
400,
400,
501,
411,
855,
DAB,
ECC,
FDD,
EDD,
FDD,
FDE,
FDD,
EAB,
955,
611,
600,
601,
600,
500,
500,
400,
400,
100,
100,
100,
200,
200,
300,
300,
300,
400,
400,
401,
522,
B78,
FCC,
FDD,
FDD,
FDD,
FDE,
FDD,
FCD,
D99,
833,
601,
600,
600,
601,
501,
500,
400,
400,
100,
100,
100,
200,
200,
300,
300,
400,
400,
401,
400,
633,
DAA,
FDD,
FDD,
FDD,
FEE,
FDE,
FDD,
FDD,
C88,
722,
601,
601,
600,
600,
611,
501,
500,
400,
100,
100,
100,
200,
200,
300,
300,
400,
400,
501,
401,
855,
ECC,
FDD,
FDD,
EDD,
FDE,
FDE,
FDD,
FCC,
B67,
712,
611,
701,
600,
601,
723,
833,
511,
400,
100,
100,
100,
200,
200,
300,
300,
400,
400,
400,
622,
B78,
FDD,
FDD,
FED,
EED,
EDD,
FDD,
FDD,
EBB,
955,
712,
611,
601,
711,
823,
B66,
B66,
612,
400,
100,
100,
100,
200,
200,
300,
300,
400,
400,
400,
844,
DAA,
FDD,
EDD,
EDD,
EEE,
FEE,
FDD,
FDD,
DAA,
944,
612,
601,
611,
945,
C77,
FAA,
C78,
612,
500,
100,
100,
100,
200,
200,
300,
400,
400,
501,
512,
A67,
EBB,
FDD,
EDD,
EDD,
EEE,
EDE,
ECD,
FCD,
C89,
733,
612,
723,
944,
E99,
FBB,
FBC,
B67,
501,
400,
100,
100,
200,
200,
200,
300,
400,
400,
501,
733,
C89,
FCC,
FDD,
EEE,
EED,
FEE,
EDE,
FDD,
FCD,
A77,
623,
734,
A66,
D99,
FCC,
FCC,
FAB,
955,
500,
500,
200,
100,
200,
200,
300,
300,
400,
400,
511,
855,
DAB,
FDD,
FDE,
EEE,
EEE,
EEE,
EDE,
FDE,
EBC,
967,
845,
A77,
DAA,
FCD,
FDD,
FCC,
EAA,
733,
500,
500,
200,
200,
200,
200,
300,
300,
400,
400,
511,
A77,
FCC,
FDD,
EDD,
EEE,
EEE,
EDD,
EEE,
FEE,
DAB,
977,
B89,
EBC,
ECC,
FDD,
FDD,
FCC,
D99,
722,
400,
500,
200,
200,
200,
300,
300,
300,
400,
400,
633,
C89,
FDD,
EDD,
EDD,
EEE,
EEE,
EEE,
EDE,
FEE,
ECC,
CAA,
EBC,
FDE,
FDD,
FDD,
FDD,
FDC,
B78,
612,
400,
500,
200,
200,
200,
300,
300,
400,
400,
511,
956,
DBB,
FDE,
EDD,
EDE,
EEE,
EEE,
EEE,
EEE,
EDE,
EDE,
EDD,
EDD,
FDE,
FDE,
EDD,
FDD,
ECC,
956,
511,
400,
500,
200,
200,
300,
300,
300,
400,
400,
622,
A78,
FCD,
FEE,
EDE,
EDE,
EDE,
EEE,
EEE,
EEE,
EDE,
EDE,
EDE,
EDE,
FDE,
FDE,
EDD,
FDD,
EBB,
844,
500,
500,
500,
200,
200,
300,
300,
400,
511,
401,
734,
C99,
FDD,
FDE,
EDE,
EEE,
EDE,
EEE,
EEE,
EEE,
EEE,
EDE,
EDE,
EDE,
EDE,
FEE,
FEE,
FDD,
C9A,
733,
400,
400,
500,
200,
200,
300,
400,
400,
400,
511,
966,
ECC,
FDE,
EDE,
EDE,
FEE,
EDE,
EDE,
EEE,
EEE,
EEE,
EEE,
EEE,
EEE,
EEE,
EEE,
FDD,
FDD,
B88,
622,
500,
500,
500,
200,
200,
300,
400,
400,
400,
522,
B88,
FDD,
FDE,
EDE,
EDE,
EEE,
EEE,
EEE,
EEE,
EEE,
EEE,
EEE,
EEE,
EEE,
EEE,
EDE,
FDE,
ECC,
A67,
511,
500,
500,
400,
200,
200,
300,
400,
400,
400,
844,
EBB,
FDD,
EDD,
FEE,
DDD,
EDE,
EEE,
EDE,
EDE,
EEE,
DEE,
DEE,
DEE,
EEE,
EDD,
EDD,
FDE,
EBB,
855,
400,
400,
400,
400,
200,
200,
300,
400,
400,
501,
956,
FCC,
FCD,
EDD,
EEE,
DDD,
EDE,
EEE,
EDE,
EDE,
EEE,
DEE,
DEE,
DEE,
EEE,
EDD,
EDD,
FDE,
DAA,
844,
511,
400,
400,
400,
200,
300,
300,
400,
500,
611,
B77,
FCC,
FDD,
FDE,
FEE,
EDE,
EEE,
EEE,
EEE,
EEE,
EEE,
EEE,
EEE,
EEE,
EEE,
EDD,
FDD,
FDD,
C99,
733,
511,
400,
400,
400,
200,
300,
300,
400,
400,
622,
D99,
FCD,
FDE,
FEE,
FEE,
EDE,
EEE,
EEE,
EEE,
EEE,
EEE,
EEE,
EEE,
EEE,
EED,
EDD,
FDD,
FDD,
B88,
622,
501,
400,
400,
400,
300,
300,
300,
400,
501,
844,
EBB,
FDD,
FDE,
FEE,
EEE,
EDE,
EEE,
EEE,
EEE,
EEE,
EEE,
EEE,
EEE,
EEE,
EDD,
FDD,
FDD,
FDD,
A66,
511,
400,
400,
400,
400,
300,
300,
400,
400,
622,
A67,
FDD,
FDD,
FDE,
EEE,
EDE,
EDE,
EEE,
EEE,
EEE,
EEE,
EEE,
EEE,
EEE,
EEE,
EDD,
FDD,
FDD,
ECC,
855,
511,
400,
400,
400,
400,
300,
300,
400,
411,
744,
C9A,
FDD,
FDD,
EDE,
EEE,
EDE,
EDE,
EDE,
EEE,
EEE,
EEE,
DEE,
EEE,
EEE,
EEE,
FDD,
FDE,
FDD,
DBB,
633,
411,
400,
400,
400,
400,
300,
300,
400,
511,
956,
EBB,
FEE,
EDD,
EDE,
EEE,
EDE,
EDE,
EDE,
EDE,
EDE,
EEE,
EEE,
EEE,
EEE,
EEE,
FDE,
FDE,
FDD,
DAA,
522,
401,
400,
400,
400,
400,
400,
400,
400,
622,
B88,
FDD,
FDD,
EEE,
EEE,
EEE,
EDE,
FDE,
FDE,
EDE,
EEE,
EEE,
EEE,
EEE,
EEE,
EDE,
FEE,
FDD,
FDD,
B88,
622,
401,
400,
400,
400,
400,
400,
400,
401,
744,
C99,
FDD,
FEE,
EDD,
EDE,
EEE,
EDE,
FDE,
FDE,
FDE,
EDE,
EDE,
DEE,
DEE,
EEE,
EEE,
FDE,
FDE,
FCD,
956,
512,
501,
400,
400,
400,
400,
400,
400,
511,
A67,
ECC,
FDD,
FEE,
EDD,
FEE,
FDE,
FDE,
FDE,
FDE,
FDE,
FDE,
EDE,
EEE,
DEE,
EEE,
EDE,
EDD,
FDE,
EBC,
734,
511,
500,
400,
400,
400,
400,
501,
400,
623,
C99,
FCD,
FDD,
FEE,
FDD,
FDD,
FDD,
FDD,
FDE,
EBC,
DBC,
ECD,
EDE,
EEE,
EEE,
EEE,
EDE,
FDE,
FDD,
D9A,
723,
501,
500,
400,
400,
400,
300,
501,
501,
956,
EBB,
FDD,
FDD,
FDD,
FDD,
FCD,
FDD,
FCC,
EBC,
B89,
B89,
DBB,
EDD,
EEE,
EDD,
EEE,
EEE,
FDE,
FCD,
B88,
612,
501,
500,
400,
400,
400,
300,
501,
512,
B78,
FCC,
FDD,
FDD,
FDD,
FDD,
FCD,
FBB,
D99,
A67,
845,
A67,
DBB,
ECD,
FEE,
EDD,
EED,
FEE,
FDD,
FCC,
B67,
611,
501,
500,
400,
400,
300,
300,
501,
734,
C89,
FCC,
FCD,
FDD,
FDD,
FCC,
EAB,
C78,
945,
723,
733,
B88,
FCC,
FDD,
FEE,
EDD,
EDD,
EED,
FDD,
EBB,
956,
611,
600,
500,
400,
400,
300,
300,
501,
956,
EAB,
FCD,
FDD,
FCC,
EBB,
B77,
945,
722,
611,
511,
844,
DAA,
FDD,
FDD,
EDD,
FED,
EDD,
EDD,
FDD,
DAA,
844,
601,
600,
500,
500,
400,
400,
300,
501,
C77,
FBC,
FCC,
FBB,
D99,
A66,
833,
722,
611,
611,
611,
955,
EAB,
FCD,
FDD,
FDD,
FDE,
EDD,
FDD,
FDD,
B88,
722,
611,
600,
600,
500,
400,
400,
300,
612,
D88,
FBB,
EAA,
B77,
944,
722,
611,
610,
600,
611,
611,
A66,
FBC,
FCD,
FDD,
FDE,
FDD,
FDD,
FED,
ECC,
A77,
621,
600,
600,
600,
600,
500,
400,
400,
944,
D88,
C78,
945,
722,
611,
600,
600,
600,
600,
611,
611,
B77,
FCC,
FCD,
FDE,
FDE,
EDD,
FDD,
FED,
EBB,
966,
611,
500,
600,
500,
500,
500,
400,
400,
934,
A55,
833,
611,
600,
500,
600,
600,
600,
600,
601,
622,
C88,
FCC,
FDD,
FDE,
FDD,
EDD,
FDD,
FDD,
DBA,
844,
611,
500,
600,
600,
500,
500,
500,
500,
823,
822,
601,
500,
500,
500,
600,
600,
600,
600,
600,
723,
D99,
FCD,
FDD,
FDE,
EDD,
FDE,
FDD,
FDD,
DAA,
733,
601,
600,
600,
600,
500,
500,
500,
500,
601,
601,
500,
601,
611,
600,
600,
600,
600,
600,
500,
834,
EBB,
FDD,
FDD,
FDE,
EDD,
FEE,
FDD,
FDD,
C89,
622,
600,
600,
600,
600,
600,
500,
500,
500,
500,
500,
500,
500,
500,
500,
600,
600,
600,
600,
501,
956,
FCC,
FDD,
FDD,
FDE,
EDD,
FEE,
FDD,
FCC,
B77,
611,
600,
701,
600,
600,
600,
500,
600,
601,
500,
500,
400,
500,
500,
500,
600,
600,
500,
601,
612,
B78,
FDD,
FDD,
FEE,
EDD,
EDD,
FDE,
FDD,
FBC,
A66,
712,
701,
701,
701,
600,
600,
611,
822,
823,
400,
400,
400,
400,
500,
500,
500,
500,
500,
501,
734,
DAA,
FDD,
FEE,
FEE,
EDD,
FEE,
FDD,
FDD,
EAB,
945,
712,
701,
701,
701,
600,
601,
823,
B56,
B56,
400,
400,
400,
400,
500,
500,
500,
500,
500,
511,
855,
EBB,
FEE,
FEE,
EEE,
EDD,
FEE,
FDD,
FDD,
D9A,
834,
601,
712,
701,
701,
822,
944,
D78,
E99,
944,
400,
400,
400,
400,
400,
500,
500,
500,
400,
522,
966,
ECC,
FEE,
EDD,
DED,
EED,
EDD,
FEE,
FCD,
C89,
823,
701,
712,
601,
712,
944,
D88,
FAB,
E9A,
723,
400,
400,
400,
400,
400,
500,
500,
500,
500,
622,
B88,
FDD,
EED,
EED,
DEE,
EEE,
EDD,
FDE,
EBC,
B67,
712,
601,
601,
601,
945,
D88,
FAB,
FBB,
C78,
722,
400,
400,
400,
400,
400,
500,
500,
500,
500,
623,
C99,
FEE,
EDD,
EEE,
EEE,
EEE,
EDD,
FDD,
EAB,
945,
612,
601,
612,
945,
D99,
FCC,
FBC,
FBB,
A56,
611,
400,
400,
400,
400,
500,
500,
500,
500,
501,
744,
DAB,
FDD,
EDD,
EEE,
EEE,
EDE,
FDE,
FDE,
EAB,
733,
612,
612,
844,
C89,
FCC,
FCC,
FCD,
EAA,
734,
501,
400,
400,
400,
400,
500,
500,
500,
500,
612,
A67,
EBC,
FDD,
FDE,
EDE,
FEE,
FDE,
FDD,
FCD,
C89,
612,
723,
955,
C89,
FCC,
FDD,
FCC,
FDD,
C89,
622,
511,
400,
400,
400,
400,
500,
500,
500,
501,
723,
C89,
FCD,
FDD,
FEE,
EDD,
EEE,
EDE,
FDD,
FCD,
A78,
734,
A56,
D9A,
EBC,
FDD,
FDD,
FDD,
EBB,
A66,
612,
501,
300,
400,
400,
500,
500,
500,
500,
501,
834,
D9A,
FCD,
FDE,
FEE,
EEE,
FEE,
EDE,
FDE,
ECC,
967,
967,
DAA,
FCC,
FDD,
FDD,
FDD,
FDD,
DAA,
844,
501,
400,
300,
300,
400,
500,
500,
500,
500,
601,
945,
EAB,
FDE,
FDE,
FEE,
EEE,
EEE,
EEE,
FDD,
EBC,
B89,
DAA,
FCD,
FDD,
FEE,
FDD,
FDD,
FCC,
C88,
623,
500,
500,
300,
400,
400,
500,
500,
500,
500,
611,
A67,
FBC,
FDE,
FDE,
EEE,
EEE,
EEE,
EEE,
EDD,
ECC,
DBC,
FDD,
FDD,
FDD,
FDE,
EDD,
FDD,
FCC,
A67,
612,
501,
500,
300,
300,
400,
500,
500,
500,
500,
722,
C88,
FCD,
FDE,
EDD,
EEE,
EEE,
EEE,
EEE,
FEE,
FDE,
FDE,
FDE,
FDD,
FDD,
FDD,
FDD,
FCC,
EBB,
844,
501,
500,
500,
300,
300,
400,
500,
500,
500,
501,
833,
D99,
FDD,
FDD,
EDD,
EEE,
EEE,
EEE,
EEE,
EDE,
FEE,
FDE,
EDD,
FDD,
FDD,
EDD,
FED,
ECC,
B88,
623,
501,
500,
500,
300,
300,
400,
500,
500,
500,
501,
844,
DAA,
FDD,
FDD,
EDE,
EDE,
EEE,
EEE,
EEE,
EEE,
EDE,
EDE,
EDE,
FEE,
FDE,
FDD,
FEE,
ECC,
966,
612,
500,
500,
500,
300,
400,
400,
500,
500,
500,
511,
955,
EBB,
FDD,
EDD,
EDE,
EDE,
EEE,
EEE,
EEE,
EEE,
EDD,
EDE,
EDE,
FDE,
EDD,
FDD,
FDD,
EBB,
844,
511,
500,
500,
400,
400,
400,
400,
500,
500,
500,
612,
A66,
FCC,
FDE,
EDD,
EEE,
EDE,
EDE,
EEE,
EEE,
EEE,
EDE,
EDE,
EDE,
FEE,
FEE,
FDE,
FDD,
DAA,
844,
500,
500,
400,
400,
400,
400,
400,
500,
501,
501,
723,
B88,
FDD,
FDE,
EDE,
EDE,
EDE,
EEE,
EEE,
EEE,
EDE,
EEE,
EEE,
EEE,
EEE,
EDD,
FDD,
FDD,
B78,
622,
400,
400,
400,
400,
400,
400,
400,
500,
501,
501,
734,
DAA,
FDD,
FDE,
EDE,
EEE,
EEE,
EEE,
EDE,
EEE,
EDE,
EEE,
EEE,
EEE,
EDE,
FDD,
FDD,
FDD,
A66,
511,
500,
400,
400,
400,
400,
400,
400,
500,
501,
501,
855,
EBC,
FDE,
EDE,
EEE,
EEE,
EEE,
EDE,
EDE,
EEE,
EEE,
EEE,
EEE,
EEE,
EDD,
FED,
FDD,
FBC,
834,
500,
501,
400,
400,
400,
400,
400,
400,
501,
501,
501,
A67,
FCD,
FDD,
EDE,
EEE,
EEE,
EEE,
EDE,
EEE,
EEE,
EEE,
EEE,
EEE,
EEE,
EEE,
FDD,
FDD,
D99,
622,
500,
501,
400,
400,
400,
400,
400,
400,
501,
501,
512,
C89,
FDD,
EDD,
EDE,
EEE,
EDE,
EEE,
EDE,
EEE,
EEE,
EEE,
EEE,
EEE,
EEE,
FEE,
FDD,
FCC,
A67,
611,
501,
500,
500,
400,
400,
300,
400,
400,
500,
501,
623,
DAB,
FDE,
EDE,
EEE,
EEE,
EEE,
EEE,
EDE,
EEE,
EDE,
EEE,
EDE,
EDE,
EEE,
FEE,
FDD,
EAB,
844,
501,
501,
500,
400,
400,
300,
300,
400,
400,
500,
501,
845,
FCC,
FEE,
EDE,
EEE,
EEE,
EEE,
EDE,
EDE,
EDE,
EDE,
EEE,
EDE,
EEE,
EDE,
FEE,
FCC,
C88,
723,
500,
501,
400,
400,
300,
300,
300,
400,
400,
501,
512,
956,
FCD,
FDE,
EEE,
EEE,
EDE,
EDE,
EDE,
EDE,
EDE,
EDE,
EEE,
EEE,
EEE,
EDE,
FDD,
FCC,
A67,
622,
500,
500,
400,
300,
300,
300,
400,
400,
401,
401,
623,
B89,
FDE,
FDE,
FDE,
EEE,
EDE,
EDE,
FEE,
EDE,
EDE,
EEE,
EEE,
EEE,
FEE,
EDD,
FDD,
EBB,
845,
511,
500,
500,
400,
400,
300,
300,
400,
400,
401,
401,
634,
C9A,
FDE,
FDD,
FDE,
EDE,
EDE,
EDE,
FEE,
EDE,
EDE,
EEE,
EDD,
EDD,
EEE,
FDD,
FDD,
C99,
733,
400,
500,
500,
400,
400,
300,
300,
400,
300,
400,
401,
745,
EBC,
FDE,
FDE,
FDE,
EDE,
EDE,
DCD,
EDD,
FEE,
FEE,
EEE,
EDE,
EDD,
EDD,
FDD,
EBB,
A77,
622,
501,
500,
400,
400,
400,
300,
300,
400,
400,
300,
411,
967,
FCC,
FDE,
FDE,
FDE,
FDE,
DBC,
B9A,
DCC,
FEE,
FEF,
EDE,
EEE,
FEE,
EDD,
FDE,
DAB,
844,
511,
501,
400,
400,
400,
300,
300,
300,
400,
400,
300,
522,
B89,
FCD,
FDE,
FCD,
FCD,
DBC,
A88,
977,
CBB,
EDD,
FEE,
EDD,
EEE,
FEE,
EDD,
FDD,
C99,
623,
501,
500,
400,
400,
400,
300,
300,
300,
400,
400,
400,
623,
C99,
FCD,
FDE,
FDD,
EBC,
B89,
745,
866,
ECC,
EDD,
EDD,
EDD,
EEE,
FEE,
FDD,
FCC,
B77,
612,
501,
500,
400,
400,
300,
300,
300,
200,
400,
400,
511,
845,
DAA,
FCC,
FCD,
FBC,
B88,
845,
634,
A78,
FDD,
FDE,
EDD,
EEE,
EDD,
FDD,
FDD,
EAB,
955,
611,
500,
400,
400,
400,
300,
300,
200,
200,
401,
400,
511,
A66,
EBB,
FCC,
FAB,
B78,
834,
512,
734,
B99,
FDE,
FDD,
FEE,
FEE,
EEE,
EDD,
FDD,
C99,
733,
501,
500,
500,
400,
300,
300,
300,
200,
200,
400,
300,
511,
B77,
FCC,
FBC,
C78,
945,
612,
511,
844,
D9A,
FDD,
FDD,
EED,
EED,
FDD,
FDD,
FDD,
B78,
622,
500,
500,
400,
400,
300,
300,
200,
200,
200,
400,
300,
512,
C88,
FCC,
FAA,
A56,
722,
611,
612,
955,
DAA,
FDD,
FDD,
EDD,
FED,
FDD,
FDD,
FCC,
A67,
612,
500,
500,
400,
300,
300,
300,
200,
200,
200,
400,
400,
733,
D99,
EAA,
C77,
823,
601,
601,
712,
A66,
EBB,
FDD,
EDD,
EDD,
EED,
FDD,
FDD,
EAA,
945,
601,
500,
500,
400,
300,
300,
300,
200,
200,
200,
400,
400,
833,
C88,
C77,
833,
601,
711,
601,
722,
B77,
FCC,
FDE,
EDD,
EDD,
EDD,
FDD,
FDD,
C88,
723,
500,
500,
400,
400,
300,
300,
200,
200,
200,
200,
500,
501,
722,
844,
722,
600,
600,
601,
601,
723,
C88,
FDD,
FDD,
FDD,
FED,
EDD,
FDD,
FCC,
966,
612,
500,
500,
400,
400,
300,
200,
200,
200,
200,
200,
500,
400,
500,
611,
500,
500,
600,
600,
601,
834,
D99,
FDD,
FDD,
FDD,
FED,
FDD,
FDD,
EBB,
834,
501,
500,
500,
400,
300,
300,
200,
200,
200,
200,
200,
500,
500,
500,
500,
500,
500,
600,
500,
601,
955,
EBB,
FDD,
FDD,
FDD,
FDD,
FDD,
FDD,
C99,
622,
500,
500,
500,
400,
300,
300,
200,
200,
200,
200,
200,
400,
500,
500,
400,
500,
500,
600,
500,
611,
A66,
FCC,
FDD,
FDD,
FDD,
EDD,
FDD,
FCC,
B77,
512,
500,
500,
500,
400,
300,
300,
200,
200,
200,
200,
200,
400,
400,
400,
400,
500,
500,
500,
500,
723,
C88,
FCC,
FDD,
FDE,
EDD,
FDD,
FDD,
EBB,
956,
501,
500,
500,
400,
400,
300,
300,
200,
200,
200,
200,
200,
400,
400,
400,
400,
500,
500,
500,
510,
844,
D9A,
FDD,
FDD,
FDE,
FDE,
FDD,
FDD,
D9A,
734,
401,
500,
400,
400,
400,
300,
300,
200,
200,
200,
200,
200,
300,
400,
400,
400,
500,
500,
500,
511,
955,
EBB,
FDD,
FDE,
FDE,
FDE,
FDE,
FCD,
B78,
512,
501,
500,
400,
400,
300,
300,
200,
200,
200,
200,
200,
200,
300,
300,
400,
400,
500,
500,
500,
621,
A66,
FBB,
FDD,
FDE,
FDE,
FDD,
FDD,
EBB,
956,
501,
501,
500,
400,
400,
300,
300,
200,
200,
200,
200,
200,
100,
300,
300,
400,
400,
500,
500,
500,
732,
C88,
FCC,
FDD,
FDD,
FDE,
FDD,
ECC,
C99,
733,
400,
500,
400,
400,
400,
300,
300,
200,
200,
200,
200,
100,
100,
300,
300,
400,
500,
500,
400,
500,
743,
DA9,
FDD,
FDD,
FDD,
FDE,
FCD,
EAB,
A67,
612,
501,
500,
400,
400,
400,
300,
300,
200,
200,
200,
100,
100,
100,
300,
300,
400,
400,
500,
500,
511,
955,
EBB,
FDD,
FDD,
FDD,
FDE,
EBB,
C88,
844,
501,
501,
500,
400,
400,
300,
300,
200,
200,
200,
200,
100,
100,
100,
300,
300,
400,
400,
500,
500,
511,
A77,
FCC,
FDD,
FDD,
FDE,
FDD,
C99,
956,
723,
501,
501,
500,
400,
400,
300,
300,
200,
200,
200,
100,
100,
100,
100,
300,
300,
400,
500,
500,
501,
632,
C98,
FDD,
FDD,
FDD,
FDE,
FCD,
B78,
733,
611,
601,
501,
400,
400,
400,
300,
300,
200,
200,
200,
100,
100,
100,
100,
300,
300,
400,
400,
501,
501,
733,
DAA,
FCC,
FDC,
FDD,
FDE,
ECC,
966,
612,
501,
501,
500,
400,
400,
300,
300,
200,
200,
200,
200,
100,
100,
100,
100,
300,
300,
400,
500,
501,
511,
844,
EBB,
FCC,
FDD,
FDD,
FDD,
EBB,
855,
511,
500,
500,
500,
400,
300,
300,
200,
200,
200,
200,
200,
100,
100,
100,
100,
300,
400,
400,
501,
501,
501,
955,
ECC,
FDD,
FDD,
FDD,
FDD,
DAA,
834,
611,
600,
500,
400,
400,
300,
300,
200,
200,
200,
200,
200,
100,
100,
100,
100,
300,
400,
400,
501,
500,
511,
B87,
FDC,
FDD,
FDD,
FDD,
FDD,
B78,
622,
611,
500,
500,
400,
400,
300,
300,
200,
200,
200,
200,
200,
100,
100,
100,
100,
300,
300,
400,
400,
400,
622,
C99,
FDC,
FDD,
FDD,
FDD,
FDD,
956,
511,
500,
500,
500,
400,
400,
300,
200,
200,
200,
200,
200,
200,
100,
100,
100,
000,
300,
300,
400,
400,
501,
733,
EBB,
FDC,
FDD,
FDD,
FDD,
EBB,
744,
511,
500,
500,
400,
400,
400,
300,
200,
200,
200,
200,
200,
200,
100,
100,
100,
000,
300,
400,
400,
400,
512,
844,
FCC,
FDD,
FDD,
FDD,
FDD,
C89,
622,
511,
500,
500,
400,
400,
300,
300,
200,
200,
200,
200,
200,
100,
100,
100,
000,
000,
400,
400,
501,
401,
512,
967,
FCD,
FDD,
FDD,
FDD,
EBB,
955,
411,
400,
500,
400,
400,
400,
300,
300,
200,
200,
200,
200,
100,
100,
100,
100,
000,
000,
400,
400,
400,
401,
522,
B89,
FDD,
FDD,
FCD,
FCD,
D9A,
744,
511,
400,
500,
400,
400,
300,
300,
300,
200,
200,
200,
100,
100,
100,
100,
100,
000,
000,
400,
400,
400,
401,
633,
DBB,
FDD,
FDD,
FCD,
FCC,
B78,
622,
501,
400,
400,
400,
300,
300,
300,
300,
200,
200,
100,
100,
100,
100,
100,
000,
000,
000,
500,
400,
501,
401,
845,
FCC,
FDD,
FDD,
FDD,
FCC,
966,
511,
500,
400,
400,
400,
300,
300,
300,
300,
200,
200,
100,
100,
100,
100,
100,
000,
000,
000,
500,
400,
501,
511,
967,
FCD,
FDD,
FDD,
FDD,
EAB,
844,
500,
500,
400,
400,
300,
300,
300,
300,
200,
200,
200,
100,
100,
100,
100,
100,
000,
000,
000,
501,
400,
501,
622,
C89,
FCD,
FDD,
FDD,
FCD,
B88,
723,
500,
500,
400,
400,
300,
300,
300,
300,
200,
200,
200,
100,
100,
100,
100,
100,
000,
000,
000,
500,
501,
501,
744,
DAA,
FDD,
FDD,
FDD,
EBB,
966,
612,
500,
500,
400,
400,
300,
300,
300,
200,
200,
200,
100,
100,
100,
100,
100,
100,
000,
000,
000,
400,
501,
501,
955,
EBB,
FDD,
FDD,
FCC,
DAA,
844,
511,
500,
500,
400,
400,
300,
300,
300,
200,
200,
200,
100,
100,
100,
100,
100,
000,
000,
000,
000,
400,
511,
501,
B77,
FCC,
FDD,
FCD,
FDD,
B88,
623,
501,
500,
500,
400,
400,
300,
300,
200,
200,
200,
200,
100,
100,
100,
100,
100,
000,
000,
000,
000,
500,
501,
622,
C89,
FCD,
FDD,
FDD,
ECC,
A66,
612,
500,
500,
400,
300,
400,
300,
300,
200,
200,
200,
200,
100,
100,
100,
100,
100,
000,
000,
000,
000,
601,
501,
834,
EAA,
FCD,
FDD,
FDD,
DAA,
844,
501,
500,
500,
400,
300,
300,
300,
300,
200,
200,
200,
200,
100,
100,
100,
100,
100,
000,
000,
000,
000,
501,
611,
A55,
FBB,
FCD,
FDD,
FDD,
C99,
723,
501,
500,
500,
400,
300,
300,
300,
300,
200,
200,
200,
100,
100,
100,
100,
100,
000,
000,
000,
000,
000,
500,
612,
A66,
FBC,
FDD,
FDD,
FDD,
B77,
612,
601,
601,
500,
400,
300,
300,
300,
200,
200,
200,
100,
100,
100,
100,
100,
100,
000,
000,
000,
000,
000,
601,
712,
B77,
FCC,
FDD,
FDD,
FCC,
956,
611,
601,
501,
500,
300,
300,
300,
300,
200,
200,
200,
100,
100,
100,
100,
100,
100,
000,
000,
000,
000,
000,
601,
723,
C88,
FCC,
FDD,
FED,
DAA,
844,
601,
601,
501,
400,
300,
300,
300,
200,
200,
200,
200,
100,
100,
100,
100,
100,
100,
000,
000,
000,
000,
000,
611,
834,
DAA,
FCC,
FDD,
FDD,
B77,
622,
501,
601,
501,
400,
300,
300,
200,
200,
200,
200,
200,
100,
100,
100,
100,
100,
000,
000,
000,
000,
000,
000,
601,
955,
EBB,
FDD,
FDD,
FDC,
955,
511,
500,
501,
401,
400,
300,
300,
200,
200,
200,
200,
200,
100,
100,
100,
100,
100,
000,
000,
000,
000,
000,
000,
612,
B67,
FCC,
FCD,
FDD,
EBB,
834,
400,
400,
400,
400,
300,
300,
300,
200,
200,
200,
200,
200,
100,
100,
100,
100,
100,
000,
000,
000,
000,
000,
000,
512,
C89,
FDD,
FDD,
FDD,
C99,
622,
400,
400,
400,
400,
300,
300,
300,
300,
200,
200,
200,
200,
100,
100,
100,
100,
100,
000,
000,
000,
000,
000,
000,
512,
D9A,
FDD,
FDD,
FCC,
A66,
511,
501,
400,
400,
300,
300,
300,
300,
300,
200,
200,
200,
200,
100,
100,
100,
100,
100,
000,
000,
000,
000,
000,
000,
734,
EBC,
FDD,
FDD,
DAA,
744,
511,
400,
400,
300,
300,
300,
300,
300,
200,
200,
200,
200,
100,
100,
100,
100,
100,
000,
000,
000,
000,
000,
000,
000,
A78,
FCD,
FDE,
FDD,
C88,
622,
500,
400,
300,
300,
300,
300,
300,
300,
200,
200,
200,
100,
100,
100,
100,
100,
100,
000,
000,
000,
000,
000,
000,
000,
CAB,
FCD,
FDD,
FBC,
A66,
511,
400,
400,
300,
300,
300,
300,
300,
300,
200,
200,
100,
100,
100,
100,
100,
100,
000,
000,
000,
000,
000,
000,
000,
000,
ECD,
FDE,
FDE,
EAB,
845,
501,
400,
400,
300,
300,
300,
300,
300,
200,
200,
100,
100,
100,
100,
100,
100,
100,
000,
000,
000,
000,
000,
000,
000,
000,
EDE,
FEF,
FDD,
B78,
723,
501,
500,
400,
400,
300,
300,
200,
200,
200,
100,
100,
100,
100,
100,
100,
100,
000,
000,
000,
000,
000,
000,
000,
000,
000,
EDE,
FDE,
FCD,
966,
612,
500,
400,
400,
300,
300,
300,
200,
200,
200,
100,
100,
100,
100,
100,
100,
100,
000,
000,
000,
000,
000,
000,
000,
000,
000,
FDE,
FDD,
EAB,
845,
501,
500,
500,
400,
300,
300,
300,
200,
200,
100,
100,
100,
100,
100,
100,
100,
000,
000,
000,
000,
000,
000,
000,
000,
000,
000,
FDE,
ECC,
C89,
723,
501,
500,
400,
400,
300,
300,
200,
200,
200,
100,
100,
100,
100,
100,
100,
000,
000,
000,
000,
000,
000,
000,
000,
000,
000,
000,
FDE,
EBC,
A66,
612,
501,
500,
400,
400,
300,
300,
200,
200,
100,
100,
100,
100,
100,
100,
100,
000,
000,
000,
000,
000,
000,
000,
000,
000,
000,
000,
FDD,
EAB,
845,
511,
500,
500,
400,
400,
300,
300,
200,
100,
100,
100,
100,
100,
100,
100,
000,
000,
000,
000,
000,
000,
000,
000,
000,
000,
000,
000,
FCD,
C99,
733,
501,
400,
500,
400,
300,
300,
200,
200,
100,
100,
100,
100,
100,
100,
100,
000,
000,
000,
000,
000,
000,
000,
000,
000,
000,
000,
000,
FCC,
B78,
622,
501,
400,
400,
400,
300,
300,
200,
200,
200,
100,
100,
100,
100,
100,
100,
100,
000,
000,
000,
000,
000,
000,
000,
000,
000,
000,
000,
FBB,
A66,
612,
511,
500,
400,
400,
300,
300,
200,
200,
200,
200,
100,
100,
100,
100,
100,
100,
000,
000,
000,
000,
000,
000,
000,
000,
000,
000,
000,
FBB,
945,
611,
500,
400,
400,
300,
300,
200,
200,
200,
200,
200,
100,
100,
100,
100,
100,
100,
100,
000,
000,
000,
000,
000,
000,
000,
000,
000,
000,
D89,
723,
501,
500,
500,
400,
300,
300,
200,
200,
200,
200,
200,
200,
100,
100,
100,
100,
100,
000,
000,
000,
000,
000,
000,
000,
000,
000,
000,
000,
A55,
611,
500,
500,
500,
400,
300,
200,
200,
200,
200,
200,
200,
200,
100,
100,
100,
100,
100,
000,
000,
000,
000,
000,
000,
000,
000,
000,
000,
000,
722,
600,
500,
500,
400,
400,
300,
200,
200,
200,
200,
100,
200,
200,
100,
100,
100,
100,
100,
000,
000,
000,
000,
000,
000,
000,
000,
000,
000,
000,
611,
600,
500,
400,
400,
400,
300,
200,
200,
200,
200,
100,
100,
100,
100,
100,
100,
100,
100,
000,
000,
000,
000,
000,
000,
000,
000,
000,
000,
000,
600,
600,
500,
500,
400,
300,
300,
200,
200,
200,
200,
100,
100,
100,
100,
100,
100,
100,
100,
000,
000,
000,
000,
000,
000,
000,
000,
000,
000,
000,
611,
600,
500,
500,
400,
300,
300,
200,
200,
200,
200,
200,
200,
100,
100,
100,
100,
100,
100,
000,
000,
000,
000,
000,
000,
000,
000,
000,
000,
000;
