000000000000
000000000000
000000000000
000000000000
000000000000
000000000000
000000000000
000000010000
000100110001
001101010011
000000000000
000000000000
000000000000
000000000000
000000000000
000000000000
000000000000
000000000000
000000000000
000000000000
000000000000
000000000000
000000000000
000000000000
000000000000
000000000000
000000000000
000000000000
000000000000
000000000000
000000000000
000000000000
000000000000
000000000000
000000000000
000000000000
000000000000
000000000000
000000000000
000000000000
000000000000
000000000000
000000000000
000000000000
000000000000
001000100001
011010000101
100110111000
011010000101
100110111000
011001110110
000000010000
000000000000
000000000000
000000000000
000000000000
000000000000
000000000000
000000000000
000000000000
000000000000
000000000000
000000000000
000000000000
000000000000
000000000000
000000000000
000000000000
000000000000
000000000000
000000000000
000000000000
000000000000
000000000000
000000000000
000000000000
000000000000
000000000000
000000000000
000000000000
000000000000
000000000000
000000000000
000000000000
000000000000
011110010110
100010110111
011110100101
100010110110
010001110010
100010110111
100110111000
100010100111
011010000101
010101110100
010001100011
001101010010
000000100000
000000000000
000000000000
000000000000
000000000000
000000000000
000000000000
000000000000
000000000000
000000000000
000000000000
000000000000
000000000000
000000000000
000000000000
000000000000
000000000000
000000000000
000000000000
000000000000
000000000000
000000000000
000000000000
000000000000
000000000000
000000000000
000000000000
000000000000
011110100110
011110110110
011110110101
011110100100
011110110101
010110010011
010110000011
011110100101
100010110110
100010100110
100010100110
100010110111
100111001000
101011001001
011110010110
000000010000
000000000000
000000000000
000000000000
000000000000
000000000000
000000000000
000000000000
000000000000
000000000000
000000000000
000000000000
000000000000
000000000000
000000000000
000000000000
000000000000
000000000000
000000000000
000000000000
000000000000
000000000000
000000000000
000000000000
000000100000
011010010101
011010100101
011110110101
011110110101
011110110101
011110100101
011110100101
010010000011
010010000011
011110100110
011110110110
011010100101
011110100101
011110100101
100111001000
101011001001
000000010000
000000000000
000000000000
000000000000
000000000000
000000000000
000000000000
000000000000
000000000000
000000000000
000000000000
000000000000
000000000000
000000000000
000000000000
000000000000
000000000000
000000000000
000000000000
000000000000
000000000000
000000000000
000000000000
001101100011
011010010101
011010110101
011010110101
011110110101
011010100100
011110110101
011110100101
011110110101
011110110110
010110010100
001101110010
011110110101
011110110101
011110100101
011010100101
100010110111
101011001001
000000010000
000000000000
000000000000
000000000000
000000000000
000000000000
000000000000
000000000000
000000000000
000000000000
000000000000
000000000000
000000000000
000000000000
000000000000
000000000000
000000000000
000000000000
000000000000
000000000000
000000000000
000000000000
100010110111
010110000011
011110110101
011010100100
011110110101
011110100101
011110110101
011110100100
011110110101
011110110101
011110100101
011110100101
001001100001
011010100101
011110110101
011110110101
011110100101
100111001000
011010000101
000000000000
000000000000
000000000000
000000000000
000000000000
000000000000
000000000000
000000000000
000000000000
000000000000
000000000000
000000000000
000000000000
000000000000
000000000000
000000000000
000000000000
000000000000
000000000000
000000000000
010001010011
011110100110
011010100101
011010100101
011110110101
011110110101
011110110101
011110110100
011110110100
011110110100
011110110101
011010100101
011110110111
010110000100
001101110010
011110100101
011110100101
011110100101
011010100101
101111011010
000000010000
000000000000
000000000000
000000000000
000000000000
000000010001
100110111010
101111101101
000000010000
000000000000
000000000000
000000000000
000000000000
000000000000
000000000000
000000000000
000000000000
000000000000
000000000000
000000000000
100110110111
010110000100
011110110110
011110110101
011010110101
011110110101
011110110101
011110110101
011110100100
011110110101
011010100101
010110010101
010010000100
011010010110
001101100010
010001110011
011110100110
011110110110
010010000011
100011001001
000101000010
000000100001
000000010001
000000000000
000100110010
101111101100
100111011011
100111011100
011010101001
000000000000
000000000000
000000000000
000000000000
000000000000
000000000000
000000000000
000000000000
000000000000
000000000000
010101110100
100010110110
010110010100
011110110101
011110110101
011110110101
011110110101
011010110101
011110110101
011110100101
011110110101
011110110110
010110010110
101011101011
100111001010
011010010111
000101010001
010001110100
010110010101
011010100110
100011001010
101111101100
101111101101
110011101110
101111011101
100010111010
011010101001
011010111010
100011001011
101111101101
000000000000
000000000000
000000000000
000000000000
000000000000
000000000000
000000000000
000000000000
000000000000
000100100000
100111000111
010110000011
011110110101
011110110101
011110110101
011110110101
011010110101
011010110101
011010100100
011110100101
011110110101
011110100110
010110010111
100011011011
100011011011
100011011011
101111111101
011010101000
100111101011
100011011011
100011001010
100011001011
100011001011
101011011100
100111011100
100011001011
100111011011
100011011011
100011011011
100111011100
011001110111
000000000000
000000000000
000000000000
000000000000
000000000000
000000000000
000000000000
000000000000
011110100111
011110100110
010010000011
011010010100
011110110101
011110110101
011110110101
011010110101
011110110101
011110110101
011110110101
011110100101
010110010100
011110111001
100011011011
011111001011
100011011011
100011001011
100011011011
011111001011
100011011011
100011011011
100011011100
011010111010
000001000011
001101110110
100111101100
100011011011
100011011011
100011011011
011110111010
101011001011
000000000000
000000000000
000000000000
000000000000
000000000000
000000000000
000000000000
000000100000
100010111000
011110100110
001101100001
010001110011
001101110010
011010100101
011110110110
011110110101
011110110101
011110110101
011110100101
011110110110
010010000100
011111001001
100011011011
100011011011
100011011011
100011011011
100011011011
100011011011
100011011011
011111011011
100011011100
001001100101
001001100101
000101010100
010110011000
100111011100
100011001011
100011011100
100111001100
100010101010
000000010000
000000000000
000000000000
000000000000
000000000000
000000000000
000000000000
010001110100
011110110111
010110010100
010001110011
010001110011
010010000011
001101110010
010010000011
011010100101
011110110101
011110110101
011110110101
011110110110
010010000100
100011001010
100011011011
100011011011
100011011011
100011011011
100011001011
100011001011
100011011100
011111011011
100111011100
010010000111
001001010101
001001100101
000101010100
000001000011
100011011100
100011001011
100111001011
101111011100
000000010001
000000000000
000000000000
000000000000
000000000000
000000000000
000000000000
010110010100
011110110110
010010000011
010001110011
010001110011
010010000011
010001110010
010010000010
001101110010
010010000010
010010000011
010110010100
010110010100
001110000100
100011011011
100011011011
100011011100
011111001011
100011001011
100011011011
100011011011
100011011011
100011011100
100011011100
001101110110
000001000011
001001010101
001001100101
000001000011
011111001010
100111011100
100111001011
100010101001
100110101010
000000000000
000000000000
000000000000
000000000000
000000000000
000000000000
010010000010
011010100101
010110000011
010001110011
010010000011
010010000011
010010000010
010010000010
010010000011
010001110010
010010000011
001101110011
001101110011
001110000101
100011011011
100011011100
100011001011
100011001011
100111001011
100010111010
101011011100
011110111010
100011011100
100111011100
000001000011
001101100101
000101000011
001001100101
001001100101
100111101100
011110111001
010101110110
100110101010
110011001100
000000010001
000000000000
000000000000
000000000000
000000000000
000000000000
010001110010
010010000011
001101100010
010001110011
010010000011
010010000011
010010000011
010010000010
010010000010
010010000011
010001110011
010001110011
001001100011
011010101000
100011011011
100011011011
100011011011
011110011001
111111111111
010000110011
001100110011
100110111011
011010101001
100111011100
000101010100
001001010101
000101000100
000101010100
100111011100
100111011011
100010111010
001001000011
011101100110
110010111011
011101110110
000000000000
000000000000
000000000000
000000000000
000000000000
010001110010
010001110011
001101100010
010010000011
010001110011
010001110010
001101110010
010010000011
001101110010
001101110011
001101100011
010110000101
101011011011
011010101001
100011011011
100011011011
100111001011
101111001100
110010101011
100001000101
010100110100
100010001000
100010111010
100011001011
100111011100
001001100101
010001110111
100011001011
100011011011
100011001011
101011001011
010001000100
010100110011
111011001100
101010101010
000000000000
000000000000
000000000000
000000000000
000000000000
001001000001
010001110100
010001110011
001101100010
010010000011
010010000011
010001110011
010001110011
010010000100
001001100011
011111001001
100111011011
100011001011
011010101001
100011011011
100011011011
100010111001
111111111111
110010011010
100000110101
100101010110
110110111011
010101100110
101011011100
010010000111
010010010111
100011001011
100011011100
011111011011
100011011011
101011001011
010001000100
011001000100
111011001100
101010111011
000000000000
000000000000
000000000000
000000000000
000000000000
000000010000
010110000101
010001110011
001101100010
001101110010
010010000011
010001110011
010001110100
000001000001
100111011011
100011011011
100011011011
100011011011
011010101001
100011011011
100011011011
010110000111
111111111111
110110101010
100101000101
100000110100
101110001001
001100110010
101111011100
100011001011
001110000110
100011011100
100011011011
011111011011
100011001011
101011011100
001101000011
010101000100
111111111111
100110111010
000000010001
000000000000
000000000000
000000000000
000000000000
000000000000
001101000010
010110000100
010001110011
010001110011
000101010001
010001110101
000101000010
001001100101
010010000111
100011011100
100011011011
100111011011
011010101001
100011011100
100011011100
011010011000
111111111111
111010111100
100000110100
101001000101
100101000101
010101000100
100010011001
100111001011
100011011100
100011011011
100011011011
100011011011
100011001011
101011011100
001101010100
001100110011
111111111111
100010101001
010001100101
000000000000
000000000000
000000000000
000000000000
000000000000
000000000000
001101010011
011010000101
010001110100
010101110101
000101000010
001101100101
001001010101
010010000111
100011011100
011111011011
100011011011
011010111001
011111011011
100011011100
011010011000
111011111111
111111111111
010100110011
011000110011
011000110100
100001110111
100110111010
100111001011
100011011011
100011011011
011111001011
100011011011
100011011011
100011001011
101011001011
100110101010
100010011000
101011001011
011010011000
000000000000
000000000000
000000000000
000000000000
000000000000
000000000000
000000010000
000000010000
001001000011
001001000011
001101100101
001001010101
000101010100
010110011000
100011011100
100011011011
100011011011
011010101001
100011011100
100011011011
100011001011
011010101001
011010011000
100010101010
101111011100
101011011100
100111011100
100011011011
100011011011
100011011011
011111011011
100011011011
011111001011
011111011011
100011011011
100011001011
100111011011
100111011011
101011011100
011110011001
000000000000
000000000000
000000000000
000000000000
000000000000
000000000000
000000000000
000000000000
000100100010
001101010101
001001100101
000101010100
000101010100
100111011100
100011011011
011111011011
100011011011
011010111001
100011011011
100011011011
100011011011
100011011011
100111011100
100111001100
100111011100
100111011100
100111001011
101011011100
101011011100
101011011100
100111001010
101011001011
101011011100
101011011100
101011011100
101011011100
100010111010
010110011000
010110010111
100010101001
000000000000
000000000000
000000000000
000000000000
000000000000
000000000000
000000000000
000000000000
100010111010
001001010100
000001000011
010110011000
100111101101
011111001011
100011011011
011111011011
100011011011
100011011011
100011011011
100011011011
100011011011
100011011011
011110101001
011110011000
100110011000
100010000111
100001110110
011101010101
011001000011
011000110011
011000110011
011101000011
011001000011
011001000011
100001100101
011001000100
001100100010
001101000100
101111101101
001101100101
000000000000
000000000000
000000000000
000000000000
000000000000
000000000000
000000000000
011010000111
101011101101
010110011000
100111011100
100111011100
100011011011
011111011011
100011011100
100011011011
100011011011
100011011011
100011011011
100011011011
011111011011
100011011011
101011011011
010001100100
011101100101
011101000100
100001010100
101101100101
110001110110
111010001000
111010001000
111010011000
111010001000
110110000111
101101110110
100101100110
010101000100
101111011100
100010111010
000101000011
000000000000
000000000000
000000000000
000000000000
000000000000
000000000000
000000000000
101011101101
100011011011
100011011011
100011011011
100011011011
100011011011
100011011011
011111011011
011111011011
100011011011
100011011011
100011011011
100011011011
011111011011
100011011100
100011001011
100110111010
010101000011
100101010101
110110000111
111010001000
111010001000
110110000111
111010001000
110101110111
110110001000
110110001000
110110011000
100101110110
101111001011
100010111010
011110111010
001001010100
001001000100
000000000000
000000000000
000000000000
000000000000
000000000000
001001010100
100111011100
100011011100
100011011100
100011011011
100011011011
100011011011
100011011011
100011011011
100011011011
100011011100
100011011100
100011011011
011111001011
100011011100
011111001011
100011011011
100111001011
100110101001
100101110110
110110011000
110110000111
111010000111
111010000111
111010000111
110110001000
110110001000
110010001000
100101110110
101010111010
100010111010
010110101001
100111011100
100011001011
001001010100
000000010001
000000000000
000000000000
000000000000
000000000000
011010011000
100011011100
100011011100
011110111010
100011011011
100011011011
100011011011
011111011011
100011011011
100011011100
011111001011
100011011100
100011011011
100011011011
010110101001
100011011011
100011011011
100011011011
100111011011
100110111001
100001110110
110110011000
110110001000
111010000111
110110000111
110110001000
110010011000
100001110110
101010111010
011110101001
011010111001
100011011100
100011011011
100011011011
100010111010
100111001100
000000000000
000000000000
000000000000
000000000000
100011001011
100111101101
000101010101
000001000011
100111101100
100011011011
100011011011
100011011011
010110011000
100011011100
100011011100
011111011011
011111011011
100011011011
100011011011
010010000111
100111011100
100111011100
100011011011
100111011011
100110101001
100001110110
100101100110
110010001000
110010001000
101001110110
100001100110
101111001011
011110101001
011010111001
100011011011
011111001011
100011011011
100011011011
100011011011
101011101101
010001100101
000000000000
000000000000
000000000000
101111101101
010010000111
000101010100
000001000011
100111011100
100011011011
100011001011
011010011000
010010000111
100111011100
100011011011
100011011011
100011011011
100011011011
011110111010
010001110110
001101010101
011110011001
100111001011
100111011100
100111011011
101111011100
101111001011
100010011000
100010011000
100110101001
100010011000
010001100110
011010011000
100111011100
100011011011
100011011100
100011011011
100011011011
100011011011
100011001011
101011001100
000000000000
000000000000
000000000000
101111011101
000001000011
001001100101
000101010100
011111001011
100011011100
011010101001
011010011000
010001110110
100011001011
100011011100
100011011011
100011011011
100111101100
000101010100
001101100101
001001000100
000101000011
001001010100
010001110110
010001110110
001101110110
001101110110
010001110110
010001110110
010110000111
011010000111
100010101001
011010011000
011010101001
100011011011
100011011011
011111011011
100011011011
100011011011
100111011011
110011101110
000000010001
000000000000
000000000000
100010111010
001001010100
001001010100
000001000011
100011011100
100011011011
010110011000
011010011000
011110101001
010001110110
100111011100
100011001011
100011011011
100111101100
000101000011
001101010101
001101010101
001001010100
011010011000
010110011000
011010011001
011010011001
011110101001
011110101001
011110011001
000100100010
000000000000
010001010101
100010101001
011110011001
011110111010
100011011011
100011011011
100011011011
100011001011
100010111010
011010000111
011001100110
000000000000
000000000000
011110101001
000101000011
010010000111
100111011100
100011011011
100011001011
011010011000
011010011000
011110011001
010001110110
011110101001
100111011100
100011011011
100011011011
011010011000
001001010100
000101000100
000101010100
100111011100
011010101001
011010011000
011110011000
011010011000
010101110111
001101000100
000000000000
000000000000
000000000000
000000010001
001101010101
011010011000
011110101001
101011101100
101011101101
100110111011
100010101001
100010011000
000000000000
000000000000
000000000000
101011101101
100111011100
100011011100
100011011011
100011011100
011110111010
011010011000
011110011001
011110011001
100010101001
010001100110
011110101001
100111101100
010010010111
000000100001
100011011011
100111011100
100111101100
100011011011
101011101101
010001110110
010001110110
010110011000
101111101101
001000110011
000000000000
000000000000
000000000000
000000000000
000000000000
000000000000
000000010000
000000000000
000000100001
001000110011
010001010101
000000000000
000000000000
000000000000
000000010000
101011011100
100011001011
100011011011
100011011011
100011011011
011010101001
011010011000
011110011001
000000000000
010101100110
011010000111
010101110111
011110101001
100011001011
100011011100
100011011100
100011011011
100011011011
011111001011
100111011100
011010011000
100010101010
101011011100
100111001011
000000000000
000000000000
000000000000
000000000000
000000000000
000000000000
000000000000
000000000000
000000000000
000000000000
000000000000
000000000000
000000000000
000000000000
000000000000
000000000000
100010111010
100111011100
100011001011
100111011100
011110111010
011010011000
100010101010
000000000000
000000000000
000000000000
000000000000
000000000000
001101010100
011110101001
011010101001
011111001011
100011011100
100011011100
100011011100
100111011100
011110011001
011110101001
101111011101
001001000011
000000000000
000000000000
000000000000
000000000000
000000000000
000000000000
000000000000
000000000000
000000000000
000000000000
000000000000
000000000000
000000000000
000000000000
000000000000
000000000000
010001100110
101011011100
100111011100
100010111010
011010011000
100010101001
001101000100
000000000000
000000000000
000000000000
000000000000
000000000000
000000000000
001000110011
011110101001
011110011001
011010101001
011110101001
011110111010
011110101001
101011001100
011010000111
100110111011
000000000000
000000000000
000000000000
000000000000
000000000000
000000000000
000000000000
000000000000
000000000000
000000000000
000000000000
000000000000
000000000000
000000000000
000000000000
000000000000
000000000000
011110001000
010101100110
011110011000
011001110111
011010000111
000100100001
000000000000
000000000000
000000000000
000000000000
000000000000
000000000000
000000000000
000000000000
000000000000
010001010101
010101100110
110011011101
010001010101
110011001100
010101100110
010101100101
100110101001
000000010000
000000000000
000000000000
000000000000
000000000000
000000000000
000000000000
000000000000
000000000000
000000000000
000000000000
000000000000
000000000000
000000000000
000000000000
000000000000
000000000000
000000000000
000000000000
000100100010
011001110110
000000000000
000000000000
000000000000
000000000000
000000000000
000000000000
000000000000
000000000000
000000000000
000000000000
000000000000
000000000000
000000000000
000000010001
000000000000
000000000000
000000000000
001100110011
000000000000
000000000000
000000000000
000000000000
000000000000
000000000000
000000000000
000000000000
000000000000
000000000000
000000000000
000000000000
000000000000
000000000000
000000000000
000000000000
