memory_initialization_radix=16;
memory_initialization_vector=
000,
000,
000,
000,
100,
200,
510,
720,
620,
300,
200,
100,
000,
000,
000,
000,
000,
000,
000,
000,
000,
000,
000,
000,
000,
000,
000,
000,
000,
000,
000,
000,
000,
000,
000,
000,
000,
000,
000,
000,
000,
000,
000,
100,
742,
D85,
D84,
E84,
D84,
D85,
A74,
310,
000,
000,
000,
000,
000,
000,
000,
000,
000,
000,
000,
000,
000,
000,
000,
000,
000,
000,
000,
000,
000,
000,
000,
000,
000,
000,
000,
000,
000,
000,
100,
B85,
E84,
E72,
E72,
E72,
E72,
E72,
E83,
D85,
520,
000,
000,
000,
000,
000,
000,
000,
000,
000,
000,
000,
000,
000,
000,
000,
000,
000,
000,
000,
000,
000,
000,
000,
000,
000,
000,
000,
000,
100,
B74,
E84,
E71,
F71,
F71,
F72,
E71,
E72,
E71,
E83,
D85,
300,
000,
000,
000,
000,
000,
000,
000,
000,
000,
000,
000,
000,
000,
000,
000,
000,
000,
000,
000,
000,
000,
000,
000,
000,
000,
000,
000,
520,
FB7,
D72,
E72,
E71,
E71,
E72,
D83,
E83,
F82,
E72,
E83,
952,
100,
000,
000,
000,
000,
000,
000,
000,
000,
000,
000,
000,
000,
000,
000,
000,
000,
000,
000,
000,
000,
000,
000,
000,
000,
000,
100,
964,
D73,
E71,
E71,
E71,
E72,
C61,
A52,
610,
930,
E83,
E72,
E94,
200,
000,
000,
000,
000,
000,
000,
000,
000,
000,
000,
000,
000,
000,
000,
000,
000,
000,
000,
000,
000,
000,
000,
000,
000,
000,
100,
A74,
E73,
E71,
E72,
E72,
E72,
930,
B86,
B98,
200,
A53,
E73,
E83,
631,
000,
000,
000,
000,
000,
000,
000,
000,
000,
000,
000,
000,
000,
000,
000,
000,
000,
000,
000,
100,
532,
000,
000,
000,
000,
100,
963,
E83,
F71,
E71,
F72,
E71,
D73,
C98,
533,
200,
410,
E84,
E83,
953,
100,
000,
000,
000,
000,
000,
000,
000,
000,
000,
000,
000,
000,
000,
000,
000,
000,
000,
100,
621,
B75,
300,
100,
000,
000,
000,
632,
E83,
F71,
F71,
F71,
F71,
E84,
410,
100,
110,
310,
D73,
E83,
B63,
200,
000,
000,
000,
000,
000,
000,
000,
000,
000,
000,
000,
000,
000,
000,
000,
000,
000,
100,
D75,
D52,
820,
621,
100,
000,
000,
200,
D83,
F71,
E71,
F71,
F72,
E83,
630,
420,
420,
852,
E84,
D72,
D84,
200,
100,
200,
864,
200,
000,
000,
000,
000,
000,
000,
000,
000,
000,
000,
000,
000,
000,
200,
D64,
E52,
D52,
C64,
410,
100,
000,
310,
C62,
E71,
F72,
E71,
E72,
E73,
B62,
720,
B62,
E84,
E72,
E72,
D84,
500,
610,
C84,
D83,
C73,
200,
000,
000,
000,
000,
000,
000,
000,
000,
000,
000,
000,
100,
A64,
D53,
E52,
D52,
C53,
A54,
200,
100,
953,
D83,
E72,
E71,
F72,
E72,
E72,
E72,
E83,
E72,
E72,
E72,
E72,
E83,
930,
F95,
E73,
E71,
E83,
753,
000,
000,
000,
000,
000,
000,
000,
000,
000,
000,
000,
420,
E95,
C62,
C40,
E62,
C52,
C75,
300,
300,
D85,
E73,
F72,
E71,
F71,
E71,
E71,
E71,
E71,
E71,
E72,
E72,
E72,
E71,
E72,
930,
D73,
E82,
C73,
200,
000,
000,
000,
000,
000,
000,
000,
000,
000,
000,
000,
650,
EB4,
D92,
FC5,
FC5,
B50,
C63,
600,
730,
D84,
E72,
F72,
E71,
F71,
E71,
E71,
E71,
F82,
C50,
E72,
E72,
E71,
F71,
F72,
B50,
C72,
E84,
841,
000,
000,
000,
000,
000,
000,
000,
000,
000,
000,
000,
000,
DC6,
FD4,
FD4,
FC4,
FC5,
B60,
C63,
700,
510,
D95,
E73,
E71,
F72,
E72,
E71,
E72,
E72,
E83,
820,
E83,
E72,
E71,
F72,
E72,
E83,
830,
D86,
200,
000,
000,
000,
000,
000,
000,
000,
000,
000,
000,
000,
000,
FE7,
FD4,
FD4,
FD4,
FD5,
B61,
C64,
600,
200,
842,
C72,
E83,
B50,
D72,
E73,
E83,
C62,
820,
A40,
E73,
E72,
F72,
E71,
E72,
E72,
D73,
520,
100,
000,
000,
000,
000,
000,
000,
000,
000,
000,
000,
000,
000,
FE8,
FD4,
FD3,
FC4,
FD5,
C72,
C64,
300,
000,
100,
741,
D95,
D73,
D84,
C74,
830,
841,
A51,
710,
E83,
E72,
E72,
E71,
E71,
E71,
E83,
952,
100,
000,
000,
000,
000,
000,
000,
000,
000,
000,
000,
000,
000,
440,
FE6,
FD4,
FC4,
FB5,
C62,
953,
200,
000,
000,
100,
520,
840,
830,
500,
840,
A51,
B62,
E73,
E72,
E72,
E72,
E71,
E71,
E71,
E72,
D84,
520,
000,
000,
000,
000,
000,
000,
000,
000,
000,
000,
000,
000,
000,
BA5,
FD6,
FC5,
B50,
C63,
631,
100,
000,
000,
000,
100,
400,
941,
C62,
E83,
E73,
E72,
F72,
E72,
E72,
E72,
F72,
F71,
F71,
E71,
E72,
D84,
200,
000,
000,
000,
000,
000,
000,
000,
000,
000,
000,
000,
000,
000,
A83,
FC7,
B63,
B75,
200,
000,
000,
000,
200,
753,
C85,
D73,
E72,
E72,
F72,
E71,
F71,
F72,
E72,
E72,
E71,
E71,
F72,
F71,
F71,
E83,
952,
100,
000,
000,
000,
000,
000,
000,
000,
000,
000,
000,
000,
000,
200,
C85,
300,
200,
000,
000,
000,
421,
D96,
E84,
D72,
E72,
E72,
E72,
E71,
E71,
F71,
E71,
E71,
F71,
F71,
E71,
E71,
F72,
F71,
E71,
E84,
510,
000,
000,
000,
000,
000,
000,
000,
000,
000,
000,
000,
100,
200,
B85,
200,
000,
000,
000,
000,
421,
840,
D83,
E72,
E72,
E72,
E72,
D72,
E82,
E72,
F72,
E71,
E71,
F71,
E71,
E72,
E71,
F71,
E72,
E82,
B62,
100,
000,
000,
000,
000,
000,
000,
000,
000,
000,
000,
000,
530,
A74,
000,
000,
000,
000,
000,
210,
530,
D96,
D85,
D85,
D84,
D84,
C73,
B62,
D62,
E72,
E72,
F71,
F71,
E71,
E72,
E72,
E71,
E71,
E72,
E84,
310,
000,
000,
000,
000,
000,
000,
000,
000,
000,
000,
100,
963,
952,
100,
000,
000,
000,
000,
000,
210,
310,
200,
400,
400,
730,
A84,
951,
A50,
E73,
E72,
E71,
E71,
E71,
E71,
E72,
F72,
E71,
E72,
D83,
853,
100,
000,
000,
000,
000,
000,
000,
000,
000,
000,
200,
D96,
630,
000,
000,
000,
000,
000,
000,
000,
000,
000,
100,
100,
763,
FFA,
FD7,
A50,
E73,
E72,
E72,
E72,
E71,
F71,
E71,
F72,
E71,
E72,
D73,
B74,
100,
000,
000,
000,
000,
000,
000,
000,
000,
100,
963,
C96,
520,
000,
000,
000,
000,
000,
000,
000,
000,
000,
000,
000,
442,
FF9,
FE7,
940,
E72,
E72,
E72,
E72,
F72,
F71,
E71,
E71,
F72,
E72,
E73,
D85,
300,
000,
000,
000,
000,
000,
000,
000,
100,
520,
D95,
963,
531,
000,
000,
000,
000,
000,
000,
000,
000,
000,
000,
000,
210,
FFA,
FE8,
940,
E73,
E71,
E71,
E71,
E71,
E71,
F71,
E71,
E71,
E72,
E72,
D84,
410,
100,
000,
000,
000,
000,
000,
000,
300,
D83,
D84,
863,
210,
000,
000,
000,
000,
000,
000,
000,
000,
000,
000,
000,
000,
EE9,
FE9,
A40,
E72,
F72,
F71,
E71,
E71,
E71,
E71,
E72,
E72,
E71,
D61,
E95,
510,
100,
000,
000,
000,
000,
100,
410,
C84,
E83,
B61,
763,
000,
000,
000,
000,
000,
000,
000,
000,
000,
000,
000,
000,
000,
A96,
EB6,
930,
F83,
E72,
E72,
E71,
E71,
F72,
E71,
F72,
E72,
E72,
B40,
940,
520,
100,
000,
000,
000,
100,
730,
D83,
D73,
D83,
952,
421,
000,
000,
000,
000,
000,
000,
000,
000,
000,
000,
000,
000,
000,
420,
A72,
E82,
E71,
F72,
E72,
E72,
E71,
E71,
F71,
E71,
E71,
E72,
E73,
E84,
952,
631,
420,
420,
752,
C95,
E94,
E72,
E83,
740,
A75,
000,
000,
000,
000,
000,
000,
000,
000,
000,
000,
000,
000,
000,
420,
FB7,
D72,
E72,
E72,
E72,
F72,
E71,
F71,
F71,
F71,
E71,
E72,
E72,
E72,
E72,
E83,
E83,
E83,
E94,
D83,
D73,
D83,
D83,
840,
B96,
100,
000,
000,
000,
000,
000,
000,
000,
000,
000,
000,
000,
000,
100,
FB9,
E94,
E71,
E71,
E71,
E72,
E72,
E72,
E72,
E71,
E72,
E72,
E72,
E72,
E72,
E72,
E72,
E71,
E72,
E71,
E72,
E83,
C73,
740,
C96,
320,
000,
000,
000,
000,
000,
000,
000,
000,
000,
000,
000,
000,
000,
963,
FB6,
D71,
E71,
E71,
E72,
E73,
D72,
C62,
D73,
E72,
E73,
E73,
E73,
E72,
E72,
E72,
E72,
E72,
E72,
D73,
C73,
A62,
640,
CA7,
320,
000,
000,
000,
000,
000,
000,
000,
000,
000,
000,
000,
000,
000,
100,
C85,
E83,
E71,
E71,
E71,
E82,
D62,
C62,
B63,
B63,
C62,
C62,
C62,
C72,
C72,
D72,
D62,
C62,
C62,
B62,
A63,
730,
A75,
B97,
100,
000,
000,
000,
000,
000,
000,
000,
000,
000,
000,
000,
000,
000,
000,
100,
C74,
E72,
E72,
E71,
E71,
E72,
C62,
B63,
A64,
731,
851,
B63,
B62,
A62,
B73,
A62,
A62,
A61,
740,
851,
A84,
CA8,
432,
000,
000,
000,
000,
000,
000,
000,
000,
000,
000,
000,
000,
000,
000,
000,
000,
100,
A53,
E83,
E72,
E72,
E73,
C62,
B63,
B75,
310,
975,
A86,
A85,
A74,
A73,
A63,
A63,
A73,
B95,
CA7,
985,
330,
000,
000,
000,
000,
000,
000,
000,
000,
000,
000,
000,
000,
000,
000,
000,
000,
000,
000,
000,
300,
C74,
D73,
D73,
C63,
B63,
B64,
520,
100,
000,
000,
000,
310,
853,
852,
952,
852,
631,
100,
000,
000,
000,
000,
000,
000,
000,
000,
000,
000,
000,
000,
000,
000,
000,
000,
000,
000,
000,
000,
000,
631,
841,
B63,
B63,
B64,
B64,
A75,
642,
000,
000,
000,
000,
321,
865,
964,
A75,
A75,
A86,
200,
000,
000,
000,
000,
000,
000,
000,
000,
000,
000,
000,
000,
000,
000,
000,
000,
000,
000,
000,
110,
765,
C96,
D96,
B75,
A75,
B75,
A75,
A75,
A86,
100,
000,
000,
000,
000,
000,
100,
000,
100,
000,
000,
000,
000,
000,
000,
000,
000,
000,
000,
000,
000,
000,
000,
000,
000,
000,
000,
000,
000,
000,
221,
321,
510,
500,
410,
310,
310,
300,
300,
310,
000,
000,
000,
000,
000,
000,
000,
000,
000,
000,
000,
000,
000,
000,
000,
000,
000,
000,
000,
000,
000,
000,
000,
000,
000,
000;
