000000000000
000000000000
000000000000
000000000000
000000000000
000000000000
000000000000
000000000000
000000000000
000000000000
000000000000
000000000000
000000000000
000000000000
000000000000
000000000000
000000000000
000000000000
000000000000
000000000000
000000000000
000000000000
000000000000
000000000000
000000000000
001100110010
000000000000
000000000000
000000000000
000000000000
000000000000
000000000000
000000000000
000000000000
000000000000
000000000000
000000000000
000000000000
000000000000
000000000000
000000000000
000000000000
000000000000
000000000000
000000000000
000000000000
000000000000
000000000000
000000000000
000000000000
000000000000
000000000000
000000000000
000000000000
000000000000
000000000000
000000000000
000000000000
000000000000
000000000000
000000000000
000000000000
000000000000
000000000000
000000000000
010001000011
010101010101
001000100010
000000000000
000000000000
000000000000
000000000000
000000000000
000000000000
000000000000
000000000000
000000000000
000000000000
000000000000
000000000000
000000000000
000000000000
000000000000
000000000000
000000000000
000000000000
000000000000
000000000000
000000000000
000000000000
000000000000
000000000000
000000000000
000000000000
000000000000
000000000000
000000000000
000000000000
000000000000
000000000000
000000000000
000000000000
000000000000
000000000000
000000000000
001000010001
010101010100
010101010100
010000110010
000000000000
000000000000
000000000000
000000000000
000000000000
000000000000
000000000000
000000000000
000000000000
000000000000
000000000000
000000000000
000000000000
000000000000
000000000000
000000000000
000000000000
000000000000
000000000000
000000000000
000000000000
000000000000
000000000000
000000000000
000000000000
000000000000
000000000000
000000000000
000000000000
000000000000
000000000000
000000000000
000000000000
000000000000
000000000000
000000000000
000000000000
011001010100
010101000011
100110010110
101010100111
000000000000
000000000000
000000000000
000000000000
000000000000
000000000000
000000000000
000000000000
000000000000
000000000000
000000000000
000000000000
000000000000
000000000000
000000000000
000000000000
000000000000
000000000000
000000000000
000000000000
000000000000
000000000000
000000000000
000000000000
000000000000
000000000000
000000000000
000000000000
000000000000
000000000000
000100010001
010101010100
010000110010
001100110010
000100000000
000100000000
001100010001
010000110010
110111001000
111111111010
011101110100
000000000000
000000000000
000000000000
000000000000
000000000000
000000000000
000000000000
000000000000
000000000000
000000000000
000000000000
000000000000
000000000000
000000000000
000000000000
000000000000
000000000000
000000000000
000000000000
000000000000
000000000000
000000000000
000000000000
000000000000
000000000000
000000000000
000000000000
000000000000
000000000000
000000000000
001000100010
011001010100
010101000011
100110000110
110010111001
001000000000
011001010010
111111111001
111111111001
111111111011
000000000000
000000000000
000000000000
000000000000
000000000000
000000000000
000000000000
000000000000
000000000000
000000000000
000000000000
000000000000
000000000000
000000000000
000000000000
000000000000
000000000000
000000000000
000000000000
000000000000
000000000000
000000000000
000000000000
000000000000
000000000000
000000000000
000000000000
000000000000
000000000000
000000000000
000000000000
001100100010
011001010100
011101100011
111111011010
111111101010
101110100101
111111111001
111111111000
111111111001
101110110111
000000000000
000000000000
000000000000
000000000000
000000000000
000000000000
000000000000
000000000000
000000000000
000000000000
000000000000
000000000000
000000000000
000000000000
000000000000
000000000000
000000000000
000000000000
000000000000
000000000000
000000000000
000000000000
000000000000
000000000000
000000000000
000000000000
000000000000
000000000000
000000000000
000000000000
000000000000
001000010000
100001110101
111111011010
111011011000
110111000110
110111010110
111111111000
111111111000
111111111010
000000000000
000000000000
000000000000
000000000000
000000000000
000000000000
000000000000
000000000000
000000000000
000000000000
000000000000
000000000000
000000000000
000000000000
000000000000
000000000000
000000000000
000000000000
000000000000
000000000000
000000000000
000000000000
000000000000
000000000000
000000000000
000000000000
000000000000
000000000000
000000000000
000000000000
000000000000
000000000000
001000010000
111011011010
111011011001
111011011000
101110100101
111111111001
111111111000
111111111001
011101110100
000000000000
000000000000
000000000000
000000000000
000000000000
000000000000
000000000000
000000000000
000000000000
010001000011
000000000000
000000000000
000000000000
000000000000
000000000000
000000000000
000000000000
000000000000
000000000000
000000000000
000000000000
000000000000
000000000000
000000000000
000000000000
000000000000
000000000000
000000000000
000000000000
000000000000
000000000000
000000000000
000000000000
101110100101
110010110101
110010110101
110010110101
111111111000
111111111001
101110110111
000000000000
000000000000
000000000000
000000000000
000000000000
000000000000
000000000000
000000000000
000000000000
110011001000
111011111010
000000000000
000000000000
000000000000
000000000000
000000000000
000000000000
000000000000
000000000000
000000000000
000000000000
000000000000
000000000000
000000000000
000000000000
000000000000
000000000000
000000000000
000000000000
000000000000
000000000000
011001100010
111011101000
111111111000
111111111000
111111111000
110111000101
111111111000
111111111000
111011101000
000000000000
000000000000
000000000000
000000000000
000000000000
000000000000
000000000000
000000000000
000000000000
110111101000
111111111001
111111111011
010001000001
000000000000
000000000000
000000000000
000000000000
000000000000
000000000000
000000000000
000000000000
000000000000
000000000000
000000000000
000000000000
000000000000
000000000000
000000000000
000000000000
000000000000
111011101010
111111111010
111111111000
111111111000
111111110111
111111111000
111111111000
110010110100
111111111000
110111010111
111111111011
011001010011
000000000000
000000000000
000000000000
000000000000
000000000000
000000000000
000000000000
111111111001
111111111000
111111111000
111111111001
100110000101
000000000000
000000000000
000000000000
000000000000
000000000000
000000000000
000000000000
000000000000
000000000000
000000000000
000000000000
000000000000
000000000000
000000000000
000000000000
111111111010
111111111001
111111111000
111111111000
111111110111
111111110111
111111110111
111111111000
110111000110
111111100111
111111101000
111011010111
111111111011
001100110001
000000000000
000000000000
000000000000
000000000000
000000000000
000000000000
111111111001
111011110111
111111110111
111111111000
111111111001
110111001001
000000000000
000000000000
000000000000
000000000000
000000000000
000000000000
000000000000
000000000000
000000000000
000000000000
000000000000
000000000000
000000000000
111111111011
111111111001
111111111000
111111111000
111111100111
111111111000
111111110111
111111110111
111111111000
111111111000
111111101000
111111111000
111111111000
111111111001
111111111011
000000000000
000000000000
000000000000
000000000000
000000000000
000100000000
111111111010
111111111000
111111111000
111111111000
111111101000
111111111001
111111111011
000100010000
000000000000
000000000000
000000000000
000000000000
000000000000
000000000000
000000000000
000000000000
000000000000
000000000000
100010000100
111111111001
111111110111
111111110111
111111110111
111111111000
111111110111
111111110111
111111111000
111111111000
111111100111
111111110111
111111111000
111111101000
111111111000
111111111001
010001000001
000000000000
000000000000
000000000000
000000000000
001100110001
111111111001
111111111000
111111111000
111111111000
111111111000
111111111000
111111111001
111111111011
001100110000
000000000000
000000000000
000000000000
000000000000
000000000000
000000000000
000000000000
000000000000
000000000000
111111111010
111111111000
111111111000
111111110111
111111110111
111111110111
111111111000
111111110111
111111111000
111111111000
111111111000
111111110111
111111111000
111111111000
111111110111
111111111001
101010100110
000000000000
000000000000
000000000000
000000000000
010101010010
111111111001
111111110111
111111111000
111111111000
111111110111
111111110111
111111111000
111111111001
111111111011
010001000001
000000000000
000000000000
000000000000
000000000000
000000000000
000000000000
000000000000
011001100011
111111111010
111111111000
111111100111
111111111000
111111110111
111111110111
111111110111
111111110111
111111110111
111111111000
111111110111
111111110111
111111111000
111111100111
111111111000
111111111001
101110110111
000000000000
000000000000
000000000000
000000000000
100110010110
111111111010
111111111000
111111111000
111111111000
111111110111
111111110111
111111110111
111111111000
111111111011
001000100000
000000000000
000000000000
000000000000
000000000000
000000000000
000000000000
000000000000
101110110111
111111111001
111111110111
111111111000
111111110111
111111110111
111111110111
111111110111
111111100111
111111111000
111111111000
111111111000
111111111000
111111100111
111111111000
111111111001
111111111010
101110110111
000000000000
000000000000
000000000000
000000000000
000100010000
101110111000
111111111010
111111111001
111111111000
111111111000
111111100111
111111110111
111111111000
111111111010
000000000000
000000000000
000000000000
000000000000
000000000000
000000000000
000000000000
000000000000
111111111011
111111111000
111111110111
111111111000
111111110111
111111110111
111111110111
111111110111
111111111000
111111101001
111111101001
111111011000
111111101001
111111101000
111111111001
100001110010
110111001001
100110010111
000000000000
000000000000
000000000000
000000000000
000000000000
000000000000
010000110000
111011101010
111111111001
111111111000
111111111000
111111110111
111111111001
110111011001
000000000000
000000000000
000000000000
000000000000
000000000000
000000000000
000000000000
000100010000
111111111010
111111111000
111111100111
111111111000
111111110111
111111110111
111111110111
111111110111
111111111000
111111011001
110010000101
110110010110
110010000101
111111111001
110011000101
001000100000
111111111100
010001000010
000000000000
000000000000
000000000000
000000000000
000000000000
000000000000
000000000000
000000000000
011101100011
111111111010
111111111000
111111111000
111111111001
101010100111
000000000000
000000000000
000000000000
000000000000
000000000000
000000000000
000000000000
101010100101
111111111001
111111111000
111111111000
111111101000
111111111000
111111110111
111111110111
111111110111
111111111001
110110010110
111010011000
111010001000
110110000111
111011001000
101110110101
110011000110
111011011001
000000000000
000000000000
000000000000
000000000000
000000000000
000000000000
000000000000
000000000000
000000000000
000000000000
000000000000
111011101000
111111111000
111111111001
011101110100
000000000000
000000000000
000000000000
000000000000
000000000000
000000000000
010001000010
111111111010
111111111000
111111100111
111111110111
111111111000
111111110111
111111110111
111111110111
111111110111
111111111001
110010010110
111010001000
111010001000
110110000111
111011001000
111111111001
111111111001
101010100101
000000000000
000000000000
000000000000
000000000000
000000000000
000000000000
000000000000
000000000000
000000000000
000000000000
000000000000
110111011000
111111111000
111111111001
001100110000
000000000000
000000000000
000000000000
000000000000
000000000000
000000000000
110010111001
111111111001
111111110111
111111110111
111111110111
111111110111
111111110111
111111110111
111111111000
111111100111
111111111001
111011001000
101110000101
110010000110
110110100110
111111111001
111111111000
111111111000
111111111010
000100010000
000000000000
000000000000
000000000000
000000000000
000000000000
000000000000
000000000000
000000000000
000000000000
000000000000
111011101010
111111111000
111111111001
000000000000
000000000000
000000000000
000000000000
000000000000
000000000000
011101100100
100001110100
111111111000
111111110111
111111110111
111111110111
111111110111
111111110111
111111111000
111111111000
111111111000
111111101000
111111111001
111111101001
111111101001
111111111010
111111101000
111111111000
111111111001
111111111011
000000000000
000000000000
000000000000
000000000000
000000000000
000000000000
000000000000
000000000000
000000000000
000000000000
000000000000
111111111011
111111111001
111111111001
000000000000
000000000000
000000000000
000000000000
000000000000
000100010000
101110100111
011101110010
111111100111
111111110111
111111110111
111111110111
111111110111
111111110111
111111111000
111111110111
111111111000
111111111000
110111000110
111111100111
111111111000
111111111001
111111111001
111111111010
110011001001
001100110001
000000000000
000000000000
000000000000
000000000000
000000000000
000000000000
000000000000
000000000000
000000000000
000000000000
000000000000
111111111100
111111101001
111111111001
111111111011
011001100100
000000000000
000000000000
000000000000
101010010111
111111111010
111111111001
111111111000
111111110111
111111110111
111111110111
111111110111
111111110111
111111110111
111111110111
111111111000
111111100111
111111111000
110011000101
111111101000
110011000110
101010100101
010101000001
000000000000
000000000000
000000000000
000000000000
000000000000
000000000000
000000000000
000000000000
000000000000
000000000000
000000000000
000000000000
000000000000
110111011010
111111111011
111111111001
111111111001
111111111010
101010100111
000000000000
000000000000
111111111100
111111111001
111111101000
111111111000
111111111000
111111111000
111111110111
111111110111
111111110111
111111110111
111111111000
111111101000
111111111000
111111110111
111111111000
101110100100
110010110111
000000000000
000000000000
000000000000
000000000000
000000000000
000000000000
000000000000
000000000000
000000000000
000000000000
000000000000
000000000000
000000000000
000000000000
000000000000
000000000000
001100100000
110011000111
111111111001
111111111010
100110010111
000000000000
001100100000
101110100111
111111111001
111111110111
111111111000
111111101000
111111111000
111111110111
111111110111
111111110111
111111110111
111111110111
111111111000
111111111000
111111110111
111111111000
111111111001
110111000111
011101100100
000000000000
000000000000
000000000000
000000000000
001000100010
000100010001
000000000000
000000000000
000000000000
000000000000
000000000000
000000000000
000000000000
000000000000
000000000000
000000000000
000000000000
000100010000
111111111100
010000110010
000000000000
011101100100
100001110011
111011010111
111111110111
111111110111
111111111000
111111110111
111111110111
111111110111
111111110111
111111110111
111111110111
111111111000
111111111000
111111110111
111111110111
111111111000
111111111001
110011001000
010001000001
000000000000
001000100010
010001000100
010101010101
000100010001
000000000000
000000000000
000000000000
000000000000
000000000000
000000000000
000000000000
000000000000
000000000000
000000000000
000000000000
000000000000
101010010111
010101000100
000000000000
101010010110
110010110110
111111111001
111111110111
111111110111
111111110111
111111100111
111111110111
111111110111
111111110111
111111110111
111111111000
111011100110
101010100011
111111110111
111111111000
111111111000
111111111000
111111111001
101010100110
010101010100
010001000100
000000000000
000000000000
000000000000
000000000000
000000000000
000000000000
000000000000
000000000000
000000000000
000000000000
000000000000
000000000000
000000000000
000000000000
000000000000
101010101001
010000110011
000000000000
111111111010
111111111001
111111100111
111111111000
111111110111
111111110111
111111110111
111111110111
111111111000
111111111000
111111111000
111111111000
111111111000
111111111000
110011000101
110010110100
111111111000
111111111001
111111111010
111111111011
011001100101
000000000000
000000000000
000000000000
000000000000
000000000000
000000000000
000000000000
000000000000
000000000000
000000000000
000000000000
000000000000
000000000000
000000000000
000000000000
000000000000
101110101001
001100100001
000000000000
111111111010
111111111000
111111110111
111111110111
111111110111
111111110111
111111110111
111111110111
111111111000
111111111000
111111111000
111111100111
111111111000
111111111000
111111111000
111111111000
110011000101
110011000110
101110110110
010001000001
000000000000
000000000000
000000000000
000000000000
000000000000
000000000000
000000000000
000000000000
000000000000
000000000000
000000000000
000000000000
000000000000
000000000000
000000000000
000000000000
000000000000
101110101010
100110000111
000100000000
111011101001
111111111000
111111110111
111111110111
111111111000
111111110111
111111110111
111111111000
111111111000
111111111000
111111111000
111111110111
111111110111
111111110111
111111110111
111111111000
111111111010
001100100000
000000000000
000000000000
000000000000
000000000000
000000000000
000000000000
000000000000
000000000000
000000000000
000000000000
000000000000
000000000000
000000000000
000000000000
000000000000
000000000000
000000000000
000000000000
000000000000
010000110010
100001110110
101110101000
110011000111
111111111001
111111111000
111111110111
111111100111
111111110111
111111111000
111111110111
111111111000
111111111000
111111100111
111111110111
111111110111
111111110111
111111110111
111111111000
111111111011
000100010000
000000000000
000000000000
000000000000
000000000000
000000000000
000000000000
000000000000
000000000000
000000000000
000000000000
000000000000
000000000000
000000000000
000000000000
000000000000
000000000000
000000000000
000000000000
000000000000
000000000000
000000000000
000000000000
010101000000
111111111001
111111111000
111111100111
111111111000
111111110111
111111110111
111111111000
111111100111
111111111000
111111111000
111111110111
111111100111
111111110111
111111111000
111111111001
111111111011
000000000000
000000000000
000000000000
000000000000
000000000000
000000000000
000000000000
000000000000
000000000000
000000000000
000000000000
000000000000
000000000000
000000000000
000000000000
000000000000
000000000000
000000000000
000000000000
000000000000
000000000000
000000000000
000000000000
001000100000
111011011001
111111111010
111111111000
111111111000
111111111000
111111110111
111111110111
111111111000
111111110111
111111110111
111111111000
111111111000
111111111000
111111101001
111111111011
010101000010
000000000000
000000000000
000000000000
000000000000
000000000000
000000000000
000000000000
000000000000
000000000000
000000000000
000000000000
000000000000
000000000000
000000000000
000000000000
000000000000
000000000000
000000000000
000000000000
000000000000
000000000000
000000000000
000000000000
100001110101
100110000101
101010010110
111111111011
111111111001
111111110111
111111110111
111011100111
111111111000
111111110111
111111110111
111111110111
111111111001
111111111010
111111111011
100001110100
000000000000
000000000000
000000000000
000000000000
000000000000
000000000000
000000000000
000000000000
000000000000
000000000000
000000000000
000000000000
000000000000
000000000000
000000000000
000000000000
000000000000
000000000000
000000000000
000000000000
000000000000
000000000000
000000000000
000000000000
101010011000
000000000000
000000000000
001000100000
101010010101
111011101001
111111111001
111111111010
111111111010
111111111001
111111111001
111111111000
101110110110
011101100010
000000000000
000000000000
000000000000
000000000000
000000000000
000000000000
000000000000
000000000000
000000000000
000000000000
000000000000
000000000000
000000000000
000000000000
000000000000
000000000000
000000000000
000000000000
000000000000
000000000000
000000000000
000000000000
000000000000
000000000000
000000000000
000000000000
000000000000
000000000000
000000000000
000000000000
000000000000
000000000000
000000000000
000000000000
000000000000
000000000000
110111011001
111111111010
111111111011
111111111011
101010101000
000000000000
000000000000
000000000000
000000000000
000000000000
000000000000
000000000000
000000000000
000000000000
000000000000
000000000000
000000000000
000000000000
000000000000
000000000000
000000000000
000000000000
000000000000
000000000000
000000000000
000000000000
000000000000
000000000000
000000000000
000000000000
000000000000
000000000000
000000000000
000000000000
000000000000
000000000000
000000000000
000000000000
000000000000
000000000000
000000000000
000100010000
001000100000
001000100000
001100110001
000100010000
000000000000
000000000000
000000000000
000000000000
000000000000
000000000000
000000000000
000000000000
000000000000
000000000000
