000000000000
000000000000
000000000000
000000000000
000000000000
000000000000
000000000000
000000000000
000000000000
000000000000
000000000000
000000000000
000000000000
000000000000
000000000000
000000000000
000000000000
000000000000
000000000000
000000000000
000000000000
000000000000
000000000000
000000000000
000000000000
000000000000
000000000000
000000000000
000000000000
000000000000
000000000000
000000000000
000000000000
000000000000
000000000000
000000000000
000000000000
000000000000
000000000000
000000000000
000000000000
000000000000
000000000000
000000000000
000000000000
000000000000
000000000000
000000000000
000000000000
000000000000
000000000000
000000000000
000000000000
000000000000
000000000000
000000000000
000000000000
000000000000
000000000000
000000000000
000000000000
000000000000
000000000000
000000000000
000000000000
000000000000
000000000000
000000000000
000000000000
000000000000
000000000000
000000000000
000000000000
000000000000
000000000000
000000000000
000000000000
000000000000
000000000000
000000000000
000000000000
000000000000
000000000000
000000000000
000000000000
000000000000
000000000000
000000000000
000000000000
000000000000
000000000000
000000000000
000000000000
000000000000
000000000000
000000000000
000000000000
000000000000
000000000000
000000000000
000000000000
000000000000
000000000000
000000000000
000000000000
000000000001
000000000000
000000000000
000000000000
000000000000
000000000000
000000000000
000000000000
000000000000
000000000000
000000000000
000000000000
000000000000
000000000000
000000000000
000000000000
000000000000
000000000000
000000000000
000000000000
000000000000
000000000000
000000000000
000000000000
000000000000
000000000000
000000000000
000000000000
000000000000
000000000000
000000000000
000000000000
000000000000
000000000000
000000000000
000000000000
000000000000
000000000000
000000000000
000000000000
000000000000
000000000000
000000000000
000000000000
000000000000
000000000000
000000000000
000000000000
000000000000
000000000000
000000000000
000000000000
000000000000
000000000000
000000000000
000000000000
000000000000
000000000000
000000000000
000000000000
000000000000
000000000000
000000000000
000000000000
000000000000
000000000000
000000000000
000000000000
000000000000
000000000000
000000000000
000000000000
000000000000
000000000000
000000000000
000000000000
000000000000
000000000000
000000000000
000000000000
000000000000
000000000000
000000000000
000000000000
000000000000
000000000000
000000000000
000000000000
000000000000
000000000000
000000000000
000000000000
000000000000
000000000000
000000000000
000000000000
000000000000
000000000000
000000000000
000000000001
000000000001
000000000001
000000000001
000000000000
000000000000
000000000000
000000000000
000000000000
000000000000
000000000000
000000000000
000000000000
000000000000
000000000000
000000000000
000000000000
000000000000
000000000000
000000000000
000000000000
000000000000
000000000000
000000000000
000000000000
000000000000
000000000000
000000000000
000000000000
000000000000
000000000000
000000000000
000000000000
000000000000
000000000000
000000000000
000000000000
000000000000
000000000000
000000000000
000000000000
000000000000
000000000000
000000000000
000000000000
000000000000
000000000000
000000000000
000000000000
000000000000
000000000000
000000000000
000000000000
000000000000
000000000000
000000000000
000000000000
000000000000
000000000000
000000000000
000000000000
000000000000
000000000000
000000000000
000000000000
000000000000
000000000000
000000000000
000000000000
000000000000
000000000000
000000000000
000000000000
000000000000
000000000000
000000000000
000000000000
000000000000
000000000000
000000000000
000000000000
000000000000
000000000000
000000000000
000000000000
000000000000
000000000000
000000000000
000000000000
000000000000
000000000000
000000000000
000000000000
000000000000
000000000000
000000000000
000000000000
000000000000
011010001000
110011101111
101111011110
101011011110
011010101011
011010101011
001101010101
101111011101
110011101110
011010011001
001001010110
001000110100
001000110100
000000000001
000000000000
000000000000
000000000000
000000000001
000000000000
000000000000
000000000000
000000000000
000000000000
000000000000
000000000000
000000000000
000000000000
000000000000
000000000000
000000000000
000000000000
000000000000
000000000000
000000000000
000000000000
000000000000
000000000000
000000000000
000000000000
000000000000
000000000000
000000000000
000000000000
000000000000
000000000000
000000000000
000000000000
000000000000
000000000000
000000000000
000000000001
000000000000
000000000000
000000000000
000000000000
000000000000
000000000000
000000000000
000000000001
000000000001
000000000000
000000000000
000000000000
000000000000
000000000000
000000000000
000000000000
000000000000
000000000000
000000000000
000000000000
000000000000
000000000000
000000000000
000000000000
000000000000
000000000000
000000000000
000000000000
000000000000
000000000000
000000000000
000000000000
000000000000
000000000000
000000000000
000000000000
000000000000
000000000000
000000000000
000000000000
000000000000
000000000000
000000000000
000000000000
000000000000
000000000000
000000000000
000000000000
000000000000
111011111111
111011111111
101011011101
101111111111
011010111100
010010001001
101111011101
010101100110
001101100110
011110111100
001001101000
010110011011
100111011110
110011111111
110011111111
011010101011
010010011010
010010001010
010010001010
010010001001
010110011010
010110011010
011010011010
010110001001
100010101011
100110111100
100010111011
011110011010
010101111000
010001100111
001101100111
011110101011
011110011010
011110011010
011110101011
101011101111
111011111111
110011101111
101111011110
110011111111
100110111100
011010001001
100010101100
011110011010
101011001101
100110111100
011010011010
011010011010
011010001001
011010001001
010110001000
100110111100
101011001110
011010011010
011010011010
010110001001
010001111000
010001111000
001101010110
011010001001
101111111111
011110101011
010001111000
010101111000
010110001001
011010011010
011110011010
011110011010
011110101011
011110011011
100010111100
100110111100
100010101011
001101010110
010001100111
011001111000
010101110111
010001100110
010101100110
010101100110
010101100110
010001100111
010001100111
010101111000
101111011101
110011101111
011110011001
001000110100
000000000000
000000000000
000000000000
000000000000
000000000000
000000000000
000000000000
000000000000
000000000000
000000000000
000000000000
000000000000
111011111111
101011011101
110111111111
011110111100
010010011010
010110011010
000101000100
011110011001
011001110111
110011111111
001101111001
010110101100
010110011011
001001101000
001101111001
010010011011
010010011011
001110011011
001110011011
010010011011
010010101011
010010011010
010010001010
100011001101
101111101111
100011001101
010110011010
100011001110
101111111111
100011001101
011010101100
011010101011
011110111100
010110011010
010010011010
001110001001
001101111001
010001111001
010110001010
010010001001
010010001010
010110011010
010110011010
011010011011
010001111000
010110001001
010110011010
011110111100
110011111111
100011001101
010110011010
010110011010
010010001010
010110011011
010110011011
010110011011
010110011011
010010011010
010110001010
010010001001
001001100111
001101111001
011010111100
101111111111
101011011110
010110011010
010110011010
011010011011
010110011010
011110101100
011010011010
011010011010
010110001001
011110011010
011010011010
011010011001
011110011001
100010101010
101011001100
101111011101
101111001101
101111001101
100111001100
011010001001
010110001000
011010001001
011010011010
010110001001
000100110100
001000110011
000000000000
000000000000
000000000000
000000000000
000000000000
000000000000
000000000000
000000000000
000000000000
000000000000
100110111011
110111111111
110111111111
011010101011
010010001001
001101100111
000000100010
101010111010
110111001011
000100010000
101011001100
110011111111
010001110111
010110001000
011010011011
010110101100
010010011011
010010101011
010010011011
010110111100
011011001101
010110111100
011010111101
011010111101
010110101100
011010101100
011010101100
010010011011
001110011010
010010011010
010010011011
010010011011
010010101011
010110101011
010110101011
010110101100
010110101011
010110101100
010110111100
010110111100
010110111100
010110111100
010110111100
010110101011
010110101011
010110011011
010110011010
010110101011
010010101011
010110101011
010110111100
011010111100
011010101100
011010101100
010110101100
010110111100
010110111100
011010111100
011010111100
011010111100
010110101011
010110011011
010010011011
001110001001
010110011010
011010101100
011010101100
010110011011
011010101011
011010101011
011010011011
100111001101
100010111100
011110101011
100010101011
101011001100
110011011101
101111011100
101011001011
101111001100
100010011010
011010001000
100110111011
101111101110
011110101010
100010111011
011110101100
010001111001
000101000101
010101110111
000000000000
000000000000
000000000000
000000000000
000000000000
000000000000
000000000000
000000000000
000000000000
000000000000
101111011101
100111001101
101111111111
011110111100
001101111000
001101100111
011110011001
000000000000
101010011000
110111001011
010001010110
001101100111
011110011010
011110101010
001101111000
001101111001
010010011010
001110001010
010010011011
010010101011
010010101011
011111001110
011010111100
010110101100
010110101100
010110101011
011110111011
100011001100
100011001100
100011011100
011110111010
011010111011
011010111100
011010111100
011110111011
011110101010
011110101010
011010101010
010110101011
010110101100
011010111011
011010101010
011010101001
011010101001
011110101001
011010011001
011010011001
011010011001
011010011001
010110011001
010110011010
011010011010
011010011001
011010011001
011010011001
010110011010
010010101011
010010101011
010010011011
010110011011
011010011010
011010011010
011010011001
011010011001
011010001000
011010000111
011010001000
011010011000
011110011001
011110011001
011110011000
100010011000
100010011001
100010101010
100010101011
011110101010
011110011001
011110011001
011010011000
011010001000
011110011010
011110011010
011110011010
011010011001
011110101011
100011001101
010110011011
010110011011
001001010111
010001110111
000000000001
000000000000
000000000000
000000000000
000000000000
000000000000
000000000000
000000000000
000000000000
000000000000
101011001101
100111001101
110011111111
011110111100
010010011010
001001010110
010101100111
111111101110
011001010100
101110111011
010001101000
001001101000
001110001001
010110101010
011111001101
011011001100
010010011001
010010011010
100011001110
011010111100
010110101011
011010111100
100111101111
011111001110
011111011110
100011001100
101111011010
101110111000
110010110111
110010110111
101111001000
101011001011
011111001100
011110111100
101111001010
101110111000
110010111000
101111001010
011110111011
011110111011
101111001010
110010111000
110010110111
110010110110
110010110111
110010110111
110010110110
110010110111
110010110111
110010111000
101110111010
101110111001
110010111000
110010110111
101110111000
100110111001
010110011001
010010011011
010110101100
010110011010
100110101001
110010111001
110010110111
110010110110
110110110110
110110110111
110110110110
110110110110
110110110111
110010110111
110110110110
110110110110
110110110111
110010111000
100110101001
011010001001
011010001010
011010011010
010010001001
001110001001
001101111000
010001111001
011010011010
010110001010
011010011010
011010101011
010110101011
010010011011
001110001010
010001111001
000000000001
001000100010
000000000000
000000000000
000000000000
000000000000
000000000000
000000000000
000000000000
000000000000
100111001101
101011101111
110011111111
011010111100
001001111001
010110011010
000000100010
101010101010
111111101110
001101000100
010010001010
010010011011
011111001110
011011001101
010110111011
011111001101
100011011101
100011011110
100111101111
010110101100
011011001101
100111101111
100011011110
101011111111
011011001101
011111001011
110011001001
110110110110
111010110101
111010110101
110110110110
110011011010
100011011101
100011001100
110011001001
110110110110
110110100110
110011001001
011110111011
011110111011
110011001001
110110110101
111010110100
111010110100
111010110101
110110110101
110110110101
111010110110
110110110110
110110110111
110010111001
101110111001
110110110110
111010110101
110110110110
101110110111
011110011001
010110011001
010110001001
011010001000
110010111000
110110110110
110110110101
111010110101
110110110101
111010110101
111010110101
111010100100
111010110101
111010110100
111010110100
111010110101
110110110101
110010111000
100110101010
011010011010
011010011011
010110011011
010110011011
010010011010
001101111000
001001100111
001001010110
010110001001
010001111000
010010001001
001110001010
001110011011
010010011011
100011001101
000000010001
011001100110
000000000000
000000000000
000000000000
000000000000
000000000000
000000000000
000000000000
000000000000
101011001101
101011011110
110011111111
011111001101
001110001010
010010001001
010101111000
011001110111
100010011000
001101010101
001110001010
010010101100
010110111101
011011001101
001110001001
011111001101
100011011101
100111011110
100011011110
100111101111
011011001101
100011101111
011111001101
100011011110
010110111100
011110111011
110111001001
111010110110
110110100101
111010110101
110110110110
110111011010
100011001100
011111001011
110111001001
111010110110
110110100110
110011001001
011110111100
011110111100
110011001001
110110110110
111010110101
111010110100
110110110110
110010110111
110110111000
110010110111
110010111000
101110111001
100010011001
011001110110
110110110111
111010110101
111010110101
110110110110
101010101001
011001110110
011110000110
101110111000
110110110110
111010110101
110110110110
110110110111
110010111000
110010111000
110110110111
110110110110
111010100101
111010110100
111010110100
110110110110
110010110111
101110111001
100010101010
010001111000
010101111001
001101101000
001101111001
010001111001
001101100111
010110001000
011110011001
011010001000
010101110111
010001100111
101111111111
010010011010
011010111100
100111011110
000000100011
010101110111
000000000000
000000000000
000000000000
000000000000
000000000000
000000000000
000000000000
000000000000
101011011110
100111001101
110011111111
100011011110
010010011011
010010001010
010001100111
010101110111
010101100110
011010011000
011111011101
011011011110
011010111101
000101111000
100011011110
011111001101
100111011110
011111001101
011010111100
010110101100
010110111100
011111011110
100011101111
011010111100
011011001101
100111011101
110111001001
111010100101
111010110101
111010110101
111010110101
110111001000
100010111010
100010111010
110010111000
110110100110
110110100110
110010111000
011010101010
011010101010
110010111001
110110100110
111010110101
111010110101
101010010110
011101110100
011001100100
011001100101
010101100101
010101110111
010101111000
010101110111
101110100111
110110110110
111010110101
111010110101
110110111000
011101010011
101010010110
110110110110
110110100100
110110110101
110010110111
100110010110
011001110110
011001110110
011101110101
110110110111
111010100101
111010110100
111010110101
110010100110
011101110101
011001110111
010101111000
010001111001
001001010111
001001010111
001001101000
001101111000
010101100110
111111111111
111111111111
111011101101
100010001000
100110101011
100010111100
100111011110
110011111111
110011111111
100010111011
010101110111
000000010001
000000000000
000000000000
000000000000
000000000000
000000000000
000000000000
000000000000
100110111100
101011011110
101011101110
100111011110
011010111101
001001111000
010001100110
111011101110
010101100101
010001100110
010110101100
001110011011
001110001010
010010011011
010010011011
010010011010
100011011110
010010011010
010010011011
010010101011
011010111100
011111011110
101011111111
100111011110
100011011110
101011001100
110111001001
111010100101
111010110100
111010100100
111010100100
110110110110
101010111001
100010011000
110110110111
111010100110
111010100110
110010100111
010001110110
010001100110
101110100111
111010110110
111010110101
110110110110
100110010111
010101100110
010101100111
010101110111
010001110111
010001111000
010001111000
010001100111
010101100101
110010110111
110110110101
111010110101
111010100110
110110100110
110110110101
111010110101
111010100101
110110110110
101010100111
010001100101
010001100110
010001100110
011001110110
101010100111
111010110110
111010100100
111010110101
101110100110
011001110110
001101100111
001101111000
001101111000
001001100111
001001100111
001001100111
001101100110
101111001011
111011011011
111111101100
100101110110
001000100001
111011101110
100010011001
011110011010
101111101111
101111111111
101011001101
010101111000
011110011001
001000110100
000000000000
000000000000
000000000000
000000000000
000000000000
000000000000
101011001101
100010111100
110111111111
100111101110
010110111101
001110011010
101010101010
101010011000
010001000011
001001000100
001101111001
010010011011
001001111001
001101111001
001001111000
011111001101
011011001101
011111001101
010110101100
010110101011
011111001101
100011101110
100111011110
011010101011
010110011011
011110101010
110010111000
111010100101
111010110100
111010110100
111010110100
110110110101
101110101000
010101010011
110010100110
111010100101
111010100101
110010100111
010001100101
010001100101
101110100110
111010110101
111010110101
110110110110
100110010110
010101010101
010001010101
010001010101
010001010110
001101100110
001101100111
001101100111
010001010101
100110010111
110110110110
111010110101
111010100101
111010100101
111010110100
111010110101
110110100110
101110100111
010001010101
001101100110
001101100111
010001110111
010001100110
101010101000
110110110110
111010110100
110110110110
101110100111
010001100110
001101111001
001101101000
001101111001
001110001001
001101111000
001110001001
010110001000
110111011011
111111101011
100001010011
101110010111
100001100101
111111111110
111011101101
001000110011
110011111111
101111101111
101111101110
011110101011
001001010110
010001100111
001101010101
000000000000
000000000000
000000000000
000000000000
000000000000
100110111100
101011101110
110011111111
101011101111
100011101111
100011011110
010101010101
110010111011
001100110010
010101100110
000101000110
010110101100
100011011110
100111101110
011010111011
011011001100
011011001100
011111001101
011111001101
011111001101
011011001100
011011001100
010010011010
001110001001
010110011010
011010011001
110010111000
111010100101
111010100100
111010110100
111010110100
110110110101
110110110111
101010000100
110110100101
111010110101
110110110101
101110010110
010001010101
010001010101
101110010110
111010110101
111010100100
111010100100
110110100110
101110010110
101110010110
101110100111
101010010110
011110000110
010001100110
001101100111
001101010110
010001010100
110010110111
111010100101
111010110100
111010110100
111010100100
111010110101
110010111000
010101100100
001101010110
010001101000
001101101000
001101100111
010001100110
101010101000
110110100101
111010110100
111010110110
101110100111
010101110111
001101101001
001101111001
001101111001
001110001001
001110001010
010010011010
011010101010
111111111111
111111011011
011101010011
111010111010
110110111010
100001110101
010000110001
010101100101
110111111111
101111101111
101111101111
100111001110
001001010110
001101010110
010001100110
000000000000
000000000000
000000000000
000000000000
000000000000
101011011110
100111011110
110011111111
110011111111
010010101100
011111001101
000100100010
010101000100
001100110010
011110001000
001001010110
001110001001
010110101011
010110101010
001110001000
011010111011
011011001100
011010111011
011010111011
010110101011
011010111011
011011001100
100011101110
010110011010
010010001010
010110001000
110010111000
111010100110
111010110101
111010110100
111010110100
111010110101
110110110101
110010010100
110110100100
110110110101
110110110110
101110100111
010001010101
010001010101
101110010110
111010110101
111010110100
111010110100
111010100101
111010110101
110110110110
110110110110
110110110111
101110101000
001101010101
001001010110
001101010110
010001010100
101010000101
111010110101
111010110100
111010110100
111010110100
110110110101
100010000110
010001010101
010001100111
001101010111
001101101000
001101100111
010001100110
101010101000
110110110110
111010110100
111010110110
101110100111
010001100111
001101111001
001110001010
001110001010
001110001010
010010011011
001110011010
011010101011
101110111011
111011011100
101010000111
011001000010
100110000110
100110000110
010101010011
010101100101
110111111111
110011111111
110011111111
011010111100
001101100111
001101010111
001001000101
000000010001
000000000000
000000000000
000000000000
000000000000
101111011110
101011011110
100111011101
101111111111
010110101100
001001111001
001101010110
010001010100
010001000011
011101110111
001001010110
001101111001
010010011010
001001110111
001110001001
010110101011
010010011010
010010011010
011010101011
001101100111
010010001001
010110011010
100011001101
010010001001
001001010111
010101100110
110010100111
110110110101
111010110101
110010010011
111010110101
111010110101
111010110100
111010100100
110110100100
111010110101
111010110110
101110010110
010001010101
010001010101
101110010110
110110100101
111010110100
111010110100
111010100100
111010110101
111010100101
111010110110
110110100110
101110101000
001101010101
001001010110
001101010110
010101010100
101110010101
111010110101
111010110100
111010110100
111010110100
110110100101
010101010011
010001010110
001101010111
001101100111
001001010111
001101010110
010001010101
101010011000
110110110110
111010110101
111010110101
101110100111
010001110111
001110001010
001110001010
010010001010
010010001010
010010011011
010010101011
010110011010
101111001100
100110000111
100001110110
011101100101
101010011000
011001010101
011110001000
001101010101
110111111111
101011011110
101111111111
100011001101
000101010110
001001010110
000100110100
000000000000
000000000000
000000000000
000000000000
000000000000
101111011110
100111011110
100011001100
100011011110
101011111111
000101010111
010001100110
011110001000
110111011100
001100110011
001101100110
011010101011
100111011110
001110001001
011010101011
001101111000
001110001001
010010011010
000101010110
000101010110
000001000101
010010001001
001101111000
001001010110
010001111000
010001010101
110010100111
111010110101
111010100101
110010010100
110010010100
111010110101
111010110100
111010110100
111010110100
111010100101
111010110110
101110010110
010001010101
010001010100
101110010101
111010110101
111010100100
111010100100
110110110110
110110110110
110010100110
101110010110
101010010110
100001110110
001101010110
001101010110
010001010101
100001110110
110110110110
111010110100
111010110100
111010110100
111010110100
110110110110
100110000111
010001010101
001101010110
001101010111
001001010111
001101010110
001101010101
100110000111
110110100110
111010110101
110110110101
101110100111
010001110111
001110001010
010010011011
010010011011
010010011011
010010101011
010010101100
011111001101
101111011101
101010111010
100001110110
001000010001
001100110011
011001100111
010001010110
000000110011
011010011001
001101100111
010110011001
100011011101
001001010110
001001010110
001001000101
000000000000
000000000000
000000000000
000000000000
000000000000
110011111111
100111001101
100011001101
011111001101
101011111111
000101000101
011001110111
011001100101
110011001010
011001100101
001101100111
010110011010
010110011011
010010011010
001110001001
010110101010
011010111100
010110101011
001001100111
010010001001
001001010110
010010001001
001001100111
001101111000
001101101000
010001010101
110010100110
111010110101
111010110101
110010010100
100101110011
110110110110
111010110101
111010110100
111010110100
111010110101
110110100101
101110100110
001101010100
010001010101
110010100110
111010100100
111110100100
110110100110
010101010011
010001010101
010001010101
010001010101
001101010101
001101010101
001101100110
001101010101
010001010100
101110100111
110110110101
111010110100
111010110100
111010100100
111010110100
111010110101
110010100111
010101010100
010001010110
001001010110
001101010111
001101010110
010001010101
100110000110
111010110110
111010100101
111010110110
101110100111
010110001000
010010101011
010010101011
010010101100
010010111100
010010101100
001010001010
011010111100
001101101000
101011011101
011001110111
010001000101
010101010110
010101100111
001101010101
000100110011
000100110100
000100110100
000000100011
001001000101
001101100111
001001000101
001001000101
000000000000
000000000000
000000000000
000000000000
000000000000
110111111111
011110111011
101011101111
010110011011
101011011111
001101010110
001101000100
001000100001
010001000011
110111011101
001101010110
001001100111
010010001001
100011001101
010010011010
011010111100
010110101011
011010111100
011010101011
010110011010
001101100111
001001010110
010110011010
011010101011
001001100111
001101000100
110010100110
111010110101
110110100101
110010010101
010101000010
101110100111
110110110101
111010110100
111010110100
111010110101
110110110101
101110100110
001101010101
001101010100
110010100110
111010110101
111110110101
110110100110
010101010100
001101010101
001101010110
001101010110
001101010110
001101010110
001001010110
010001010101
100110010110
110110110111
111010110100
111010110100
111010110110
110110100110
111010100101
111010100101
110110110110
101010010110
001101010101
001001010110
001101100111
001101010110
001101010110
100010000111
110110110110
111010100101
111010100110
101110101000
011010101010
010110111101
010010111100
010010111101
010010111101
010010111101
010010111101
010010101011
010110111100
010010001001
000000100011
000000000001
000000010001
000000100010
000000100010
000000110011
001001010110
000100110100
001000110011
000000000001
000000010010
000100110100
001001000101
000000000000
000000000000
000000000000
000000000000
000000000000
110111111111
100010111100
100111101111
010110011011
100010111100
011110011010
001001000100
000000010001
000000000000
110111011101
001101010101
010001100111
001101100111
001101100111
100011001100
011110111100
010110011011
010010001010
010110101011
001110001001
001101111001
001001100111
011010101011
010010011001
001101111000
010101110110
110010110110
111010110101
111010110110
101110010110
010101010100
100010010111
110110100110
111010110101
111010110101
111010100101
111010110110
101010010110
001001010100
001001010100
110010100110
111010110101
111010100100
111010110101
100001110100
010001000010
010001010011
010001000011
010001010100
001101010100
001101010101
010001010011
110110110111
111010110101
111010110101
110110110110
101010010111
101110101000
110110110110
111010100101
111010110110
110010110111
010101110110
010010001000
001101111000
001101111000
010110001001
100110101001
110110110110
111010100101
111010100110
110011001001
011110111100
010111001110
010111011110
010111011110
010011001110
010111011110
011011101111
011011101111
011111101111
011011001101
001110001001
010010001000
011110011001
010110001000
000001000100
001001100111
001101111000
001001010110
000100100010
001000100011
000000000000
000100100010
000100100011
000000000000
000000000000
000000000000
000000000000
000000000000
110111111111
100010111100
100111101111
011010101011
011010011010
100010101011
001001000100
000100100011
011110000111
110011001011
010001000100
110011011101
101011001100
100110111100
100010111011
011010011001
010001111000
010010001001
010110011010
010010001001
001101111001
010110011011
100011001101
001110001000
001101111001
010101110111
110010110111
110110110101
110110110110
101110100111
011001110111
011001110110
110010110111
111010110101
111010110101
111010110101
110110110110
101110100111
010110001000
010110000111
110010110111
111010110101
111010110101
111010100100
110110110110
110110110111
110010110111
110010110111
110010111001
101010101001
011001110110
101110111001
110110110110
111010100101
111010110110
110010100111
011001110110
011110000111
110110111000
110110110110
111010110101
110010110111
100110111010
011010101010
010110101010
011010101011
011010101010
100110111001
110110110110
111010110101
110110110110
110011001001
011010111100
010111001110
010111011110
010111011110
011011101111
011011101111
011111101111
011011101110
011011101111
100011111111
100111111111
101011101110
110011101110
100110111010
101011101110
011010111100
010010011010
011010011010
000000000001
000100010010
000000000001
000100010010
001000110011
000000000000
000000000000
000000000000
000000000000
000000000000
110111111111
100010111100
101011101111
011010101011
010110011010
011110011010
000100100011
101010111011
010101010101
110011001100
011001100101
011101110111
010101100110
010001100110
010001010101
011001110111
011110011010
011110101011
011010011010
010110001001
010110011010
010110001010
011010101011
001101110111
010001111001
010101110111
110010111000
111010110111
110110110111
101110101000
011001110111
011001110111
101110101000
110110110111
110110110101
111010110101
110110100110
110010111000
011110011001
011110011001
110010111001
110110100110
111010110101
111010110100
110110110101
110110110101
110110110101
110110110110
110010100111
101110101000
101010101000
110010111000
110110100110
111010110111
110010111000
011110000110
011010001000
011110011001
101010101001
110010111000
110110100110
110010111000
101010111010
011010011001
010110011001
010110011010
011010101010
100110111010
110110110110
111010100101
110110110110
110011001001
011111001100
011011011110
011011101110
011011101110
100011111111
100011101111
100011101111
100111111111
100111101111
101011111111
101011111111
110011111111
110111101110
100010011001
110011111111
100111011110
011010101011
010001111000
000000000000
000000000000
000000000001
000100010010
000000010001
000000000000
000000000000
000000000000
000000000000
000000000000
110111111111
100111011101
101111111111
010110011001
011010101011
001101100111
000000010010
111011101111
000100010010
011001100110
110111011100
010001010100
001001000100
001001000101
011001110111
010001010101
010001100111
011010001001
011010011001
010110001001
011010101011
010110001001
001101100111
100010111100
010010001001
011010001001
101110111001
110010111001
101110101000
100010000111
011010001000
100010101010
011110000111
101110111000
110010110111
110010110111
110010111000
100110011000
011110101010
100010101011
101010101001
110010101000
110110110111
110110110110
110110110110
110110110110
110110110110
110110110111
111011011011
110111011011
101110101001
101110101000
110010111000
110010111000
101010111001
011110011000
010110011010
010010001001
011110011000
101010111001
101110111000
101110111001
100110111010
101011011101
101111101111
100011001100
100010111011
100111001010
101110111000
110010110111
110010111000
110011011011
101011111111
100111111111
100011111111
100011111111
100111111111
101011111111
101011111111
101011111111
101111111111
101111111111
110011111111
101111101110
011010001000
101010111011
101111101111
101111111111
011110101100
001101100111
000000000000
000000010001
000000010001
000000000000
000000000001
000000000000
000000000000
000000000000
000000000000
000000000000
111011111111
100111001100
101111101111
011010101011
010110011010
010001111001
001001000110
001101000101
101110111100
011101110111
111011111111
010101110111
010101111000
010001111000
010001111000
001101100110
001101100111
100011001101
100011001101
011110111100
100011001101
011110101011
010110001001
011110111011
010110001010
010110001001
011110011001
100010011001
010101110111
010001110111
010101111000
011010001001
010110001000
010110001000
011010011000
011110001000
011001111000
011010001000
011010011001
011010011010
011010001001
011001111000
011010000111
011110000111
011110000111
011001110111
011110000111
100010011001
101010111011
101010111011
011110011001
011010001000
011110001000
011110011000
011110011001
011010011010
010110011010
010110011010
011010011010
011110101010
011110101010
011010011010
011110111011
100011001101
100111011110
101011011110
101011011110
100111011100
101011001011
101011001011
101011011100
101011101101
101011111111
100111111111
100111111111
100111111111
101011111111
101111111111
101111111111
101111111111
101011101110
101011101111
101111111111
101011101110
011110111011
101111101110
101111111111
101111111111
010001111001
010001111000
000000010001
000100010001
000000000001
000000000001
000000000000
000000000000
000000000000
000000000000
000000000000
000000000000
110111111111
101111101110
100010111100
010010001001
010110011010
010110011010
010001111000
000000010010
011001110111
001000110011
011110011001
010001100111
010001101000
011110101100
100010111100
100111001101
011110101011
100111001101
100111011101
100111001101
100111001101
101011011101
101011001101
100110111100
100110111100
100010111100
100010111011
011110101011
100010111011
011110111011
011110101011
011110101010
011110101011
011010011010
010110011001
010110011010
011010011010
011010011010
010110001001
011010011010
011010011011
011010101011
011110101011
011010101010
011010101010
011110101011
011110101011
011110011010
011010011010
011010011010
011010011010
011110101011
011110101010
011010011010
011010011010
011010011010
011010011011
011010011011
011010011010
011010011010
011010011011
011010101011
011010011010
011010101011
011110101011
100111001101
100111011101
101011011110
101011101110
101111111111
101111111111
101011101110
101111111111
101111111111
101111111111
101111111111
101111111111
101111101110
101111111111
101111101111
101011011110
101011011110
101011101110
101011101110
101111101110
101011011101
100111011101
101111101110
100111001101
010001100111
000000100010
001100110011
000000000001
000000000000
000000000000
000000000000
000000000000
000000000000
000000000000
000000000000
110011101110
101111101111
100111001101
010110001001
010110001001
011010011010
011010001001
011010001001
010001010110
011010001001
011110011010
011010011010
011010001001
010001100111
011110011010
011110001001
010001010110
010101100110
011010001000
010101110111
010001010101
010001010101
010001010101
010001010101
010001010101
010101100110
010101100110
010101110111
010101110111
011010001000
011110011001
011110011001
011110011010
100010101011
011110101011
100010111100
100011001100
100010111100
100010111100
100010111100
100010111100
100010111101
100010111100
100111001100
100111001100
100111001101
100111001101
100111001101
100111001101
100111001101
101011001101
100111001101
100111001101
100111001101
100111001101
100111001101
100111001101
101011001101
101011001101
101011001101
101011001110
101011011110
101011011110
101111011110
101111011110
110011101110
110011101110
110011101110
110011101111
110011101111
101111101110
110011101110
110011101111
110011111111
110011101111
110011111111
110011111111
110011111111
110011111111
110011111111
110111111111
110111111111
110011111111
110011111111
110111111111
110111111111
110111111111
111011111111
110011101111
010101110111
000100100010
001100110011
000100010001
000000000000
000000000000
000000000000
000000000000
000000000000
000000000000
000000000000
101111011110
101111101111
100010101011
000000010010
000100100011
010101100110
001001000100
010101100111
010001100111
001101010110
001101010110
010001100111
010001100111
001101000101
010001010101
001101000100
010101010101
011001100110
010101100110
011110001000
011110001000
011101110111
011101110111
011101110111
011101110111
011101110111
011101110111
011101110111
011001110111
011001110111
011001110111
011001111000
011001111000
011010001000
011010001000
011010001001
011010001001
011010001001
011010001001
011010001001
011010001001
011010001000
010101111000
010110001000
010110001000
010101111000
010101111000
010101111000
010001110111
010001100111
010101110111
010001100111
010001100111
010001100111
010001100111
010001100111
010001100110
010001010110
010001010101
010001010110
010001010110
001101010110
001101010110
001101010101
001101010101
010001010101
001101010101
010001010101
010001010110
010001010110
010001100110
010001100110
010001010110
010001100110
010001100110
010001100110
010001010101
010001010101
001101010101
001101010101
010001010101
010001010101
010001100110
010001100110
010001010101
010101100110
010101010110
010001010110
001101000101
000100010010
000100100010
000000000000
000000000000
000000000000
000000000000
000000000000
000000000000
000000000000
000000000000
000000000000
011110001001
100110111011
011010001000
000000010001
000000000000
001000100010
010001000100
010001010101
010001010101
001101010101
001101000100
010001010101
010001010101
010001010101
010101100110
011001100110
011101110110
011001110110
011001110111
011001110111
011001110111
100010011000
101010101010
101010111010
101110111011
101110111011
101110111100
101110111100
101111001100
101110111011
101010111011
101111001100
101110111100
101110111100
101111001100
101111001100
101111001100
101111001100
101111001100
101111001100
101111001100
101111001100
101110111100
101111001100
101111001100
101011001100
101010111011
101010111011
101010111011
101010111011
101010111011
101010111011
101010111011
101010111011
101010111100
101010111011
101010111011
101010111011
101010101010
100110101010
100110101010
100010011001
100010011001
100010011001
100010011001
100010001000
100010011001
100010011010
100010011001
011001110111
010101100101
010001010100
010001000100
010001000100
001101000100
010001000100
010001000100
001100110011
001101000100
001100110011
001100110011
001100110011
010001000100
001101000011
001101000011
001000110011
001000100010
001100110011
001000100011
000100010001
000100010001
000000000000
000000000000
000000000000
000000000000
000000000000
000000000000
000000000000
000000000000
000000000000
000000000000
001101000100
001000100011
000000010001
000000000000
001100110010
001100110011
000100010001
001000110011
001100110100
001100110100
001000110011
001000110011
001101000011
001000110011
000100010001
000000010001
000100100001
001000110010
001000110011
000100100010
001100110011
001101000011
001101000100
001101000100
010001000100
001101000100
001101000100
001000110011
001100110011
001000110011
001101000100
010001000100
010001000100
010001000100
010001000100
010001000100
010001000100
010001000100
010001000100
010001000100
010001000100
001101000100
001101000100
001101000100
001101000100
010001000100
001101000100
001101000100
001101000100
001101000100
001101000100
010001000100
010001000100
010001000101
010001000101
010001000101
010001010101
010101100101
011001100101
011001100110
011001100110
011001100110
010101100101
010101010101
011001100110
011101111000
100110011010
101010111010
101111001011
101111001011
101111001011
110011001100
101110111100
101111001011
101111001011
110010111011
101110111011
100110011001
100010001000
100001110111
100010001000
011110000111
011001100110
011001110110
011001100110
011101110111
011001100110
010001000100
010001000100
000000000000
000000000000
000000000000
000000000000
000000000000
000000000000
000000000000
000000000000
000000000000
000000000000
000000000000
000000000000
000100010010
000100010010
000100100010
000000010001
000000010001
000000000000
000000000001
000000000001
000000000000
000000000000
000000000000
000000000000
000000010001
000000000001
000000000000
000000010001
000000000001
000000010001
000000000000
000000010001
000000010010
000000010001
000000010001
000000010001
000000010001
000000010010
000100100010
000000010001
000000010001
000000010001
000100010010
000100010010
000100010001
000100010001
000100010001
000000010001
000000010001
000000010001
000100010001
000100010010
000100100010
000100100011
000100100011
000100100011
000100100011
000100100011
000100110011
000100110011
000100100011
000100100011
000100100011
000100100010
000100100010
000100100011
000100100011
000100100011
001000100010
001000100010
001000100010
001000110010
001000100010
001000100010
001000100010
001000100010
000100100010
001000100010
001000110010
001000110010
001000110011
001100110011
001000100011
001000100010
001000100010
001000110011
001000100011
001000100011
001000100010
001000100010
001000010010
001000010010
000100100010
001000110011
001100110011
010001000100
011001100110
011001100110
010001000100
001000110011
000000000000
000000000000
000000000000
000000000000
000000000000
000000000000
000000000000
000000000000
000000000000
000000000000
000000000000
000000000000
000000000000
000000010001
000000010001
000100010001
001000100010
000100100010
000100100010
000100010010
000100100011
000100100010
001000100010
001000100011
000100100010
000100100011
000100100010
000100100010
000100100010
001000100011
001000100010
001000100011
001000110011
001000110011
001101000100
001000110100
001101000100
001000110011
000100100010
000100100010
000000010001
000000010001
000000010001
000000010001
000100010001
000000010001
000000010001
000000010001
000000010001
000000010001
000000010001
000000010001
000000010010
000000010010
000000010010
000000010010
000000010010
000000010010
000000010010
000000010010
000000010010
000000010010
000000010001
000000010001
000000010001
000000010001
000000000001
000000000000
000000000000
000000000000
000000000000
000000000000
000000000000
000000000000
000000000000
000000000000
000000000000
000000000000
000000000000
000000000000
000000000000
000000010001
000100010001
000100010001
000000000000
000000010001
000000000001
000000000000
000000000000
000000000000
000000000001
000000000000
000000000000
000000000000
000000000000
000000000000
000100010000
000000000000
000000010001
000100010001
000100100010
000000000000
000000000000
000000000000
000000000000
000000000000
000000000000
000000000000
000000000000
000000000000
000000000000
000000000000
000000000000
000000000000
000000000000
000000000000
000100010001
000100010001
000000010001
000000000001
000000010001
000100010010
000100010001
000000010001
000000000000
000000000000
000000000000
000000000000
000000000000
000000000000
000000000000
000000000000
000000000000
000000000000
000000000000
000000000000
000000000000
000000000000
000000000000
000000000000
000000000000
000000000000
000000000000
000000000000
000000000000
000000000000
000000000000
000000000000
000000000000
000000000000
000000000000
000000000000
000000000000
000000000000
000000000000
000000000000
000000000000
000000000000
000000000000
000000000000
000000000000
000000000000
000000000000
000000000000
000000000000
000000000000
000000000000
000000000000
000000000000
000000000000
000000000000
000000000000
000000000000
000000000000
000000000000
000000000000
000000000000
000000000000
000000000000
000000000000
000000000000
000000000000
000000000000
000000000000
000000000000
000000000000
000000000000
000000000000
000000000000
000000000000
000100010001
000000000000
000000000000
000000000000
000000000000
000000000000
000000000000
000000000000
000000000000
000000000000
000000000000
000000000000
000000000000
000000000000
000000000000
000000000000
000000000000
000000000000
000000000000
000000000000
000000000000
000000000000
000000000000
000000000000
000000000000
000000000000
000000000000
000000000000
000000000000
000000000000
000000000000
000000000000
000000000000
000000000000
000000000000
000000000000
000000000000
000000000000
000000000000
000000000000
000000000000
000000000000
000000000000
000000000000
000000000000
000000000000
000000000000
000000000000
000000000000
000000000000
000000000000
000000000000
000000000000
000000000000
000000000000
000000000000
000000000000
000000000000
000000000000
000000000000
000000000000
000000000000
000000000000
000000000000
000000000000
000000000000
000000000000
000000000000
000000000000
000000000000
000000000000
000000000000
000000000000
000000000000
000000000000
000000000000
000000000000
000000000000
000000000000
000000000000
000000000000
000000000000
000000000000
000000000000
000000000000
000000000000
000000000000
000000000000
000000000000
000000000000
000000000000
000000000000
000000000000
000000000000
000000000000
000000000000
000000000000
000000000000
000000000000
000000000000
000000000000
000000000000
000000000000
000000000000
000000000000
000000000000
000000000000
000000000000
000000000000
000000000000
000000000000
000000000000
000000000000
000000000000
000000000000
000000000000
000000000000
000000000000
000000000000
000000000000
000000000000
000000000000
000000000000
000000000000
000000000000
000000000000
000000000000
000000000000
000000000000
000000000000
000000000000
000000000000
000000000000
000000000000
000000000000
000000000000
000000000000
000000000000
000000000000
000000000000
000000000000
000000000000
000000000000
000000000000
000000000000
000000000000
000000000000
000000000000
000000000000
000000000000
000000000000
000000000000
000000000000
000000000000
000000000000
000000000000
000000000000
000000000000
000000000000
000000000000
000000000000
000000000000
000000000000
000000000000
000000000000
000000000000
000000000000
000000000000
000000000000
000000000000
000000000000
000000000000
000000000000
000000000000
000000000000
000000000000
000000000000
000000000000
000000000000
000000000000
000000000000
000000000000
000000000000
000000000000
000000000000
000000000000
000000000000
000000000000
000000000000
000000000000
000000000000
000000000000
000000000000
000000000000
000000000000
000000000000
000000000000
000000000000
000000000000
000000000000
000000000000
000000000000
000000000000
000000000000
000000000000
000000000000
000000000000
000000000000
000000000000
000000000000
000000000000
000000000000
000000000000
000000000000
000000000000
000000000000
000000000000
000000000000
000000000000
000000000000
000000000000
000000000000
000000000000
000000000000
000000000000
000000000000
000000000000
000000000000
000000000000
000000000000
000000000000
000000000000
000000000000
000000000000
000000000000
000000000000
000000000000
000000000000
000000000000
000000000000
000000000000
000000000000
000000000000
000000000000
000000000000
000000000000
000000000000
000000000000
000000000000
000000000000
000000000000
000000000000
000000000000
000000000000
000000000000
000000000000
000000000000
000000000000
000000000000
000000000000
000000000000
000000000000
000000000000
000000000000
000000000000
000000000000
000000000000
000000000000
000000000000
000000000000
000000000000
000000000000
000000000000
000000000000
000000000000
000000000000
000000000000
000000000000
000000000000
000000000000
000000000000
000000000000
000000000000
000000000000
000000000000
000000000000
000000000000
000000000000
000000000000
000000000000
000000000000
000000000000
000000000000
000000000000
000000000000
000000000000
000000000000
000000000000
000000000000
000000000000
000000000000
000000000000
000000000000
000000000000
000000000000
000000000000
000000000000
000000000000
000000000000
000000000000
000000000000
000000000000
000000000000
000000000000
000000000000
000000000000
000000000000
000000000000
000000000000
000000000000
000000000000
000000000000
000000000000
000000000000
000000000000
000000000000
000000000000
000000000000
000000000000
000000000000
000000000000
000000000000
000000000000
000000000000
000000000000
000000000000
000000000000
000000000000
000000000000
000000000000
000000000000
000000000000
000000000000
000000000000
000000000000
000000000000
000000000000
000000000000
000000000000
000000000000
000000000000
000000000000
000000000000
000000000000
000000000000
000000000000
000000000000
000000000000
000000000000
000000000000
000000000000
000000000000
000000000000
000000000000
000000000000
000000000000
000000000000
000000000000
000000000000
000000000000
000000000000
000000000000
000000000000
000000000000
000000000000
000000000000
000000000000
000000000000
000000000000
000000000000
000000000000
000000000000
000000000000
000000000000
000000000000
000000000000
000000000000
000000000000
000000000000
000000000000
000000000000
000000000000
000000000000
000000000000
000000000000
000000000000
000000000000
000000000000
000000000000
000000000000
000000000000
000000000000
000000000000
000000000000
000000000000
000000000000
000000000000
000000000000
000000000000
000000000000
000000000000
000000000000
000000000000
000000000000
000000000000
000000000000
000000000000
000000000000
000000000000
000000000000
000000000000
000000000000
000000000000
000000000000
000000000000
000000000000
000000000000
000000000000
000000000000
000000000000
000000000000
000000000000
000000000000
000000000000
000000000000
000000000000
000000000000
000000000000
000000000000
000000000000
000000000000
000000000000
000000000000
000000000000
000000000000
000000000000
000000000000
000000000000
000000000000
000000000000
000000000000
000000000000
000000000000
000000000000
000000000000
000000000000
000000000000
000000000000
000000000000
000000000000
000000000000
000000000000
000000000000
000000000000
000000000000
000000000000
000000000000
000000000000
000000000000
000000000000
000000000000
000000000000
000000000000
000000000000
000000000000
000000000000
000000000000
000000000000
000000000000
000000000000
000000000000
000000000000
000000000000
000000000000
000000000000
000000000000
000000000000
000000000000
000000000000
000000000000
000000000000
000000000000
000000000000
000000000000
000000000000
000000000000
000000000000
000000000000
000000000000
000000000000
000000000000
000000000000
000000000000
000000000000
000000000000
000000000000
000000000000
000000000000
000000000000
000000000000
000000000000
000000000000
000000000000
000000000000
000000000000
000000000000
000000000000
000000000000
000000000000
000000000000
000000000000
000000000000
000000000000
000000000000
000000000000
000000000000
000000000000
000000000000
000000000000
000000000000
000000000000
000000000000
000000000000
000000000000
000000000000
000000000000
000000000000
000000000000
000000000000
000000000000
000000000000
000000000000
000000000000
000000000000
000000000000
000000000000
000000000000
000000000000
000000000000
000000000000
000000000000
000000000000
000000000000
000000000000
000000000000
000000000000
000000000000
000000000000
000000000000
000000000000
000000000000
000000000000
000000000000
000000000000
000000000000
000000000000
000000000000
000000000000
000000000000
000000000000
000000000000
000000000000
000000000000
000000000000
000000000000
000000000000
000000000000
000000000000
000000000000
000000000000
000000000000
000000000000
000000000000
000000000000
000000000000
000000000000
000000000000
000000000000
000000000000
000000000000
000000000000
000000000000
000000000000
000000000000
000000000000
000000000000
000000000000
000000000000
000000000000
000000000000
000000000000
000000000000
000000000000
000000000000
000000000000
000000000000
000000000000
000000000000
000000000000
000000000000
000000000000
000000000000
000000000000
000000000000
000000000000
000000000000
000000000000
000000000000
000000000000
000000000000
000000000000
000000000000
000000000000
000000000000
000000000000
000000000000
000000000000
000000000000
000000000000
000000000000
000000000000
000000000000
000000000000
000000000000
000000000000
000000000000
000000000000
000000000000
000000000000
000000000000
000000000000
000000000000
000000000000
000000000000
000000000000
000000000000
000000000000
000000000000
000000000000
000000000000
000000000000
000000000000
000000000000
000000000000
000000000000
000000000000
000000000000
000000000000
000000000000
000000000000
000000000000
000000000000
000000000000
000000000000
000000000000
000000000000
000000000000
000000000000
000000000000
000000000000
000000000000
000000000000
000000000000
000000000000
000000000000
000000000000
000000000000
000000000000
000000000000
000000000000
000000000000
000000000000
000000000000
000000000000
000000000000
000000000000
000000000000
000000000000
000000000000
000000000000
000000000000
000000000000
000000000000
000000000000
000000000000
000000000000
000000000000
000000000000
000000000000
000000000000
000000000000
000000000000
000000000000
000000000000
000000000000
000000000000
000000000000
000000000000
000000000000
000000000000
000000000000
000000000000
000000000000
000000000000
000000000000
000000000000
000000000000
000000000000
