memory_initialization_radix=16;
memory_initialization_vector=
000,
000,
000,
000,
000,
000,
000,
000,
000,
000,
000,
000,
000,
000,
323,
000,
000,
000,
000,
000,
000,
000,
000,
000,
000,
000,
000,
000,
000,
000,
000,
000,
000,
000,
000,
000,
000,
000,
000,
000,
000,
000,
000,
000,
000,
000,
000,
000,
000,
000,
000,
000,
221,
655,
433,
000,
000,
000,
000,
000,
000,
000,
000,
000,
000,
000,
000,
000,
000,
000,
000,
000,
000,
000,
000,
000,
000,
000,
000,
000,
000,
000,
000,
000,
000,
000,
000,
000,
000,
000,
000,
332,
553,
554,
211,
000,
000,
000,
000,
000,
000,
000,
000,
000,
000,
000,
000,
000,
000,
000,
000,
000,
000,
000,
000,
000,
000,
000,
000,
000,
000,
000,
000,
000,
000,
000,
000,
000,
000,
000,
AA7,
996,
442,
654,
000,
000,
000,
000,
000,
000,
000,
000,
000,
000,
000,
000,
000,
000,
000,
000,
000,
000,
000,
000,
000,
000,
000,
000,
000,
000,
000,
000,
000,
000,
000,
000,
000,
000,
000,
774,
FFA,
DC8,
431,
211,
000,
100,
332,
433,
554,
211,
000,
000,
000,
000,
000,
000,
000,
000,
000,
000,
000,
000,
000,
000,
000,
000,
000,
000,
000,
000,
000,
000,
000,
000,
000,
000,
000,
000,
100,
FFB,
FF9,
FF9,
651,
100,
CB9,
987,
543,
655,
321,
000,
000,
000,
000,
000,
000,
000,
000,
000,
000,
000,
000,
000,
000,
000,
000,
000,
000,
000,
000,
000,
000,
000,
000,
000,
000,
000,
000,
000,
BB7,
FF9,
FE8,
FF9,
BA5,
FEA,
EEA,
763,
654,
322,
000,
000,
000,
000,
000,
000,
000,
000,
000,
000,
000,
000,
000,
000,
000,
000,
000,
000,
000,
000,
000,
000,
000,
000,
000,
000,
000,
000,
000,
000,
FFA,
FF8,
FF8,
DD6,
DC6,
ED7,
EE9,
874,
110,
000,
000,
000,
000,
000,
000,
000,
000,
000,
000,
000,
000,
000,
000,
000,
000,
000,
000,
000,
000,
000,
000,
000,
000,
000,
000,
000,
000,
000,
000,
774,
FFA,
FF8,
FF9,
BA5,
ED7,
ED8,
EDA,
210,
000,
000,
000,
000,
000,
000,
000,
000,
000,
000,
000,
000,
000,
000,
000,
000,
000,
000,
000,
000,
000,
000,
000,
000,
000,
000,
000,
000,
000,
000,
000,
BB7,
FF9,
FF8,
CB5,
CB5,
CB5,
BA5,
000,
000,
000,
000,
000,
000,
000,
000,
000,
000,
000,
000,
000,
000,
000,
000,
000,
000,
000,
000,
000,
000,
000,
443,
000,
000,
000,
000,
000,
000,
000,
000,
000,
EE9,
FF9,
FF8,
DC5,
FF8,
FF8,
FF8,
EE8,
662,
000,
000,
000,
000,
000,
000,
000,
000,
000,
000,
000,
000,
000,
000,
000,
000,
000,
000,
000,
000,
FFA,
CC8,
000,
000,
000,
000,
000,
000,
000,
662,
FFB,
DD7,
FF9,
CB4,
FF8,
FF8,
FF7,
FF8,
FF8,
FFA,
EEA,
000,
000,
000,
000,
000,
000,
000,
000,
000,
000,
000,
000,
000,
000,
000,
000,
000,
431,
FFB,
FF9,
DD8,
000,
000,
000,
000,
000,
000,
330,
FFA,
ED7,
FF8,
EE7,
DD6,
FF7,
FF7,
FF7,
FF7,
FF8,
FF8,
FF9,
FFA,
000,
000,
000,
000,
000,
000,
000,
000,
000,
000,
000,
000,
000,
000,
000,
985,
FFA,
FF9,
FF8,
FF9,
000,
000,
000,
000,
000,
000,
FFA,
FF8,
FF8,
FF8,
FE8,
FF8,
FF7,
FF7,
FF7,
FF8,
FE7,
FF8,
FF7,
FF8,
FFB,
000,
000,
000,
000,
000,
000,
000,
000,
000,
000,
000,
000,
000,
DC9,
FF9,
FF8,
FF8,
FF7,
FFA,
000,
000,
000,
000,
000,
442,
FF9,
FF8,
FF8,
FF8,
FF7,
FE7,
FF8,
FF8,
FF8,
FF7,
FF7,
FF7,
FF7,
FE8,
FFA,
884,
000,
000,
000,
000,
000,
000,
000,
000,
000,
000,
110,
FFB,
FF9,
FF8,
FF7,
FF7,
FF8,
FFA,
110,
000,
000,
000,
000,
AA6,
FF9,
FF7,
FF8,
FF8,
FF7,
FF7,
FF8,
FF8,
FF8,
FF8,
FF7,
FF7,
FF7,
FF8,
FF8,
FFA,
000,
000,
000,
000,
000,
000,
000,
000,
000,
331,
FFB,
FF8,
FF8,
FF7,
FF7,
FF7,
FF8,
FFA,
330,
000,
000,
000,
000,
BB7,
FF9,
FF8,
FF7,
FF8,
FF7,
FF7,
FF7,
FF7,
FF7,
FF8,
FF7,
FF7,
FF8,
FE7,
FF8,
FF9,
663,
000,
000,
000,
000,
000,
000,
000,
442,
FFB,
FF9,
FF8,
FF8,
FF7,
FF7,
FF7,
FF8,
FF9,
552,
000,
000,
000,
000,
BB7,
FFA,
FF8,
FF8,
FF7,
FF8,
FF8,
FF7,
FF7,
FF7,
FF8,
FF7,
FF7,
FF7,
FF7,
FF7,
FF9,
BB7,
000,
000,
000,
000,
000,
000,
000,
220,
FFB,
FF8,
FF7,
FF7,
FF7,
FF8,
FF8,
FF8,
FFA,
996,
000,
000,
000,
000,
997,
DC8,
872,
FF9,
FE8,
FEA,
FD9,
FE9,
FE8,
FF8,
FF7,
FF8,
FF8,
FF7,
FF8,
FF7,
FF8,
FFB,
000,
000,
000,
000,
000,
000,
000,
000,
FFA,
FF8,
FF7,
FF7,
FF7,
FF8,
FF8,
FFA,
BB7,
110,
000,
000,
000,
000,
442,
FFB,
220,
CC5,
FE9,
C86,
D87,
C85,
FD8,
FF8,
FF7,
FF8,
FE7,
FF8,
FF8,
FF7,
FF8,
FFA,
110,
000,
000,
000,
000,
000,
000,
000,
DD9,
FF8,
FF7,
FF7,
FF8,
FF9,
EE9,
440,
000,
000,
000,
000,
000,
000,
000,
ED9,
CC6,
CB5,
EC8,
D87,
E88,
E88,
C96,
FF9,
FF7,
FF7,
FF8,
FF8,
FE7,
FF7,
FF8,
FF9,
AA5,
000,
000,
000,
000,
000,
000,
000,
AA7,
FF9,
FF7,
FF8,
FFA,
763,
000,
000,
000,
000,
000,
000,
000,
000,
000,
AA5,
FF9,
FF9,
EC8,
D87,
E88,
E88,
C96,
FF9,
FF7,
FF7,
FF7,
FF8,
FF8,
FF7,
FE7,
FF8,
FFA,
442,
000,
000,
000,
000,
000,
000,
774,
FF9,
FF8,
EE8,
000,
000,
000,
000,
000,
000,
000,
000,
000,
000,
110,
FFA,
FF8,
FE8,
FF9,
DA6,
C86,
C85,
EC8,
FF8,
FF7,
FF8,
FF7,
FF8,
FF7,
FF7,
FF7,
FF7,
FF9,
CB9,
000,
000,
000,
000,
000,
000,
331,
FFA,
FF9,
DD8,
000,
000,
000,
000,
000,
000,
000,
000,
000,
000,
000,
FFB,
FF9,
FF9,
FE8,
FFA,
FD9,
FE9,
FF9,
FE8,
FF7,
FF8,
FF8,
FF7,
FF7,
FF7,
FF7,
FF7,
FF9,
874,
664,
000,
000,
000,
000,
000,
000,
FFA,
FF9,
EEA,
000,
000,
000,
000,
000,
000,
000,
000,
000,
000,
000,
331,
CC9,
FFA,
FF9,
FF9,
FF8,
FE8,
DC6,
FF8,
FF7,
FF7,
FF7,
FF7,
FF7,
FF7,
FF7,
FF8,
FE8,
772,
BA7,
110,
000,
000,
000,
000,
000,
FF9,
FF9,
FFB,
000,
000,
000,
000,
000,
000,
000,
000,
000,
000,
000,
000,
000,
541,
AA5,
CC5,
FF8,
CC5,
FF8,
FE7,
FF7,
FF7,
FF7,
FF7,
FF7,
FF7,
FF7,
FE7,
FF8,
FF9,
FFA,
A97,
000,
000,
000,
664,
FFB,
FF9,
FF9,
FFB,
000,
000,
000,
000,
000,
000,
000,
000,
000,
000,
000,
000,
000,
000,
000,
CB6,
BB4,
FF8,
FF8,
FF8,
FF7,
FF7,
FF7,
FF8,
FF7,
FF7,
FF7,
FF8,
FE8,
FF8,
FF9,
FFC,
000,
000,
AA7,
FFA,
FF9,
FF9,
FFA,
DD9,
000,
000,
000,
000,
000,
000,
000,
000,
111,
222,
000,
000,
000,
000,
763,
CC7,
FF9,
FF8,
FF8,
FF8,
FF8,
FF7,
FF7,
FF7,
FF7,
FF7,
FF7,
FE7,
FF7,
FF7,
FF9,
BB6,
320,
000,
A97,
FFA,
FF9,
CC7,
330,
000,
000,
000,
000,
000,
000,
000,
000,
000,
111,
555,
444,
222,
000,
441,
DC7,
FF8,
FF7,
FE7,
FF8,
FF9,
FF8,
FF8,
FF8,
FF8,
FF7,
FF7,
FF7,
FF7,
FF7,
FF8,
ED7,
873,
764,
000,
432,
FFB,
110,
000,
000,
000,
000,
000,
000,
000,
000,
000,
000,
000,
000,
000,
001,
444,
554,
BA6,
FF9,
FF7,
FF7,
FF8,
FF8,
AA3,
EE7,
FF8,
FE7,
FE7,
FF7,
FF7,
FE7,
FF7,
FF7,
FE8,
FF9,
CB6,
A96,
000,
543,
A97,
100,
000,
000,
000,
000,
000,
000,
000,
000,
000,
000,
000,
000,
000,
000,
000,
665,
FFB,
FFA,
FF9,
FF8,
CB5,
CC5,
FF8,
FF7,
FF8,
FF7,
FF7,
FF7,
FF8,
FF8,
FF7,
FF7,
FF8,
FE8,
FF9,
FFA,
000,
433,
BA8,
000,
000,
000,
000,
000,
000,
000,
000,
000,
000,
000,
000,
000,
000,
000,
000,
000,
441,
BB7,
CB6,
CC6,
FF8,
FF8,
FF7,
FF8,
FE7,
FF7,
FF7,
FF7,
FF8,
FF8,
FF7,
FF7,
FF8,
FF8,
FF8,
FFA,
000,
321,
BA9,
000,
000,
000,
000,
000,
000,
000,
000,
000,
000,
000,
000,
000,
000,
000,
000,
000,
000,
000,
330,
FFA,
FF8,
FF7,
FF8,
FF8,
FE7,
FF8,
FF7,
FF7,
FF8,
FE8,
FF7,
FF8,
FF7,
FF8,
FF8,
FE8,
100,
987,
BAA,
100,
000,
000,
000,
000,
000,
000,
000,
000,
000,
000,
000,
000,
000,
000,
000,
000,
000,
000,
110,
FFA,
FF8,
FF7,
FF8,
FF8,
FE7,
FE7,
FF7,
FF8,
FF8,
FF8,
FF7,
FE7,
FF7,
FF8,
FF8,
DC7,
BA8,
876,
432,
000,
000,
000,
000,
000,
000,
000,
000,
000,
000,
000,
000,
000,
000,
000,
000,
000,
000,
000,
000,
FFA,
FF8,
FF7,
FF8,
FE7,
FF7,
FF7,
FF7,
FF7,
FF7,
FF7,
FF7,
FF7,
FE7,
FF8,
FFA,
540,
000,
000,
000,
000,
000,
000,
000,
000,
000,
000,
000,
000,
000,
000,
000,
000,
000,
000,
000,
000,
000,
000,
000,
551,
FFA,
FF8,
FF8,
FF8,
FF8,
FF7,
FF7,
FF8,
FF8,
FF7,
FF8,
FF8,
FF8,
FFA,
ED9,
220,
000,
000,
000,
000,
000,
000,
000,
000,
000,
000,
000,
000,
000,
000,
000,
000,
000,
000,
000,
000,
000,
000,
000,
000,
774,
FFB,
FF9,
FF8,
FF7,
FF7,
FF7,
FF8,
EE7,
FF8,
FF8,
FF9,
FFA,
A95,
985,
875,
000,
000,
000,
000,
000,
000,
000,
000,
000,
000,
000,
000,
000,
000,
000,
000,
000,
000,
000,
000,
000,
000,
000,
000,
000,
000,
772,
BB5,
FF8,
FF9,
FF9,
FFA,
FFA,
FFA,
EE9,
A95,
220,
000,
000,
AA8,
000,
000,
000,
000,
000,
000,
000,
000,
000,
000,
000,
000,
000,
000,
000,
000,
000,
000,
000,
000,
000,
000,
000,
000,
000,
AA7,
FFB,
FFB,
FFB,
DDA,
000,
000,
000,
000,
000,
000,
000,
000,
000,
000,
000,
000,
000,
000,
000,
000,
000,
000,
000,
000,
000,
000,
000,
000,
000,
000,
000,
000,
000,
000,
000,
000,
000,
000,
110,
331,
220,
220,
100,
000,
000,
000,
000,
000,
000,
000,
000,
000,
000,
000,
000,
000,
000,
000,
000,
000,
000,
000,
000,
000,
000,
000,
000,
000;
