# compile verilog/system verilog design source files
verilog xil_defaultlib  "../../../lab3_1.srcs/sources_1/new/clock_divider.v"
verilog xil_defaultlib  "../../../lab3_1.srcs/sources_1/new/lab3_1.v"

# compile glbl module
verilog xil_defaultlib "glbl.v"

# Do not sort compile order
nosort
