memory_initialization_radix=16;
memory_initialization_vector=
000,
000,
000,
000,
000,
000,
000,
000,
000,
000,
000,
000,
000,
000,
000,
000,
000,
000,
000,
000,
000,
000,
000,
000,
000,
332,
000,
000,
000,
000,
000,
000,
000,
000,
000,
000,
000,
000,
000,
000,
000,
000,
000,
000,
000,
000,
000,
000,
000,
000,
000,
000,
000,
000,
000,
000,
000,
000,
000,
000,
000,
000,
000,
000,
000,
443,
555,
222,
000,
000,
000,
000,
000,
000,
000,
000,
000,
000,
000,
000,
000,
000,
000,
000,
000,
000,
000,
000,
000,
000,
000,
000,
000,
000,
000,
000,
000,
000,
000,
000,
000,
000,
000,
000,
000,
211,
554,
554,
432,
000,
000,
000,
000,
000,
000,
000,
000,
000,
000,
000,
000,
000,
000,
000,
000,
000,
000,
000,
000,
000,
000,
000,
000,
000,
000,
000,
000,
000,
000,
000,
000,
000,
000,
000,
000,
000,
654,
543,
996,
AA7,
000,
000,
000,
000,
000,
000,
000,
000,
000,
000,
000,
000,
000,
000,
000,
000,
000,
000,
000,
000,
000,
000,
000,
000,
000,
000,
000,
000,
000,
000,
111,
554,
432,
332,
100,
100,
311,
432,
DC8,
FFA,
774,
000,
000,
000,
000,
000,
000,
000,
000,
000,
000,
000,
000,
000,
000,
000,
000,
000,
000,
000,
000,
000,
000,
000,
000,
000,
000,
000,
000,
000,
000,
222,
654,
543,
986,
CB9,
200,
652,
FF9,
FF9,
FFB,
000,
000,
000,
000,
000,
000,
000,
000,
000,
000,
000,
000,
000,
000,
000,
000,
000,
000,
000,
000,
000,
000,
000,
000,
000,
000,
000,
000,
000,
000,
000,
322,
654,
763,
FDA,
FEA,
BA5,
FF9,
FF8,
FF9,
BB7,
000,
000,
000,
000,
000,
000,
000,
000,
000,
000,
000,
000,
000,
000,
000,
000,
000,
000,
000,
000,
000,
000,
000,
000,
000,
000,
000,
000,
000,
000,
000,
210,
875,
FDA,
ED8,
DC6,
DD6,
FF8,
FF8,
FFA,
000,
000,
000,
000,
000,
000,
000,
000,
000,
000,
000,
000,
000,
000,
000,
000,
000,
000,
000,
000,
000,
000,
000,
000,
000,
000,
000,
000,
000,
000,
000,
000,
210,
EDA,
ED9,
ED8,
BA5,
FF9,
FF8,
FF9,
774,
000,
000,
000,
000,
000,
000,
000,
000,
000,
443,
000,
000,
000,
000,
000,
000,
000,
000,
000,
000,
000,
000,
000,
000,
000,
000,
000,
000,
000,
000,
000,
000,
000,
BA5,
CB5,
CB5,
CB5,
FF8,
FF9,
BB7,
000,
000,
000,
000,
000,
000,
000,
000,
000,
CC8,
EFA,
000,
000,
000,
000,
000,
000,
000,
000,
000,
000,
000,
000,
000,
000,
000,
000,
000,
000,
000,
000,
662,
EE8,
FF8,
FF8,
FF8,
DC5,
FF8,
FF8,
EE8,
000,
000,
000,
000,
000,
000,
000,
000,
000,
DE8,
FF9,
FFB,
441,
000,
000,
000,
000,
000,
000,
000,
000,
000,
000,
000,
000,
000,
000,
000,
000,
000,
EEA,
FFA,
FF8,
FF8,
FF7,
FF8,
FF8,
CB4,
FF8,
DD7,
FFB,
653,
000,
000,
000,
000,
000,
000,
000,
FF9,
FF8,
FF8,
FF9,
985,
000,
000,
000,
000,
000,
000,
000,
000,
000,
000,
000,
000,
000,
000,
000,
FFA,
FF9,
FF8,
FF8,
FF7,
FF7,
FF7,
FF8,
DC6,
FE7,
FE8,
ED7,
FFB,
331,
000,
000,
000,
000,
000,
000,
FF9,
EF7,
FF7,
FF8,
FF9,
DC9,
000,
000,
000,
000,
000,
000,
000,
000,
000,
000,
000,
000,
000,
FFB,
FF9,
FF8,
FF8,
FE7,
FF8,
FF7,
FF7,
FF8,
FF8,
FE8,
FF8,
FF8,
FF9,
FFB,
000,
000,
000,
000,
000,
100,
FFA,
FF8,
FF8,
FF8,
FE8,
FF9,
FFB,
110,
000,
000,
000,
000,
000,
000,
000,
000,
000,
000,
884,
FF9,
FF7,
FF7,
FF7,
FF8,
FF7,
FF7,
FF8,
FF8,
FE7,
FF7,
FF8,
FE8,
FF8,
FF9,
441,
000,
000,
000,
000,
331,
FF9,
FF8,
FF8,
FF8,
FF8,
FF8,
FF9,
FFB,
330,
000,
000,
000,
000,
000,
000,
000,
000,
000,
FFA,
FF8,
FF8,
FF7,
FF7,
FF7,
FF8,
FF7,
FF8,
FF8,
FF8,
FF7,
FF8,
FF8,
FF7,
FF9,
AA6,
000,
000,
000,
000,
552,
FF9,
FF7,
FF8,
FF8,
FF7,
FF7,
FF8,
FF9,
FFB,
441,
000,
000,
000,
000,
000,
000,
000,
663,
FFA,
FF8,
FE7,
FF8,
FF7,
FF7,
FF7,
FF7,
FF7,
FF8,
FF7,
FF7,
FF8,
FE7,
FF8,
FF9,
BB7,
000,
000,
000,
000,
996,
FFA,
FF8,
FF8,
FF8,
FF7,
FF7,
FF7,
FF8,
FFB,
220,
000,
000,
000,
000,
000,
000,
000,
BB7,
FF9,
FF7,
FF8,
FF7,
FF7,
FF7,
FF7,
FE7,
FF8,
FF8,
FF8,
FF8,
FE7,
FF8,
FF9,
FFA,
BB7,
000,
000,
000,
000,
110,
BB8,
FFA,
FF9,
FF8,
FF8,
FE7,
FF7,
FF8,
FFA,
000,
000,
000,
000,
000,
000,
000,
000,
FFB,
FF8,
FF7,
FF8,
FF7,
FF7,
FF7,
FF7,
FF8,
FE9,
FE9,
FD8,
FE9,
FE8,
FF9,
872,
DC9,
997,
000,
000,
000,
000,
000,
000,
430,
EEA,
FF9,
FF8,
FF8,
FF7,
FF9,
DD9,
000,
000,
000,
000,
000,
000,
000,
110,
FFA,
FF8,
FE7,
FF8,
FF7,
FF7,
FF7,
FF7,
FF8,
FD9,
C85,
D96,
C85,
FF9,
CC5,
220,
FFC,
442,
000,
000,
000,
000,
000,
000,
000,
000,
763,
FFA,
FF8,
FF8,
FF9,
AA7,
000,
000,
000,
000,
000,
000,
000,
AA5,
FF9,
FF8,
FF8,
FE8,
FF8,
FF7,
FF7,
FF7,
FF9,
D96,
E98,
E88,
D87,
EC8,
BB5,
CC6,
ED9,
000,
000,
000,
000,
000,
000,
000,
000,
000,
000,
000,
EE8,
FF8,
FF9,
774,
000,
000,
000,
000,
000,
000,
442,
FFA,
FF8,
FE7,
FF7,
FF8,
FF7,
FF7,
FF7,
FF7,
FF9,
C96,
E88,
E88,
D87,
EC8,
FF9,
FF9,
AA5,
000,
000,
000,
000,
000,
000,
000,
000,
000,
000,
000,
DD8,
FF8,
FF9,
330,
000,
000,
000,
000,
000,
000,
CB9,
FF9,
FF7,
FF7,
FF7,
FF7,
FF7,
FF7,
FF8,
FE7,
FF9,
EC8,
B85,
C86,
DA6,
FF9,
FF8,
FF8,
FFA,
110,
000,
000,
000,
000,
000,
000,
000,
000,
000,
000,
EEA,
FF8,
FF9,
000,
000,
000,
000,
000,
000,
764,
874,
FF8,
FF7,
FF7,
FF7,
FF7,
FF7,
FF8,
FF8,
FF8,
FE8,
FF9,
FE9,
FE9,
FFA,
FE8,
FF8,
FF9,
FFB,
000,
000,
000,
000,
000,
000,
000,
000,
000,
000,
000,
FFB,
FF9,
FF9,
000,
000,
000,
000,
000,
110,
BA7,
772,
FE7,
FF7,
FF7,
FF7,
FF7,
FF7,
FF8,
FF7,
FF8,
FF8,
DC6,
FE7,
FF8,
FF9,
FF9,
FFA,
CC9,
331,
000,
000,
000,
000,
000,
000,
000,
000,
000,
000,
000,
FFC,
FE9,
FF9,
FFB,
664,
000,
000,
000,
A97,
FFA,
FF9,
FF8,
FF7,
FF7,
FF7,
FF7,
FF7,
FF7,
FF7,
FF8,
FE7,
FF8,
CC5,
FE8,
CC6,
AA5,
541,
000,
000,
000,
000,
000,
000,
000,
000,
000,
000,
000,
000,
000,
DDA,
FFB,
FF9,
FF9,
FFA,
AA7,
000,
000,
FFC,
FF9,
FE8,
FF8,
FF8,
FF8,
FF7,
FF7,
FF7,
FF7,
FF8,
FE8,
FF8,
FF7,
FF8,
BA4,
CB7,
000,
000,
000,
000,
000,
000,
000,
000,
000,
000,
000,
000,
000,
000,
000,
000,
320,
CC7,
FF9,
FFA,
997,
000,
320,
BA7,
FF9,
FF7,
FF8,
FE8,
FF8,
FF7,
FF7,
FF7,
FF7,
FF7,
FF8,
FF8,
FF7,
FF8,
FF9,
DC7,
764,
000,
000,
000,
000,
222,
111,
000,
000,
000,
000,
000,
000,
000,
000,
000,
000,
000,
110,
FFC,
432,
000,
764,
873,
ED7,
FF7,
FF7,
FF8,
FF7,
FF7,
FF7,
FF7,
FF7,
FF7,
FF8,
FF8,
FF7,
FF7,
FF8,
FF9,
CC8,
441,
000,
222,
444,
555,
111,
000,
000,
000,
000,
000,
000,
000,
000,
000,
000,
000,
000,
A97,
544,
000,
A96,
CB6,
FF9,
FF7,
FF7,
FF7,
FE7,
FF7,
FF7,
FF7,
FF7,
FF8,
EE6,
AA3,
FF7,
FF8,
FF8,
FF8,
FF9,
AA6,
554,
444,
000,
000,
000,
000,
000,
000,
000,
000,
000,
000,
000,
000,
000,
000,
000,
AA9,
433,
000,
FFA,
FF9,
FE7,
FF8,
FF7,
FF7,
FF7,
FF7,
FF8,
FF8,
FF8,
FF8,
FF8,
FF8,
CC5,
CB4,
FF8,
FF9,
FFA,
FFB,
665,
000,
000,
000,
000,
000,
000,
000,
000,
000,
000,
000,
000,
000,
000,
000,
000,
BA9,
321,
000,
FFA,
FF8,
FF7,
FF7,
FF7,
FF7,
FF7,
FF7,
FF8,
FF8,
FF8,
FE7,
FF8,
FF8,
FF8,
FF8,
CC5,
CC6,
BB6,
441,
000,
000,
000,
000,
000,
000,
000,
000,
000,
000,
000,
000,
000,
000,
000,
000,
000,
BAA,
987,
100,
EE9,
FF8,
FF7,
FF7,
FF8,
FF7,
FF7,
FF8,
FF8,
FF8,
FF8,
FF7,
FF7,
FF7,
FF7,
FF8,
FFA,
320,
000,
000,
000,
000,
000,
000,
000,
000,
000,
000,
000,
000,
000,
000,
000,
000,
000,
000,
000,
432,
876,
BA8,
CC7,
FF9,
FF8,
FF7,
FE7,
FF7,
FF8,
FF7,
FF8,
FF8,
FE7,
FF7,
FF7,
FF7,
FF7,
FF8,
FFB,
110,
000,
000,
000,
000,
000,
000,
000,
000,
000,
000,
000,
000,
000,
000,
000,
000,
000,
000,
000,
000,
000,
000,
540,
FF9,
FF8,
FE7,
FF8,
FF7,
FF7,
FF8,
FE7,
FF8,
FF8,
FF7,
FE7,
FF7,
FF8,
FF9,
FFB,
000,
000,
000,
000,
000,
000,
000,
000,
000,
000,
000,
000,
000,
000,
000,
000,
000,
000,
000,
000,
000,
000,
000,
220,
ED9,
FFA,
FF8,
FF8,
FF8,
FF7,
FF7,
FF8,
FF7,
FF7,
FF8,
FF8,
FF8,
FE9,
FFB,
542,
000,
000,
000,
000,
000,
000,
000,
000,
000,
000,
000,
000,
000,
000,
000,
000,
000,
000,
000,
000,
000,
000,
000,
875,
985,
A96,
FFB,
FF9,
FF7,
FF7,
EE7,
FF8,
FF7,
FF7,
FF7,
FF9,
FFA,
FFB,
874,
000,
000,
000,
000,
000,
000,
000,
000,
000,
000,
000,
000,
000,
000,
000,
000,
000,
000,
000,
000,
000,
000,
000,
000,
A98,
000,
000,
220,
A95,
EE9,
FF9,
FFA,
FFA,
FF9,
FF9,
FF8,
BB6,
762,
000,
000,
000,
000,
000,
000,
000,
000,
000,
000,
000,
000,
000,
000,
000,
000,
000,
000,
000,
000,
000,
000,
000,
000,
000,
000,
000,
000,
000,
000,
000,
000,
000,
000,
000,
000,
DD9,
FFA,
FFB,
FFB,
AA8,
000,
000,
000,
000,
000,
000,
000,
000,
000,
000,
000,
000,
000,
000,
000,
000,
000,
000,
000,
000,
000,
000,
000,
000,
000,
000,
000,
000,
000,
000,
000,
000,
000,
000,
000,
000,
110,
220,
220,
331,
110,
000,
000,
000,
000,
000,
000,
000,
000,
000,
000;
