000000000000
000000000000
000000000000
000000000000
000000000000
000000000000
000000000000
000000000000
000000000000
000000000000
000000000000
101010010111
110111001010
000000000000
000000000000
000000000000
000000000000
000000000000
000000000000
000000000000
000000000000
000000000000
000000000000
000000000000
000000000000
000000000000
000000000000
000000000000
000000000000
000000000000
000000000000
000000000000
000000000000
000000000000
000000000000
000000000000
000000000000
000000000000
000000000000
000000000000
010000110001
111111111100
111111101011
001000010000
000000000000
000000000000
000000000000
000000000000
000000000000
000000000000
000000000000
000000000000
000000000000
000000000000
000000000000
000000000000
000000000000
000000000000
000000000000
000000000000
000000000000
000000000000
000000000000
000000000000
000000000000
000000000000
000000000000
000000000000
000000000000
000000000000
001100110000
111111111011
111111111010
010101010001
000000000000
000000000000
000000000000
000000000000
000000000000
000000000000
000000000000
000000000000
000000000000
000000000000
000000000000
000000000000
000000000000
000000000000
000000000000
000000000000
000000000000
000000000000
000000000000
000000000000
000000000000
000000000000
000000000000
000000000000
000000000000
000000000000
101010100101
111111111010
111111111010
100110010101
000000000000
000000000000
000000000000
000000000000
000000000000
000000000000
000000000000
000000000000
000000000000
000000000000
000000000000
000000000000
000000000000
000000000000
000000000000
000000000000
000000000000
000000000000
000000000000
000000000000
000000000000
000000000000
000000000000
000000000000
000000000000
000000000000
100110010110
111111111010
111111111010
101010100110
000000000000
000000000000
000000000000
000000000000
000000000000
000000000000
000000000000
000000000000
000000000000
000000000000
000000000000
000000000000
000000000000
000000000000
000000000000
000000000000
000000000000
000000000000
000000000000
000000000000
000000000000
000000000000
000000000000
000000000000
000000000000
000000000000
111111101100
111111111100
111011101010
101010100111
000000000000
000000000000
000000000000
000000000000
000000000000
000000000000
000000000000
000000000000
000000000000
000000000000
000000000000
000000000000
000000000000
000000000000
000000000000
000000000000
000000000000
000000000000
000000000000
000000000000
000000000000
000000000000
000000000000
000000000000
000000000000
000000000000
111011101100
000000000000
010101000011
101110101001
000000000000
000000000000
000000000000
000000000000
000000000000
000000000000
000000000000
000000000000
000000000000
000000000000
000000000000
000000000000
000000000000
000000000000
000000000000
000000000000
000000000000
000000000000
000000000000
000000000000
000000000000
000000000000
000000000000
000000000000
000000000000
000000000000
010001000010
001000100000
000000000000
100010000111
000000000000
000000000000
000000000000
000000000000
000000000000
000000000000
000000000000
000000000000
000000000000
000000000000
000000000000
000000000000
000000000000
000000000000
000000000000
000000000000
000000000000
000000000000
000000000000
000000000000
000000000000
000000000000
000000000000
000000000000
000000000000
000000000000
000000000000
111111101100
010101010011
010001000011
000000000000
000000000000
000000000000
000000000000
000000000000
000000000000
000000000000
000000000000
000000000000
000000000000
000000000000
000000000000
000000000000
000000000000
000000000000
000000000000
000000000000
000000000000
000000000000
000000000000
000000000000
000000000000
000000000000
000000000000
000000000000
000000000000
010001000001
111111111100
101010101000
010001000011
000000000000
000000000000
000000000000
000000000000
000000000000
000000000000
000000000000
000000000000
000000000000
000000000000
000000000000
000000000000
000000000000
000000000000
000000000000
000000000000
000000000000
000000000000
000000000000
000000000000
000000000000
000000000000
000000000000
000000000000
000000000000
000000000000
010001000001
111111111100
100110010111
000000000000
000000000000
000000000000
000000000000
000000000000
000000000000
000000000000
000000000000
000000000000
000000000000
000000000000
000000000000
000000000000
000000000000
000000000000
000000000000
000000000000
000000000000
000000000000
000000000000
000000000000
000000000000
000000000000
000000000000
000000000000
000000000000
000000000000
010001000001
111111111011
111111111100
000000000000
000000000000
000000000000
000000000000
000000000000
000000000000
000000000000
000000000000
000000000000
000000000000
000000000000
000000000000
000000000000
000000000000
000000000000
000000000000
000000000000
000000000000
000000000000
000000000000
000000000000
000000000000
000000000000
000000000000
000000000000
000000000000
000000000000
010000110000
111111111011
111111111100
000000000000
000000000000
000000000000
000000000000
000000000000
000000000000
000000000000
000000000000
000000000000
000000000000
000000000000
000000000000
000000000000
000000000000
000000000000
000000000000
000000000000
000000000000
000000000000
000000000000
000000000000
000000000000
000000000000
000000000000
000000000000
000000000000
000000000000
101010100110
111111111010
111111111011
000000000000
000000000000
000000000000
000000000000
000000000000
000000000000
000000000000
000000000000
000000000000
000000000000
000000000000
000000000000
000000000000
000000000000
000000000000
000000000000
000000000000
000000000000
000000000000
000000000000
000000000000
000000000000
000000000000
000000000000
000000000000
000000000000
000000000000
101110110111
111111111001
111111111010
001100110000
000000000000
000000000000
000000000000
000000000000
000000000000
000000000000
000000000000
000000000000
000000000000
000000000000
000000000000
000000000000
000000000000
000000000000
000000000000
000000000000
000000000000
000000000000
000000000000
000000000000
000000000000
000000000000
000000000000
001100110010
000000000000
000000000000
111111111010
111111111000
111111111010
100110010101
000000000000
000000000000
000000000000
000000000000
000000000000
000000000000
000000000000
000000000000
000000000000
000000000000
000000000000
000000000000
000000000000
000000000000
000000000000
000000000000
000000000000
000000000000
000000000000
000000000000
000000000000
000000000000
000100000000
111111111100
001100100000
000000000000
111111111010
111111111000
111111111001
110010110111
000000000000
000000000000
000100000000
000100000000
000000000000
000000000000
000000000000
000000000000
000000000000
000000000000
000000000000
000000000000
000000000000
000000000000
000000000000
000000000000
000000000000
000000000000
000000000000
000000000000
000000000000
000000000000
010000110000
111111101010
111011011001
011101100010
111111111001
111111110111
111111111000
111011101001
000000000000
000100000000
100101110110
001100010000
000000000000
000000000000
000000000000
000000000000
000000000000
000000000000
000000000000
000000000000
000000000000
000000000000
000000000000
000000000000
000000000000
000000000000
000000000000
000000000000
000000000000
000000000000
100001100011
111111101001
111111101001
110010110110
111111111000
111111111000
111111111000
111111111010
001000010000
100101110100
111010111001
010000010000
000000000000
000000000000
000000000000
000000000000
000000000000
000000000000
000000000000
000000000000
000000000000
000000000000
000000000000
000000000000
000000000000
000000000000
000000000000
000000000000
000000000000
000000000000
110111000111
111111101000
111111101000
111111111000
111111111000
111111111000
111111111000
111111101000
110110110110
111111011000
111010100111
011101000010
000100000000
000000000000
000000000000
000000000000
001000000000
000100000000
000000000000
000000000000
000000000000
000000000000
000000000000
000000000000
000000000000
000000000000
000000000000
000000000000
000000000000
001000100000
110110110111
111111101000
111111111000
111111110111
111111110111
111111111000
111111111000
111111111000
111111100111
111111010111
111010100110
100001000010
000100000000
000000000000
000000000000
000000000000
011100110011
011101000011
000100000000
000000000000
000000000000
000000000000
000000000000
000000000000
000000000000
000000000000
000000000000
000000000000
000000000000
000100010000
111111101001
111111111000
111111111000
111111100111
111111111000
111111111000
111111111000
111111100111
111111010110
111111010111
111010100110
101001100011
000000000000
000000000000
000000000000
000100000000
111010011000
110110000111
000100000000
000000000000
000000000000
000000000000
000000000000
000000000000
000000000000
000000000000
000000000000
000000000000
000000000000
010000110001
111111101001
111111111000
111111111000
111111110111
111111111000
111111111000
111111111000
111111110111
111111010110
111111010111
111110110110
110010000101
000100000000
000000000000
000000000000
000100000000
110110000111
111010000111
001100000000
000000000000
000000000000
000000000000
000000000000
000000000000
000000000000
000000000000
000000000000
000000000000
000000000000
011101100100
111111101001
111111111000
111111111000
111011100111
111111111000
111111111000
111111111000
111111100111
111011010110
111111101000
111111010111
101110000100
000100000000
000000000000
000000000000
000100000000
100101000011
111010000111
011000110010
000100000000
000000000000
000000000000
000000000000
000000000000
000000000000
000000000000
000000000000
000000000000
000100000000
011101010011
111111101001
111111111000
111111110111
111011100110
111111111000
111111111000
111111111000
111111111000
111111100111
111111111000
111111101000
110010010101
000100000000
000000000000
000000000000
000100000000
011000010000
111010011000
101001100101
000100000000
000000000000
000000000000
000000000000
000000000000
000000000000
000000000000
000000000000
000000000000
000100000000
100001100011
111111101000
111111111000
111111110111
111111100111
111111111000
111111111000
111111111000
111111111000
111111110111
111111111000
111111101001
110110100110
000100000000
000000000000
000000000000
000100000000
001100000000
111010011000
110010000111
010000010000
000000000000
000000000000
000000000000
000000000000
000000000000
000000000000
000000000000
000000000000
000100000000
110110111000
111111101001
111111111000
111111111000
111111110111
111111110111
111111111000
111111111000
111111111000
111111111000
111111111000
111111010111
110110010101
010100100001
001000000000
010000010000
011101000011
001000000000
110010000111
111010011000
001100000000
000100000000
000000000000
000000000000
000000000000
000000000000
000000000000
000000000000
000000000000
000100000000
101110100111
111111101001
111111111000
111111111000
111111110111
111111110111
111111111000
111111111000
111111111000
111111111000
111111111000
111111101000
110110010101
100101010011
010000000000
110001110110
101001010100
001100000000
010000010000
110010000111
010000010000
000000000000
000000000000
000000000000
000000000000
000000000000
000000000000
000000000000
000000000000
000100000000
101010000101
111111101001
111111111001
111111111000
111111111000
111111111000
111111111000
111111111000
111111111000
111111111000
111111111000
111111111000
110110010100
111010010101
111110010110
111110000110
111110010111
010000010000
001000000000
100001010100
010100100010
000000000000
000000000000
000000000000
000000000000
000000000000
000000000000
000000000000
000000000000
010100100001
101110000100
111111101001
111111111000
111111111000
111111111000
111111111000
111111111000
111111111000
111111111000
111111111000
111111111000
111111111000
110110100100
111010010101
111110010101
111110000101
111010000110
011101000010
000100000000
100001010101
010100100010
000000000000
000000000000
000000000000
000000000000
000000000000
000000000000
000000000000
000100000000
110110010111
110010000101
111111101000
111111111000
111111111000
111111111000
111111111000
111111111000
111111111000
111111111000
111111111000
111111111000
111111111000
111011000101
110110100100
111111011000
111110100101
111010000101
110010000110
001000000000
001100010000
001100100001
000000000000
000000000000
000000000000
000000000000
000000000000
000000000000
000000000000
001000000000
011100100000
111010010101
111111101000
111111111000
111111111000
111111111000
111111110111
111111111000
111111111000
111111111000
111111111000
111111111000
111111111000
111111010110
111111010110
111111111000
111111000111
110110010100
110010000110
010000010000
001100010000
001100010001
000000000000
000000000000
000000000000
000000000000
000000000000
000000000000
000100000000
100101010100
111110000110
111010000011
111111010111
111111111000
111111111000
111111111000
111111111000
111111111000
111111111000
111111111000
111111111000
111111111000
111111111000
111111111000
111111111000
111111101000
111111101000
110110100101
110110010110
001100000000
001100010001
001000010001
000000000000
000000000000
000000000000
000000000000
000000000000
000000000000
001000000000
110001110110
111110000101
111010000011
111111010111
111111111000
111111111000
111111111000
111111111000
111111111000
111111111000
111111111000
111111111000
111111111000
111111111000
111111110111
111111111000
111111111000
111111111000
110110110110
110110010110
001100000000
000100000000
000000000000
000000000000
000000000000
000000000000
000000000000
000000000000
000000000000
001100000000
111010010111
111001110100
111010000011
111111000111
111111010111
111111111000
111111100111
111111111000
111111111000
111111111000
111111111000
111111111000
111111111000
111111111000
111111111000
111111111000
111111111000
111111111001
111011000110
110110010101
010100010000
000100000000
000000000000
000000000000
000000000000
000000000000
000000000000
000000000000
000000000000
001100000000
111010010111
111001110100
111001110011
111110110110
111111010111
111111101000
111111100111
111111111000
111111111000
111111111000
111111111000
111111111000
111111111000
111111111000
111111111000
111111111000
111111111000
111111111000
111111010111
110110010101
100101000011
000100000000
000000000000
000000000000
000000000000
000000000000
000000000000
000000000000
000000000000
100001000011
111010000110
111110000101
111001110011
111010010100
111111010111
111111010111
111111010110
111111100111
111111111000
111111111000
111111111000
111111111000
111111111000
111111111000
111111111000
111111111000
111111111000
111111111000
111111101000
110110000101
100000110010
000100000000
000000000000
000000000000
000000000000
000000000000
000000000000
000000000000
000100000000
100001000010
111010000110
111001110100
111001110011
111010000100
111111010111
111111010110
111111010110
111111100111
111111111000
111111111000
111111111000
111111111000
111111111000
111111111000
111111111000
111111111000
111111111000
111111111000
111111101000
111010010101
100101000010
000100000000
000000000000
000000000000
000000000000
000000000000
000000000000
000000000000
000100000000
100001000010
111110000110
111101110101
111001110011
110110000011
111111000111
111111010110
111111100111
111111100111
111111111000
111111111000
111111111000
111111111000
111111111000
111111111000
111111111000
111111111000
111111111000
111111111000
111111111000
110110010101
100101000010
000100000000
000000000000
000000000000
000000000000
000000000000
000000000000
000000000000
000100000000
100001000010
111010000101
111101110101
111001110011
110110000011
111111010111
111111010110
111111100111
111111010111
111111111000
111111111000
111111111000
111111111000
111111111000
111111111000
111111111000
111111111000
111111111000
111111110111
111111111001
111010100101
100001000001
000100000000
000000000000
000000000000
000000000000
000000000000
000000000000
000000000000
000100000000
100000110001
111110000101
111101110101
110101100011
110110010100
111111100111
111111100111
111111100111
111111100111
111111100111
111111111000
111111111000
111111111000
111111111000
111111111000
111111111000
111111111000
111111111000
111111111000
111111111001
111010100110
011101000001
000000000000
000000000000
000000000000
000000000000
000000000000
000000000000
000000000000
000100000000
100001000010
111110010110
111101110100
111001100011
111010100101
111111101000
111111100111
111111110111
111111100111
111111100111
111111111000
111111111000
111111111000
111111111000
111111111000
111111111000
111111111000
111111111000
111111111000
111111111000
111010110110
011101000001
000000000000
000000000000
000000000000
000000000000
000000000000
000000000000
000000000000
000100000000
100101000010
111110010110
111101110100
110101100011
111111000111
111111111000
111111111000
111111111000
111111100111
111111100111
111111111000
111111111000
111111111000
111111111000
111111111000
111111111000
111111111000
111111111000
111111111000
111111111001
111010110111
011101000001
000000000000
000000000000
000000000000
000000000000
000000000000
000000000000
000000000000
000100000000
100101010010
111110000101
111001100100
110101100011
111111101000
111111111000
111111111000
111111111000
111111110111
111111100111
111111111000
111111111000
111111111000
111111111000
111111111000
111111111000
111111111000
111111111000
111111100111
111111111001
111010110111
011101000010
000000000000
000000000000
000000000000
000000000000
000000000000
000000000000
000000000000
000100000000
100101010011
111010000101
111001100100
110101110011
111111101000
111111111000
111111111000
111111111000
111111110111
111111100110
111111111000
111111111000
111111111000
111111111000
111111111000
111111111000
111111111000
111111111000
111111010110
111111011000
111110110111
011101000010
000000000000
000000000000
000000000000
000000000000
000000000000
000000000000
000000000000
000100000000
100101000011
111110000101
111001100100
111010000011
111111111000
111111111000
111111111000
111111111000
111111111000
111111010110
111111111000
111111111000
111111111000
111111111000
111111111000
111111111000
111111111000
111111111000
111010110101
111110110110
111110110111
011101000010
000100000000
000000000000
000000000000
000000000000
000000000000
000000000000
000000000000
000100000000
100101000011
111110000101
111001100011
111010000100
111111111000
111111111000
111111111000
111111111000
111111110111
111111010110
111111111000
111111111000
111111111000
111111111000
111111111000
111111111000
111111111000
111111101000
110110010100
111010010101
111110100111
011101000010
000100000000
000000000000
000000000000
000000000000
000000000000
000000000000
000000000000
000100000000
101001010011
111110000101
111001100011
111010000100
111111111000
111111111000
111111111000
111111111000
111111111000
111111010110
111111111000
111111111000
111111111000
111111111000
111111111000
111111111000
111111111000
111111010111
111010010100
111110000101
111010010110
100001000010
000100000000
000000000000
000000000000
000000000000
000000000000
000000000000
000000000000
000100000000
101001010011
111110000101
110101100011
111010000100
111111111001
111111111000
111111111000
111111111000
111111111000
110010010011
111111111000
111111111000
111111111000
111011010110
111111111000
111111111000
111111111000
111010110110
111010000100
111110000101
111110000110
100001000010
000100000000
000000000000
000000000000
000000000000
000000000000
000000000000
000000000000
000100000000
100101000010
111110000101
111001100011
111010000100
111111010111
111111111000
111111111000
111111111000
111111100111
110010010011
111111111001
111111111000
111111101000
101110010011
111111100111
111111100111
111111101001
111010100101
111010000100
111001110100
111110000110
100000110001
000100000000
000000000000
000000000000
000000000000
000000000000
000000000000
000000000000
000100000000
100101000010
111110000101
111001100011
110101100011
110110100100
111111111000
111111111000
111111111000
111111010111
101110010011
111111111000
111111111000
111111101000
101110000010
111010110101
111111101000
111110110110
111010000100
111110000100
111110000101
111110000101
100101000010
000100000000
000000000000
000000000000
000000000000
000000000000
000000000000
000000000000
000100000000
100001000010
111110000101
111001100011
110101100011
110010000011
111111101000
111111111000
111111111000
111111000110
110010010011
111111111000
111111111000
111111010111
110001110010
110110000011
111110100101
111001110011
111110000100
111110000100
111101110100
111110000101
100101000010
000100000000
000000000000
000000000000
000000000000
000000000000
000000000000
000000000000
000100000000
100000110010
111110000110
111001100011
110101100010
110101110011
111111010111
111111111000
111111111000
111111000110
110010010011
111111111000
111111111000
111111000111
110001100010
110101100011
111001110100
111001100010
111101110100
111110000101
111110000101
111010000101
100101000010
000100000000
000000000000
000000000000
000000000000
000000000000
000000000000
000000000000
000100000000
100101000011
111110000110
111001100100
110101010010
110101110011
111111000110
111111111000
111111111000
111110110110
110110010011
111111111000
111111111000
111111000111
110001010010
110101010011
111001010011
111001100010
111101110011
111110010101
111010000100
111110000101
100101000010
000100000000
000000000000
000000000000
000000000000
000000000000
000000000000
000000000000
000100000000
100101000011
111001110110
111001010100
111001100011
110101110011
111110110110
111111100111
111111111000
111110110101
110110010100
111111111000
111111111000
111111000111
110001010010
110101010011
111001010011
110101010010
111110000100
111111011000
111010010101
111110000101
101101100100
000100000000
000000000000
000000000000
000000000000
000000000000
000000000000
000000000000
000100000000
011000100001
111110000111
111001010100
111001010011
110101010010
111110100101
111111111000
111111111000
111110110101
110110010100
111111111000
111111111000
111110110111
110001010010
111001010011
111001010011
110101010010
111110100101
111111101001
111110110110
111010000100
110110000101
000100000000
000000000000
000000000000
000000000000
000000000000
000000000000
000000000000
000100000000
010000000000
111010000111
111001100100
111001010011
110101100010
111010010100
111111111000
111111111000
111110110110
110110010100
111111111000
111111111000
111110100110
110001010010
111001000011
110101000010
110101100010
111111000111
111111101000
111111011000
111010010101
110001110101
000100000000
000000000000
000000000000
000000000000
000000000000
000000000000
000000000000
000000000000
010000000000
111010000111
110101100101
100000010000
111001100100
111010000100
111111111001
111111111000
111110110110
110010010011
111111111000
111111111000
111010010101
110101000010
111001000011
110101000010
110001100010
111111011000
111111111000
111111111000
111010010101
110010000101
000100000000
000000000000
000000000000
000000000000
000000000000
000000000000
000000000000
000000000000
001100000000
111010010111
110001100101
010100000000
111001110100
110101110011
111111111001
111111111000
111111000110
110010000011
111111111000
111111111000
111001110011
110101000010
111001000011
110101000010
110001100010
111111101001
111111111000
111111111001
111110110110
110110000101
000100000000
000000000000
000000000000
000000000000
000000000000
000000000000
000000000000
000000000000
001100000000
110110010111
101101100100
010000000000
110001010011
110101110100
111111111001
111111111000
111111000111
110010000011
111111111000
111111101000
110101100011
111001010011
111001010011
110101010010
110001110011
111111111001
111111111000
111111111000
111111000111
110110010110
001000010000
000000000000
000000000000
000000000000
000000000000
000000000000
000000000000
000000000000
001100000000
110110010111
101101110101
001100000000
110101110100
110101110011
111111111001
111111111001
111111000111
101101110010
111111010110
111111010111
110101010010
111001010011
111001010011
110001010010
110110000100
111111111001
111111111000
111111111000
111111010111
110110010101
001000000000
000000000000
000000000000
000000000000
000000000000
000000000000
000000000000
000000000000
001100000000
111010011000
101001100101
001100000000
100100110001
110110000100
111111111001
111111111001
111111010111
101101110001
111010100101
111111000111
110001010010
111001010011
111001110100
110001010001
110110010100
111111111000
111111111000
111111111000
111111011000
110110010101
011101000010
000100000000
000000000000
000000000000
000000000000
000000000000
000000000000
000000000000
010000000000
110110010111
101101110110
001100000000
100000100000
110110000100
111111111001
111111111001
111111011000
101101110001
110110010011
111111000111
110001010010
111001100100
111110010110
101101100001
111010100101
111111111000
111111111000
111111111000
111111101000
110110010101
011101000010
000100000000
000000000000
000000000000
000000000000
000000000000
000000000000
000100000000
001100000000
111010010111
101101110110
001000000000
100000110001
110110000101
111111111001
111111111000
111111101000
101101110010
110001110010
111110110111
110001010010
111110000101
111111011000
101101110010
111010110101
111111111000
111111111000
111111111000
111111101000
110110010101
101101110101
001000000000
000100000000
000000000000
000000000000
000000000000
000000000000
000100000000
001100000000
110110010111
011101000100
001000000000
011100110001
110110010101
111111111001
111111111000
111111101001
101101110010
110001110010
111110110111
101101010001
111110100110
111111101001
101110000010
111011010110
111111111000
111111111000
111111111000
111111101000
110110010100
111010000110
010000000000
000100000000
000000000000
000000000000
000000000000
000000000000
000100000000
001100000000
110110011000
010100110010
000100000000
011100110001
110110010110
111111111001
111111111000
111111101001
110001110011
101101100010
111110100110
101101010001
111110110110
111111101000
110010110100
111111100111
111111111000
111111111000
111111111000
111111111000
111010010101
111010000101
110001110101
000100000000
000000000000
000000000000
000000000000
000000000000
000100000000
001100000000
111010101000
001100010000
000100000000
011100110001
111010100110
111111111001
111111111000
111111111001
110110010100
101101100010
111110100110
101101010001
111110110111
111111111000
111011100110
111111111000
111111111000
111111111000
111111111000
111111111000
111010100101
111001110101
111010000110
011100110011
000000000000
000000000000
000000000000
000000000000
000000000000
010000000000
110110011000
001000000000
000100000000
011100110001
111010100111
111111101000
111111111000
111111111000
110110100100
110001100010
111110010101
101101010001
111111000111
111111111000
111111111000
111111111000
111111111000
111111111000
111111111000
111111111000
111110110101
111001110100
111110000110
011100110011
000100000000
000000000000
000000000000
000000000000
000000000000
010100010000
110110011000
000100000000
000100000000
011100110001
111110110111
111111101000
111111111000
111111111000
111010110101
110001100010
111101110100
110001010001
111111000111
111111111000
111111111000
111111111000
111111111000
111111111000
111111111000
111111111000
111111000110
111010000100
111001110101
111010011000
000100000000
000000000000
000000000000
000000000000
000000000000
010100010000
110110010111
000000000000
000000000000
011100110001
111111000111
111111101000
111111111000
111111111000
111111000111
110001100010
110101100011
110001010010
111111011000
111111111000
111111110111
111111111000
111111111000
111111111000
111111111000
111111111000
111111010111
111010000100
111010000101
110001110110
000100000000
000000000000
000000000000
000000000000
000000000000
010100010000
110110011000
000000000000
000000000000
011000110000
111111001000
111111111000
111111111000
111111111000
111111101000
110101100011
110001010010
110001100010
111111011000
111111111000
111111111000
111111111000
111111111000
111111111000
111111111000
111111111000
111111101000
111010010100
111010000101
110001110110
001000000000
000000000000
000000000000
000000000000
000000000000
010100100000
110010010111
000000000000
000000000000
011101000001
111111011000
111111111000
111111111000
111111111000
111111111001
110101110011
110001010010
110001100010
111111011000
111111111000
111111111000
111111111000
111111111000
111111111000
111111111000
111111111000
111111111000
111110100101
110110000100
110010000110
001000000000
000000000000
000000000000
000000000000
000000000000
010100010000
110010010111
000000000000
000000000000
100001010010
111111011000
111111111000
111111111000
111111111000
111111111001
111010000100
110001010010
101101100010
111111101001
111111111000
111111111000
111111111000
111111111000
111111111000
111111111000
111111111000
111111111000
111111000110
110110000100
110110000110
001000000000
000000000000
000000000000
000000000000
000000000000
010000000000
110010011000
000000000000
000000000000
110010100110
111111011000
111111111000
111111111000
111111111000
111111111000
111110010101
110001010001
110001110010
111111101001
111111111000
111111111000
111111111000
111111111000
111111111000
111111111000
111111111000
111111111000
111111010111
110110000100
110110000110
001100000000
000000000000
000000000000
000000000000
000100000000
001100000000
110010011000
000000000000
000000000000
101110000100
111111101000
111111111000
111111111000
111111111000
111111111000
111110100101
101101010001
110001110011
111111101001
111111111000
111111111000
111111111000
111111111000
111111111000
111111111000
111111111000
111111111000
111111101000
110110010100
110110010110
010000010000
000000000000
000000000000
000000000000
000000000000
001000000000
110110011000
000000000000
000000000000
101001110011
111111111001
111111111000
111111111000
111111111000
111111111000
111110100110
101101010001
110010000011
111111111001
111111111000
111111111000
111111111000
111111111000
111111111000
111111111000
111111110111
111111111000
111111111000
110110010100
110110010110
010000010000
000000000000
000000000000
000000000000
000000000000
001000000000
110010011000
000000000000
000000000000
101110000101
111111111001
111111111000
111111110111
111111111000
111111111000
111110110110
101101010001
110110010100
111111111001
111111111000
111111111000
111111111000
111111111000
111111111000
111111111000
111111111000
111111111000
111111111000
110110100101
110110010110
010000000000
000000000000
000000000000
000000000000
000000000000
001000000000
101110000111
000000000000
000100000000
101110010101
111111111001
111111111000
111111110111
111111111000
111111111000
111110110110
101101010001
110110010100
111111111001
111111111000
111111111000
111111111000
111111111000
111111111000
111111111000
111111100111
111111111000
111111111000
110110100101
110110010110
001100000000
000000000000
000000000000
000000000000
000000000000
000100000000
110010101001
000100000000
000000000000
110010100110
111111101000
111111110111
111111110111
111111111000
111111111000
111110110110
101101010001
110110010100
111111111001
111111111000
111111111000
111111111000
111111111000
111111111000
111111111000
110010100011
111111101000
111111101000
111010110101
110110010110
001100000000
000000000000
000000000000
000000000000
000000000000
000100000000
110110101001
001000010001
000100000000
110010100110
111111111001
111111110111
111111110111
111111111000
111111111000
111111000111
101101010001
110110100100
111111111001
111111111000
111111111000
111111111000
111111111000
111111111000
111111010110
110010010011
111111000110
111111101000
111010110110
110110010110
010000000000
000000000000
000000000000
000000000000
000000000000
000100000000
101110011001
001000010000
000100000000
110110100110
111111111001
111111111000
111111110111
111111111000
111111111001
111111000110
101101100001
110110100100
111111111001
111111111000
111111111000
111111111000
111111111000
111111110111
111011000101
110010000011
111110110110
111111101000
111010110110
110110010110
010000000000
000100000000
000000000000
000000000000
000000000000
000100000000
011101010101
001100010001
000100000000
110110110110
111111111000
111111111000
111111111000
111111111000
111111111000
111111000111
101001100001
111010110101
111111111000
111111111000
111111111000
111111111000
111111111000
111111111000
110110100100
110110000011
111110100101
111111101001
111010110110
110110010110
010000000000
000100000000
000000000000
000000000000
000000000000
000100000000
100101110111
001100010001
000100000000
110110100110
111111111001
111111111000
111111111000
111111111000
111111111001
111111000110
101101100001
111111100111
111111111000
111111111000
111111111000
111111111000
111111111000
111111101000
110110010100
110001110011
111010010101
111111101001
111010110110
110110010110
010000000000
000000000000
000000000000
000000000000
000000000000
000000000000
001100100001
001100100010
000100000000
110110100110
111111101001
111111111000
111111111000
111111111000
111111111001
111110110110
101101100001
111111111001
111111111000
111111111000
111111111000
111111111000
111111111000
111111111001
110010000011
110101110100
111010000101
111111101001
111010110110
110110010110
010000000000
000000000000
000000000000
000000000000
000000000000
000000000000
001000010001
010000110010
000100000000
110110100110
111111101001
111111111000
111111111000
111111111000
111111111000
111111000111
101101100001
111111111000
111111111000
111111111000
111111111000
111111111000
111111111000
111111101000
110010000100
010100000000
111010010110
111111101001
111010110110
110110010110
010000000000
000000000000
000000000000
000000000000
000000000000
000000000000
001000100001
010000110011
000100000000
110010010101
111111101000
111111111000
111111110111
111111111000
111111111000
111110110110
101101100001
111111111000
111111111000
111111111000
111111111000
111111111000
111111111000
111111011001
100101010010
001100000000
100101100011
111111101001
111010110110
110110010110
010000000000
000000000000
000000000000
000000000000
000000000000
000000000000
001000100001
010000110011
000100000000
101110000100
111111101001
111111111000
111111100111
111111111000
111111111001
111110110110
101101100001
111111111001
111111111000
111111111000
111111111000
111111110111
111111111000
111111011000
011101000001
001000000000
011101000010
111111101001
111010110110
110110010110
010000000000
000000000000
000000000000
000000000000
000000000000
000000000000
010000110011
001100110010
000100000000
101110000100
111111011000
111111100111
111111100111
111111111000
111111111000
111110100110
101101100001
111111111000
111111111000
111111111000
111111111000
111111110111
111111111001
111111011000
010000010000
000100000000
011001000010
111111101001
111010110110
110110010110
010000000000
000000000000
000000000000
000000000000
000000000000
000000000000
010000110011
001100100010
000100000000
101110000100
111111011000
111111111000
111111110111
111111111000
111111111000
111010010100
101101100001
111111101000
111111111000
111111111000
111111110111
111011100110
111111111001
111011001000
001000000000
000100000000
010100110001
111111101001
111010110110
110110010110
010000000000
000000000000
000000000000
000000000000
000000000000
000000000000
010000110011
001100100001
001000000000
110010000101
111111000111
111111111000
111111111000
111111111000
111111111000
110110000011
101101010001
111111010111
111111111000
111111111000
111111100111
111011000101
111111101001
110110100111
001000000000
000100000000
001000000000
111111011001
111010110110
110110010111
010000010000
000100000000
000000000000
000000000000
000000000000
000000000000
010001000100
001000010001
000100000000
111010010111
111110110110
111111111001
111111111000
111111111000
111111111000
110101110010
110001010001
111111000111
111111111000
111111111001
111111101000
110010100100
111111101001
101101110101
001000000000
000100000000
001000000000
111111011000
111110110110
110110010110
010000010000
000000000000
000000000000
000000000000
000000000000
000000000000
000000000000
001000010001
000100000000
100101010010
111110100110
111111111000
111111111000
111111111000
111111111001
110101100010
110001010001
111111000110
111111111001
111111101000
111111111001
110001110010
111110110111
101101110101
001000000000
000100000000
001000000000
111111001000
111110100110
110010000110
011000110010
000000000000
000000000000
000000000000
000000000000
000000000000
000000000000
000100000000
000100000000
011100110001
111010010110
111111101001
111111111000
111111111000
111111111001
111001110011
110001010001
111110110110
111111111001
101010010100
110010100101
110101110011
111001110101
100101010100
001000000000
000100000000
001000000000
111110110111
111110110111
110010000101
001000000000
000000000000
000000000000
000000000000
000000000000
000000000000
000000000000
001100100010
000100000000
100101000010
111010010110
111111011000
111111111000
111111111000
111111111001
111001110011
110001010001
111111000110
111111111001
101010000100
100101100010
110101110100
111001110101
011100110010
000100000000
000000000000
001000010000
111110110111
111110110111
101101110101
001000000000
000000000000
000000000000
000000000000
000000000000
000000000000
000000000000
000000000000
000100000000
100001000010
110110010101
110110110101
111111101000
111111111001
111111111001
110101110011
110001010001
111111000110
111111111001
100101110100
011100110001
110101100100
110101100101
011000110010
000100000000
000000000000
000100000000
111010100111
111110110111
110010000110
000100000000
000000000000
000000000000
000000000000
000000000000
000000000000
000000000000
000000000000
000100000000
001100000000
111010100110
110110110101
111111101000
111111111000
111111111001
110101110011
110001010010
111111000111
111011011000
101010000101
010000000000
111001110101
110101100100
010000010000
000000000000
000000000000
000100000000
110110100110
111110110111
110010000110
001000000000
000000000000
000000000000
000000000000
000000000000
000000000000
000000000000
000000000000
000100000000
001100000000
110110100111
111011000111
111111110111
111111111000
111111111000
111010000100
101101010010
111111001000
011101100010
101010000110
001100000000
111001110100
111001100100
001100000000
000000000000
000000000000
000100000000
110010010101
111110110111
110010000110
001000000000
000000000000
000000000000
000000000000
000000000000
000000000000
000000000000
000000000000
000000000000
010100100001
110010010110
111111010111
111111100111
111111111000
111111111000
111010010100
101101100010
111111001001
001100010000
100001110101
001000000000
111101110101
111001110101
001000000000
000000000000
000000000000
000000000000
110110010101
111110110111
110110000110
001000000000
000100000000
000000000000
000000000000
000000000000
000000000000
000000000000
000000000000
000000000000
001000000000
110010010110
111111101000
111111100111
111111111000
111111111000
111110110110
101101100010
111111011001
001000000000
011101100100
001000000000
111001100101
111001100101
000100000000
000000000000
000000000000
000100000000
110010000100
111110110111
110010010111
000100000000
000000000000
000000000000
000000000000
000000000000
000000000000
000000000000
000000000000
000000000000
000100000000
110110100111
111111010111
111111100111
111111111000
111111111000
111111011000
101101100010
111111011001
001000010000
000100000000
000100000000
110001100101
110001100101
000100000000
000000000000
000000000000
000100000000
110010000101
111110110111
110010000110
000100000000
000000000000
000000000000
000000000000
000000000000
000000000000
000000000000
000000000000
000000000000
000100000000
110110101000
111111101000
111111100111
111111111000
111111111000
111111101000
110010000011
111111001001
001100010000
000000000000
000100000000
110001110111
100000110011
000100000000
000000000000
000000000000
000100000000
110001110101
111110100111
110010000110
000100000000
000000000000
000000000000
000000000000
000000000000
000000000000
000000000000
000000000000
000000000000
000100000000
011101010011
111111101000
111111100111
111111111000
111111111000
111111101000
110110100101
111011001000
010000100000
000000000000
000000000000
010100100010
010000010000
000000000000
000000000000
000000000000
000100000000
110110000110
111110010110
110010010111
000100000000
000000000000
000000000000
000000000000
000000000000
000000000000
000000000000
000000000000
000000000000
000000000000
010101000001
111111101000
111111100111
111111111000
111111111000
111111101000
111011000110
110010010110
010000100000
000000000000
000000000000
000100000000
000000000000
000000000000
000000000000
000000000000
000100000000
110110010110
111010010110
110010000110
000100000000
000000000000
000000000000
000000000000
000000000000
000000000000
000000000000
000000000000
000000000000
000000000000
000100000000
111111111001
111111100111
111111111000
111111111000
111111100111
111111010111
110010010101
010100100001
000000000000
000000000000
000000000000
000000000000
000000000000
000000000000
000000000000
000100000000
100101000010
111010010110
110010000110
000100000000
000000000000
000000000000
000000000000
000000000000
000000000000
000000000000
000000000000
000000000000
000000000000
001000010000
111111011000
111111100111
111111111000
111111111000
111111100111
111111011000
110010010110
011000110001
000000000000
000000000000
000000000000
000000000000
000000000000
000000000000
000000000000
000100000000
100001000010
111010000110
110010000110
000100000000
000000000000
000000000000
000000000000
000000000000
000000000000
000000000000
000000000000
000000000000
000000000000
000100000000
110010110110
111111101000
111111100111
111111111000
111111100111
111111101000
110110100110
011000110001
000000000000
000000000000
000000000000
000000000000
000000000000
000000000000
000000000000
000100000000
011100110010
111010010111
101101110110
000100000000
000000000000
000000000000
000000000000
000000000000
000000000000
000000000000
000000000000
000000000000
000000000000
000000000000
110111001000
111111101000
111111100111
111111111000
111111100111
111111010111
111010110111
010100100000
000000000000
000000000000
000000000000
000000000000
000000000000
000000000000
000000000000
000100000000
100101010011
110110000110
110010000110
001000000000
000000000000
000000000000
000000000000
000000000000
000000000000
000000000000
000000000000
000000000000
000000000000
000000000000
101010000101
111111101001
111111100111
111111110111
111111110111
111111010111
111111001000
001100000000
000000000000
000000000000
000000000000
000000000000
000000000000
000000000000
000000000000
000000000000
010100010000
111010011000
110010000111
001000000000
000000000000
000000000000
000000000000
000000000000
000000000000
000000000000
000000000000
000000000000
000000000000
000000000000
100001110100
111111101001
111111010111
111111111000
111111100111
111111010111
111111011000
011001000010
000000000000
000000000000
000000000000
000000000000
000000000000
000000000000
000000000000
000000000000
010000000000
110110000111
110110000111
011000110010
000000000000
000000000000
000000000000
000000000000
000000000000
000000000000
000000000000
000000000000
000000000000
000000000000
001100100000
111111101001
111111100111
111111110111
111111010110
111111010111
111111011000
100001100011
000000000000
000000000000
000000000000
000000000000
000000000000
000000000000
000000000000
000000000000
001000000000
101101110110
110110010111
010000010000
000000000000
000000000000
000000000000
000000000000
000000000000
000000000000
000000000000
000000000000
000000000000
000000000000
010000110000
111111011001
111111100111
111111110111
111111100110
111111010111
111111011000
100001100011
000000000000
000000000000
000000000000
000000000000
000000000000
000000000000
000000000000
000000000000
001000000000
110010000111
110110011000
001100000000
000000000000
000000000000
000000000000
000000000000
000000000000
000000000000
000000000000
000000000000
000000000000
000000000000
000000000000
111011011001
111111100111
111111100111
111111100110
111111010111
111111011000
100001100011
000000000000
000000000000
000000000000
000000000000
000000000000
000000000000
000000000000
000000000000
000100000000
100101100101
111010101000
001100000000
000000000000
000000000000
000000000000
000000000000
000000000000
000000000000
000000000000
000000000000
000000000000
000000000000
000000000000
111111101010
111111100111
111111100111
111111100111
111111010111
111111101000
100101110100
000000000000
000000000000
000000000000
000000000000
000000000000
000000000000
000000000000
000000000000
000100000000
011000110010
110110011000
011000100001
000000000000
000000000000
000000000000
000000000000
000000000000
000000000000
000000000000
000000000000
000000000000
000000000000
000000000000
111011011001
111111011000
111111100111
111111100111
111111010111
111111101000
100110000100
000000000000
000000000000
000000000000
000000000000
000000000000
000000000000
000000000000
000000000000
000000000000
100001100100
110110010111
100101010100
000100000000
000000000000
000000000000
000000000000
000000000000
000000000000
000000000000
000000000000
000000000000
000000000000
000000000000
100110010101
111111101000
111111100111
111111100111
111111100111
111111011000
101010010101
000000000000
000000000000
000000000000
000000000000
000000000000
000000000000
000000000000
000000000000
000000000000
001100010000
110110011000
100101010100
000100000000
000000000000
000000000000
000000000000
000000000000
000000000000
000000000000
000000000000
000000000000
000000000000
000000000000
101010010101
111111101000
111111100111
111111100111
111111010111
111111011000
101010010101
000000000000
000000000000
000000000000
000000000000
000000000000
000000000000
000000000000
000000000000
000000000000
001000000000
111010011000
100101000011
000100000000
000000000000
000000000000
000000000000
000000000000
000000000000
000000000000
000000000000
000000000000
000000000000
000000000000
100110010110
111111101000
111111100111
111111100111
111111100111
111111101000
101010010101
000000000000
000000000000
000000000000
000000000000
000000000000
000000000000
000000000000
000000000000
000000000000
001000000000
111010010111
100001000010
000100000000
000000000000
000000000000
000000000000
000000000000
000000000000
000000000000
000000000000
000000000000
000000000000
000000000000
101010010110
111111101000
111111100111
111111100111
111111010111
111111101000
101010000101
000000000000
000000000000
000000000000
000000000000
000000000000
000000000000
000000000000
000000000000
000000000000
001000010000
110110010111
100000110010
000100000000
000000000000
000000000000
000000000000
000000000000
000000000000
000000000000
000000000000
001000010001
000000000000
000000000000
100110000110
111111101000
111111100110
111111100110
111111010111
111111101001
100110000101
000000000000
000000000000
000000000000
000000000000
000000000000
000000000000
000000000000
000000000000
000000000000
000100000000
110010000110
101101100100
000100000000
000000000000
000000000000
000000000000
000000000000
000000000000
000000000000
000000000000
011001010100
000000000000
000000000000
100110000110
111111101000
111111100110
111111010110
111111100111
101110100101
100010000101
000000000000
000000000000
000000000000
000000000000
000000000000
000000000000
000000000000
000000000000
000000000000
000100000000
110001110110
111110101000
000100000000
000000000000
000000000000
000000000000
000000000000
000000000000
000000000000
000000000000
110111001011
000000000000
000000000000
100110000110
111111011000
111111010110
111111100111
111111101000
100110000100
000100000000
000000000000
000000000000
000000000000
000000000000
000000000000
000000000000
000000000000
000000000000
011101100110
000100000000
110110000110
111010010111
000100000000
000000000000
000000000000
000000000000
000000000000
000000000000
000000000000
000000000000
101110101001
000100000000
000000000000
100110000110
111111101001
111111010110
111111100110
111111101000
100110000101
000000000000
000000000000
000000000000
000000000000
000000000000
000000000000
000000000000
000000000000
000000000000
011001100101
000100000000
110110000110
110110000111
000100000000
000000000000
000000000000
000000000000
000000000000
000000000000
000000000000
000000000000
111011011011
000100000000
000000000000
101010010110
110111000111
111111100111
111111100111
111111101000
100110000101
000000000000
000000000000
000000000000
000000000000
000000000000
000000000000
000000000000
000000000000
000000000000
011001010101
000100000000
111110101000
110110000110
000100000000
000000000000
000000000000
000000000000
000000000000
000000000000
000000000000
000000000000
111011011011
000100000000
000000000000
100001110101
111011011000
111111010111
111111100111
111111101000
100110010110
000000000000
000000000000
000000000000
000000000000
000000000000
000000000000
000000000000
000000000000
000000000000
011101100101
001000000000
100101000010
110110000110
000100000000
000000000000
000000000000
000000000000
000000000000
000000000000
000000000000
000000000000
111011001010
000100000000
000000000000
010000110010
001100100000
111111101001
111111010111
111111101000
100110010110
000000000000
000000000000
000000000000
000000000000
000000000000
000000000000
000000000000
000000000000
000000000000
100001100110
010000010000
100100110010
110110000111
000100000000
000000000000
000000000000
000000000000
000000000000
000000000000
000000000000
000100000000
110110111010
000100000000
000000000000
010101010100
001100100000
111111101010
111111100111
111111101000
100110000101
000000000000
000000000000
000000000000
000000000000
000000000000
000000000000
000000000000
000000000000
000000000000
100001100101
010000010000
100100110010
110110000111
000100000000
000000000000
000000000000
000000000000
000000000000
000000000000
000000000000
001100100001
110010011000
000100000000
000000000000
000000000000
010000110010
110111001000
111111101000
111111101000
100110000101
000000000000
000000000000
000000000000
000000000000
000000000000
000000000000
000000000000
000000000000
000000000000
100001100101
010000000000
100100110010
110110000111
000100000000
000000000000
000000000000
000000000000
000000000000
000000000000
000000000000
001100010001
110110101001
000100000000
000000000000
000000000000
000000000000
101010010110
111111111001
111111101001
101010010110
000000000000
000000000000
000000000000
000000000000
000000000000
000000000000
000000000000
000000000000
000000000000
110010101001
001100000000
100101000010
110110010111
000000000000
000000000000
000000000000
000000000000
000000000000
000000000000
000000000000
001100010001
110110101001
001000000000
000000000000
000000000000
000000000000
100110010110
111111111010
111111101001
100110010111
000000000000
000000000000
000000000000
000000000000
000000000000
000000000000
000000000000
000000000000
000000000000
111011011011
001100010000
100101010010
110110010111
000000000000
000000000000
000000000000
000000000000
000000000000
000000000000
000000000000
001000000000
110010011001
010000010000
000000000000
000000000000
000000000000
100110010101
111111111010
111111111010
000000000000
000000000000
000000000000
000000000000
000000000000
000000000000
000000000000
000000000000
000000000000
000000000000
111111111100
001000010000
100101010010
110110101000
000000000000
000000000000
000000000000
000000000000
000000000000
000000000000
000000000000
001000010001
110010011000
011101000011
000000000000
000000000000
000000000000
101010100110
111111111010
111111111010
000000000000
000000000000
000000000000
000000000000
000000000000
000000000000
000000000000
000000000000
000000000000
000000000000
111111111101
001000010000
100101100011
111010111000
000000000000
000000000000
000000000000
000000000000
000000000000
000000000000
000000000000
010000110010
101110010111
010100100001
000000000000
000000000000
000000000000
100110010110
111111111010
111111111010
000000000000
000000000000
000000000000
000000000000
000000000000
000000000000
000000000000
000000000000
000000000000
000000000000
111111111100
001000010000
100101110011
111111001010
000000000000
000000000000
000000000000
000000000000
000000000000
000000000000
000000000000
000000000000
110110101001
010000010000
000000000000
000000000000
000000000000
101010100111
111111111010
111111111010
000000000000
000000000000
000000000000
000000000000
000000000000
000000000000
000000000000
000000000000
000000000000
000000000000
111111111101
000100000000
011101010001
111111011010
000000000000
000000000000
000000000000
000000000000
000000000000
000000000000
000000000000
000000000000
100001010100
010000100001
000000000000
000000000000
000000000000
100110010110
111111111010
111111111010
000000000000
000000000000
000000000000
000000000000
000000000000
000000000000
000000000000
000000000000
000000000000
000000000000
111111111101
000000000000
010101000000
111111101011
000000000000
000000000000
000000000000
000000000000
000000000000
000000000000
000000000000
000000000000
011101000100
010000100001
000000000000
000000000000
000000000000
101010100111
111111111010
111111111011
000000000000
000000000000
000000000000
000000000000
000000000000
000000000000
000000000000
000000000000
000000000000
000000000000
111011101100
000000000000
010001000000
111111111011
000000000000
000000000000
000000000000
000000000000
000000000000
000000000000
000000000000
000000000000
001100010001
010000100010
000000000000
000000000000
000000000000
100110010110
111111111010
111111111010
000000000000
000000000000
000000000000
000000000000
000000000000
000000000000
000000000000
000000000000
000000000000
000000000000
111011101100
000000000000
010001000000
111111111100
000000000000
000000000000
000000000000
000000000000
000000000000
000000000000
000000000000
000000000000
010100110100
001100100010
000000000000
000000000000
000000000000
101010010111
111111111010
111111111010
000000000000
000000000000
000000000000
000000000000
000000000000
000000000000
000000000000
000000000000
000000000000
000000000000
111011011100
000000000000
001100110000
111111111100
000000000000
000000000000
000000000000
000000000000
000000000000
000000000000
000000000000
000000000000
001100110011
010001000100
000000000000
000000000000
000000000000
101010010111
111111111010
111111111001
000000000000
000000000000
000000000000
000000000000
000000000000
000000000000
000000000000
000000000000
000000000000
000000000000
100110011000
000000000000
010001000000
111111111100
000000000000
000000000000
000000000000
000000000000
000000000000
000000000000
000000000000
000000000000
000000000000
001000100010
000000000000
000000000000
000000000000
101010010111
111111111001
111111111010
000000000000
000000000000
000000000000
000000000000
000000000000
000000000000
000000000000
000000000000
000000000000
000000000000
101110101001
000000000000
001101000000
111111111100
000000000000
000000000000
000000000000
000000000000
000000000000
000000000000
000000000000
000000000000
000000000000
000000000000
000000000000
000000000000
000000000000
101010010111
111111111010
111111111010
000000000000
000000000000
000000000000
000000000000
000000000000
000000000000
000000000000
000000000000
000000000000
000000000000
010101000100
000000000000
010001000001
111111111100
000000000000
000000000000
000000000000
000000000000
000000000000
000000000000
000000000000
000000000000
000000000000
000000000000
000000000000
000000000000
000000000000
101010011000
111111111011
111111111011
000000000000
000000000000
000000000000
000000000000
000000000000
000000000000
000000000000
000000000000
000000000000
000000000000
010001000100
000000000000
010001000001
111111111100
000000000000
000000000000
000000000000
000000000000
000000000000
000000000000
000000000000
000000000000
000000000000
000000000000
000000000000
000000000000
000000000000
101110101001
101110111000
111111111101
000000000000
000000000000
000000000000
000000000000
000000000000
000000000000
000000000000
000000000000
000000000000
000000000000
000000000000
000000000000
010001000001
111111111100
000000000000
000000000000
000000000000
000000000000
000000000000
000000000000
000000000000
000000000000
000000000000
000000000000
000000000000
000000000000
000000000000
100110000111
000000000000
011001100101
000000000000
000000000000
000000000000
000000000000
000000000000
000000000000
000000000000
000000000000
000000000000
000000000000
000000000000
000000000000
010001000001
111111111100
000000000000
000000000000
000000000000
000000000000
000000000000
000000000000
000000000000
000000000000
000000000000
000000000000
000000000000
000000000000
000000000000
010101000100
000000000000
010101010101
000000000000
000000000000
000000000000
000000000000
000000000000
000000000000
000000000000
000000000000
000000000000
000000000000
000000000000
000000000000
001100110001
111111111100
000000000000
000000000000
000000000000
000000000000
000000000000
000000000000
000000000000
000000000000
000000000000
000000000000
000000000000
000000000000
000000000000
010101010101
000000000000
010101100101
000000000000
000000000000
000000000000
000000000000
000000000000
000000000000
000000000000
000000000000
000000000000
000000000000
000000000000
000000000000
001100110000
111111111100
000000000000
000000000000
000000000000
000000000000
000000000000
000000000000
000000000000
000000000000
000000000000
000000000000
000000000000
000000000000
000000000000
010101010101
000000000000
010101010101
000000000000
000000000000
000000000000
000000000000
000000000000
000000000000
000000000000
000000000000
000000000000
000000000000
000000000000
000000000000
010001000001
111111111100
000000000000
000000000000
000000000000
000000000000
000000000000
000000000000
000000000000
000000000000
000000000000
000000000000
000000000000
000000000000
000000000000
010101010101
000000000000
010101010101
000000000000
000000000000
000000000000
000000000000
000000000000
000000000000
000000000000
000000000000
000000000000
000000000000
000000000000
000000000000
001100110001
111111111101
000000000000
000000000000
000000000000
000000000000
000000000000
000000000000
000000000000
000000000000
000000000000
000000000000
000000000000
000000000000
000000000000
010101010101
000000000000
010101010101
000000000000
000000000000
000000000000
000000000000
000000000000
000000000000
000000000000
000000000000
000000000000
000000000000
000000000000
000000000000
001101000001
111111111100
000000000000
000000000000
000000000000
000000000000
000000000000
000000000000
000000000000
000000000000
000000000000
000000000000
000000000000
000000000000
000000000000
010101010101
000000000000
000000000000
000000000000
000000000000
000000000000
000000000000
000000000000
000000000000
000000000000
000000000000
000000000000
000000000000
000000000000
000000000000
010001000001
111111111100
001100110010
000000000000
000000000000
000000000000
000000000000
000000000000
000000000000
000000000000
000000000000
000000000000
000000000000
000000000000
000000000000
010001000100
000000000000
000000000000
000000000000
000000000000
000000000000
000000000000
000000000000
000000000000
000000000000
000000000000
000000000000
000000000000
000000000000
000000000000
001100110001
111111111101
001100110010
000000000000
000000000000
000000000000
000000000000
000000000000
000000000000
000000000000
000000000000
000000000000
000000000000
000000000000
000000000000
000000000000
000000000000
000000000000
000000000000
000000000000
000000000000
000000000000
000000000000
000000000000
000000000000
000000000000
000000000000
000000000000
000000000000
000000000000
010101010010
111111111101
001100110010
000000000000
000000000000
000000000000
000000000000
000000000000
000000000000
000000000000
000000000000
000000000000
000000000000
000000000000
000000000000
000000000000
000000000000
000000000000
000000000000
000000000000
000000000000
000000000000
000000000000
000000000000
000000000000
000000000000
000000000000
000000000000
000000000000
000000000000
000000000000
111111111101
010000110010
000000000000
000000000000
000000000000
000000000000
000000000000
000000000000
000000000000
000000000000
000000000000
000000000000
000000000000
000000000000
000000000000
000000000000
000000000000
000000000000
000000000000
000000000000
000000000000
000000000000
000000000000
000000000000
000000000000
000000000000
000000000000
000000000000
000000000000
000000000000
111111111101
010001000011
000000000000
000000000000
000000000000
000000000000
000000000000
000000000000
000000000000
000000000000
000000000000
000000000000
000000000000
000000000000
000000000000
000000000000
000000000000
000000000000
000000000000
000000000000
000000000000
000000000000
000000000000
000000000000
000000000000
000000000000
000000000000
000000000000
000000000000
000000000000
111111111101
001100110010
000000000000
000000000000
000000000000
000000000000
000000000000
000000000000
000000000000
000000000000
000000000000
000000000000
000000000000
000000000000
000000000000
000000000000
000000000000
000000000000
000000000000
000000000000
000000000000
000000000000
000000000000
000000000000
000000000000
000000000000
000000000000
000000000000
000000000000
000000000000
111111111101
010000110011
000000000000
000000000000
000000000000
000000000000
000000000000
000000000000
000000000000
000000000000
000000000000
000000000000
000000000000
000000000000
000000000000
000000000000
000000000000
000000000000
000000000000
000000000000
000000000000
000000000000
000000000000
000000000000
000000000000
000000000000
000000000000
000000000000
000000000000
000000000000
101010101001
010001000011
000000000000
000000000000
000000000000
000000000000
000000000000
000000000000
000000000000
000000000000
000000000000
000000000000
000000000000
000000000000
000000000000
000000000000
000000000000
000000000000
000000000000
000000000000
000000000000
000000000000
000000000000
000000000000
000000000000
000000000000
000000000000
000000000000
000000000000
000000000000
101010101001
010001000011
000000000000
000000000000
000000000000
000000000000
000000000000
000000000000
000000000000
000000000000
000000000000
000000000000
000000000000
000000000000
000000000000
000000000000
000000000000
000000000000
000000000000
000000000000
000000000000
000000000000
000000000000
000000000000
000000000000
000000000000
000000000000
000000000000
000000000000
000000000000
101010101000
010101000100
000000000000
000000000000
000000000000
000000000000
000000000000
000000000000
000000000000
000000000000
000000000000
000000000000
000000000000
000000000000
000000000000
000000000000
000000000000
000000000000
000000000000
000000000000
000000000000
000000000000
000000000000
000000000000
000000000000
000000000000
000000000000
000000000000
000000000000
000000000000
010001000011
010101010100
000000000000
000000000000
000000000000
000000000000
000000000000
000000000000
000000000000
000000000000
000000000000
000000000000
000000000000
000000000000
000000000000
000000000000
000000000000
000000000000
000000000000
000000000000
000000000000
000000000000
000000000000
000000000000
000000000000
000000000000
000000000000
000000000000
000000000000
000000000000
010101010100
010101000100
000000000000
000000000000
000000000000
000000000000
000000000000
000000000000
000000000000
000000000000
000000000000
000000000000
000000000000
000000000000
000000000000
000000000000
000000000000
000000000000
000000000000
000000000000
000000000000
000000000000
000000000000
000000000000
000000000000
000000000000
000000000000
000000000000
000000000000
000000000000
000000000000
010101000100
000000000000
000000000000
000000000000
000000000000
000000000000
000000000000
000000000000
000000000000
000000000000
000000000000
000000000000
000000000000
000000000000
000000000000
000000000000
000000000000
000000000000
000000000000
000000000000
000000000000
000000000000
000000000000
000000000000
000000000000
000000000000
000000000000
000000000000
000000000000
000000000000
010101010101
000000000000
000000000000
000000000000
000000000000
000000000000
000000000000
000000000000
000000000000
000000000000
000000000000
000000000000
000000000000
000000000000
000000000000
000000000000
000000000000
000000000000
000000000000
000000000000
000000000000
000000000000
000000000000
000000000000
000000000000
000000000000
000000000000
000000000000
000000000000
000000000000
010001000100
000000000000
000000000000
000000000000
000000000000
000000000000
000000000000
000000000000
000000000000
000000000000
000000000000
000000000000
000000000000
000000000000
000000000000
000000000000
000000000000
000000000000
000000000000
000000000000
000000000000
000000000000
000000000000
000000000000
000000000000
000000000000
000000000000
000000000000
000000000000
000000000000
010001000100
000000000000
000000000000
000000000000
000000000000
000000000000
000000000000
000000000000
000000000000
000000000000
000000000000
000000000000
000000000000
000000000000
000000000000
000000000000
000000000000
000000000000
000000000000
000000000000
000000000000
000000000000
000000000000
000000000000
000000000000
000000000000
000000000000
000000000000
000000000000
000000000000
010001000100
000000000000
000000000000
000000000000
000000000000
000000000000
000000000000
000000000000
000000000000
000000000000
000000000000
000000000000
000000000000
000000000000
000000000000
000000000000
000000000000
000000000000
000000000000
000000000000
000000000000
000000000000
000000000000
000000000000
000000000000
000000000000
000000000000
000000000000
000000000000
000000000000
010101010100
000000000000
000000000000
000000000000
000000000000
000000000000
000000000000
000000000000
000000000000
000000000000
000000000000
000000000000
000000000000
000000000000
000000000000
000000000000
000000000000
000000000000
000000000000
000000000000
000000000000
000000000000
000000000000
000000000000
000000000000
000000000000
000000000000
000000000000
000000000000
000000000000
010101010101
000000000000
000000000000
000000000000
000000000000
000000000000
000000000000
000000000000
000000000000
000000000000
000000000000
000000000000
000000000000
000000000000
000000000000
000000000000
000000000000
000000000000
000000000000
000000000000
000000000000
000000000000
000000000000
000000000000
000000000000
000000000000
000000000000
000000000000
000000000000
000000000000
000000000000
000000000000
000000000000
000000000000
000000000000
000000000000
000000000000
000000000000
000000000000
000000000000
000000000000
000000000000
000000000000
000000000000
000000000000
000000000000
000000000000
000000000000
000000000000
000000000000
000000000000
000000000000
000000000000
000000000000
000000000000
000000000000
000000000000
000000000000
000000000000
000000000000
000000000000
000000000000
000000000000
000000000000
000000000000
000000000000
000000000000
000000000000
000000000000
000000000000
000000000000
000000000000
000000000000
000000000000
000000000000
000000000000
000000000000
000000000000
000000000000
000000000000
000000000000
000000000000
000000000000
000000000000
000000000000
000000000000
000000000000
000000000000
000000000000
000000000000
000000000000
000000000000
000000000000
000000000000
000000000000
000000000000
000000000000
000000000000
000000000000
000000000000
000000000000
000000000000
000000000000
000000000000
000000000000
000000000000
000000000000
000000000000
000000000000
000000000000
000000000000
000000000000
000000000000
000000000000
000000000000
000000000000
000000000000
000000000000
000000000000
000000000000
000000000000
000000000000
000000000000
000000000000
000000000000
000000000000
000000000000
000000000000
000000000000
000000000000
000000000000
000000000000
000000000000
000000000000
000000000000
000000000000
000000000000
000000000000
000000000000
000000000000
000000000000
000000000000
000000000000
000000000000
000000000000
000000000000
000000000000
000000000000
000000000000
000000000000
000000000000
000000000000
000000000000
000000000000
000000000000
000000000000
000000000000
000000000000
000000000000
000000000000
000000000000
000000000000
000000000000
000000000000
000000000000
000000000000
000000000000
000000000000
000000000000
000000000000
000000000000
000000000000
000000000000
000000000000
000000000000
000000000000
000000000000
000000000000
000000000000
001000100010
010001000011
000000000000
000000000000
000000000000
000000000000
000000000000
000000000000
000000000000
000000000000
000000000000
000000000000
000000000000
000000000000
000000000000
000000000000
000000000000
000000000000
000000000000
000000000000
000000000000
000000000000
000000000000
000000000000
000000000000
000000000000
000000000000
000000000000
000000000000
000000000000
010101000100
010000110010
010000110010
000000000000
000000000000
000000000000
000000000000
000000000000
000000000000
000000000000
000000000000
000000000000
000000000000
000000000000
000000000000
000000000000
000000000000
000000000000
000000000000
000000000000
000000000000
000000000000
000000000000
000000000000
000000000000
000000000000
000000000000
000000000000
000000000000
000000000000
011001100101
011001100101
001100110001
000000000000
000000000000
000000000000
000000000000
000000000000
000000000000
000000000000
000000000000
000000000000
000000000000
000000000000
000000000000
000000000000
000000000000
000000000000
000000000000
000000000000
000000000000
000000000000
000000000000
000000000000
000000000000
000000000000
000000000000
000000000000
000000000000
000000000000
100010000111
101110111001
010101000010
000000000000
000000000000
000000000000
000000000000
000000000000
000000000000
000000000000
000000000000
000000000000
000000000000
000000000000
000000000000
000000000000
000000000000
000000000000
000000000000
000000000000
000000000000
000000000000
000000000000
000000000000
000000000000
000000000000
000000000000
000000000000
000000000000
000000000000
011101100101
111011011010
100010000100
000000000000
000000000000
000000000000
000000000000
000000000000
000000000000
000000000000
000000000000
000000000000
000000000000
000000000000
000000000000
000000000000
000000000000
000000000000
000000000000
000000000000
000000000000
000000000000
000000000000
000000000000
000000000000
000000000000
000000000000
000000000000
000000000000
000000000000
010001000011
111111111011
011101100010
000000000000
000000000000
000000000000
000000000000
000000000000
000000000000
000000000000
000000000000
000000000000
000000000000
000000000000
000000000000
000000000000
000000000000
000000000000
000000000000
000000000000
000000000000
000000000000
000000000000
000000000000
000000000000
000000000000
000000000000
000000000000
000000000000
000000000000
010000110010
111111111011
011101100010
000000000000
000000000000
000000000000
000000000000
000000000000
000000000000
000000000000
000000000000
000000000000
000000000000
000000000000
000000000000
000000000000
000000000000
000000000000
000000000000
000000000000
000000000000
000000000000
000000000000
000000000000
000000000000
000000000000
000000000000
000000000000
000000000000
000000000000
010000110010
111111101011
011101100001
000000000000
000000000000
000000000000
000000000000
000000000000
000000000000
000000000000
000000000000
000000000000
000000000000
000000000000
000000000000
000000000000
000000000000
000000000000
000000000000
000000000000
000000000000
000000000000
000000000000
000000000000
000000000000
000000000000
000000000000
000000000000
000000000000
000000000000
001100100001
111111101011
011101010001
000000000000
000000000000
000000000000
000000000000
000000000000
000000000000
000000000000
000000000000
000000000000
000000000000
000000000000
000000000000
000000000000
000000000000
000000000000
000000000000
000000000000
000000000000
000000000000
000000000000
000000000000
000000000000
000000000000
000000000000
000000000000
000000000000
000000000000
001100100001
111111101011
011101000000
000000000000
000000000000
000000000000
000000000000
000000000000
000000000000
000000000000
000000000000
000000000000
000000000000
000000000000
000000000000
000000000000
000000000000
000000000000
000000000000
000000000000
000000000000
000000000000
000000000000
000000000000
000000000000
000000000000
000000000000
000000000000
000000000000
000000000000
001000010000
111111001010
100001000001
000000000000
000000000000
000000000000
000000000000
000000000000
000000000000
000000000000
000000000000
000000000000
000000000000
000000000000
000000000000
000000000000
000000000000
000000000000
000000000000
000000000000
000000000000
000000000000
000000000000
000000000000
000000000000
000000000000
000000000000
000000000000
000000000000
000000000000
000100000000
111010111001
101101110100
000000000000
000000000000
000000000000
000000000000
000000000000
000000000000
000000000000
000000000000
000000000000
000000000000
000000000000
000000000000
000000000000
000000000000
000000000000
000000000000
000000000000
000000000000
000000000000
000000000000
000000000000
000000000000
000000000000
000000000000
000000000000
000000000000
000000000000
000000000000
011101000010
110110010111
000000000000
000000000000
000000000000
000000000000
000000000000
000000000000
000000000000
000000000000
000000000000
000000000000
000000000000
000000000000
000000000000
000000000000
000000000000
000000000000
000000000000
000000000000
000000000000
000000000000
000000000000
000000000000
000000000000
000000000000
000000000000
000000000000
000000000000
000000000000
001100000000
101101110101
000000000000
000000000000
000000000000
000000000000
000000000000
000000000000
000000000000
000000000000
000000000000
000000000000
000000000000
000000000000
000000000000
000000000000
000000000000
000000000000
000000000000
000000000000
000000000000
000000000000
000000000000
000000000000
000000000000
000000000000
000000000000
000000000000
000000000000
000000000000
001000000000
101101110110
000000000000
000000000000
000000000000
000000000000
000000000000
000000000000
000000000000
000000000000
000000000000
000000000000
000000000000
000000000000
000000000000
000000000000
000000000000
000000000000
000000000000
000000000000
000000000000
000000000000
000000000000
000000000000
000000000000
000000000000
000000000000
000000000000
000000000000
000000000000
000100000000
101110000111
000000000000
000000000000
000000000000
000000000000
000000000000
000000000000
000000000000
000000000000
000000000000
000000000000
000000000000
000000000000
000000000000
000000000000
000000000000
000000000000
000000000000
000000000000
000000000000
000000000000
000000000000
000000000000
000000000000
000000000000
000000000000
000000000000
000000000000
000000000000
000100000000
100101010100
000000000000
000000000000
000000000000
000000000000
000000000000
000000000000
000000000000
000000000000
000000000000
000000000000
000000000000
000000000000
000000000000
000000000000
000000000000
000000000000
000000000000
000000000000
000000000000
000000000000
000000000000
000000000000
000000000000
000000000000
000000000000
000000000000
000000000000
000000000000
000100000000
011101000011
000000000000
000000000000
000000000000
000000000000
000000000000
000000000000
000000000000
000000000000
000000000000
000000000000
000000000000
000000000000
000000000000
000000000000
000000000000
000000000000
000000000000
000000000000
000000000000
000000000000
000000000000
000000000000
000000000000
000000000000
000000000000
000000000000
000000000000
000000000000
000100000000
011101000100
000000000000
000000000000
000000000000
000000000000
000000000000
000000000000
000000000000
000000000000
000000000000
000000000000
000000000000
000000000000
000000000000
000000000000
000000000000
000000000000
000000000000
000000000000
000000000000
000000000000
000000000000
000000000000
000000000000
000000000000
000000000000
000000000000
000000000000
000000000000
000100000000
100001100101
000000000000
000000000000
000000000000
000000000000
000000000000
000000000000
000000000000
000000000000
000000000000
000000000000
000000000000
000000000000
000000000000
000000000000
000000000000
000000000000
000000000000
000000000000
000000000000
000000000000
000000000000
000000000000
000000000000
000000000000
000000000000
000000000000
000000000000
000000000000
000000000000
010000110010
000000000000
000000000000
000000000000
000000000000
000000000000
000000000000
000000000000
000000000000
000000000000
000000000000
000000000000
000000000000
000000000000
000000000000
000000000000
000000000000
000000000000
000000000000
000000000000
000000000000
000000000000
000000000000
000000000000
000000000000
000000000000
000000000000
000000000000
000000000000
000000000000
001100100010
000000000000
000000000000
000000000000
000000000000
000000000000
000000000000
000000000000
000000000000
000000000000
000000000000
000000000000
000000000000
000000000000
000000000000
000000000000
000000000000
000000000000
000000000000
000000000000
000000000000
000000000000
000000000000
000000000000
000000000000
000000000000
000000000000
000000000000
000000000000
000000000000
001100010001
000000000000
000000000000
000000000000
000000000000
000000000000
000000000000
000000000000
000000000000
000000000000
000000000000
000000000000
000000000000
000000000000
000000000000
000000000000
000000000000
000000000000
000000000000
000000000000
000000000000
000000000000
000000000000
000000000000
000000000000
000000000000
000000000000
000000000000
000000000000
000000000000
001100100010
000000000000
000000000000
000000000000
000000000000
000000000000
000000000000
000000000000
000000000000
000000000000
000000000000
000000000000
000000000000
000000000000
000000000000
000000000000
000000000000
000000000000
000000000000
000000000000
000000000000
000000000000
000000000000
000000000000
000000000000
000000000000
000000000000
000000000000
000000000000
000000000000
001100100010
000000000000
000000000000
000000000000
000000000000
000000000000
000000000000
000000000000
000000000000
000000000000
000000000000
000000000000
000000000000
000000000000
000000000000
000000000000
000000000000
000000000000
000000000000
000000000000
000000000000
000000000000
000000000000
000000000000
000000000000
000000000000
000000000000
000000000000
000000000000
000000000000
001000010001
000000000000
000000000000
000000000000
000000000000
000000000000
000000000000
000000000000
000000000000
000000000000
000000000000
000000000000
000000000000
000000000000
000000000000
000000000000
000000000000
000000000000
000000000000
000000000000
000000000000
000000000000
000000000000
000000000000
000000000000
000000000000
000000000000
000000000000
000000000000
000000000000
000000000000
000000000000
000000000000
000000000000
000000000000
000000000000
000000000000
000000000000
000000000000
000000000000
000000000000
000000000000
000000000000
000000000000
000000000000
000000000000
000000000000
000000000000
000000000000
000000000000
000000000000
000000000000
000000000000
000000000000
000000000000
000000000000
000000000000
000000000000
000000000000
000000000000
000000000000
