000000000000
000000000000
000000000000
000000000000
000000000000
000000000000
000000000000
000000000000
000000000000
000000000000
000000000000
000000000000
000000000000
000000000000
000000000000
000000000000
000000000000
000000000000
000000000000
000000000000
000000000000
000000000000
000000000000
000100000000
000100000000
000100000000
000100000000
000100000000
001000000000
001000000000
000000000000
000000000000
000000000000
000000000000
000000000000
000000000000
000000000000
000000000000
000000000000
000000000000
000000000000
000000000000
000000000000
000000000000
000000000000
000000000000
000000000000
000000000000
000000000000
000000000000
000000000000
000000000000
000000000000
000100000000
000100000000
000100000000
000100000000
000100000000
001000000000
001000000000
000000000000
000000000000
000000000000
000000000000
000000000000
000000000000
000000000000
000000000000
000000000000
000000000000
000000000000
000000000000
000000000000
000000000000
000000000000
000000000000
000000000000
000000000000
000000000000
000000000000
000000000000
000000000000
000000000000
000100000000
000100000000
000100000000
000100000000
000100000000
001000000000
001000000000
000000000000
000000000000
000000000000
000000000000
000000000000
000000000000
000000000000
000000000000
000000000000
000000000000
000000000000
000000000000
000000000000
000000000000
000000000000
000000000000
000000000000
000000000000
000000000000
000000000000
000000000000
000000000000
000000000000
000100000000
000100000000
000100000000
000100000000
001000000000
001000000000
001000000000
000000000000
000000000000
000000000000
000000000000
000000000000
000000000000
000000000000
000000000000
000000000000
000000000000
000000000000
000000000000
000000000000
000000000000
000000000000
000000000000
000000000000
000000000000
000000000000
000000000000
000000000000
000000000000
000000000000
000100000000
000100000000
000100000000
000100000000
001000000000
001000000000
001000000000
000000000000
000000000000
000000000000
000000000000
000000000000
000000000000
000000000000
000000000000
000000000000
000000000000
000000000000
000000000000
000000000000
000000000000
000000000000
000000000000
000000000000
000000000000
000000000000
000000000000
000000000000
000000000000
000000000000
000100000000
000100000000
000100000000
001000000000
001000000000
001000000000
001000000000
000000000000
000000000000
000000000000
000000000000
000000000000
000000000000
000000000000
000000000000
000000000000
000000000000
000000000000
000000000000
000000000000
000000000000
000000000000
000000000000
000000000000
000000000000
000000000000
000000000000
000000000000
000000000000
000100000000
000100000000
000100000000
000100000000
001000000000
001000000000
001000000000
001000000000
000000000000
000000000000
000000000000
000000000000
000000000000
000000000000
000000000000
000000000000
000000000000
000000000000
000000000000
000000000000
000000000000
000000000000
000000000000
000000000000
000000000000
000000000000
000000000000
000000000000
000000000000
000000000000
000100000000
000100000000
000100000000
001000000000
001000000000
001000000000
001000000000
001000000000
000000000000
000000000000
000000000000
000000000000
000000000000
000000000000
000000000000
000000000000
000000000000
000000000000
000000000000
000000000000
000000000000
000000000000
000000000000
000000000000
000000000000
000000000000
000000000000
000000000000
000000000000
000100000000
000100000000
000100000000
001000000000
001000000000
001000000000
001000000000
001000000000
001000000000
000000000000
000000000000
000000000000
000000000000
000000000000
000000000000
000000000000
000000000000
000000000000
000000000000
000000000000
000000000000
000000000000
000000000000
000000000000
000000000000
000000000000
000000000000
000000000000
000000000000
000000000000
000100000000
000100000000
000100000000
001000000000
001000000000
001000000000
001000000000
001100000000
001100000000
000000000000
000000000000
000000000000
000000000000
000000000000
000000000000
000000000000
000000000000
000000000000
000000000000
000000000000
000000000000
000000000000
000000000000
000000000000
000000000000
000000000000
000000000000
000000000000
000000000000
000000000000
000100000000
000100000000
000100000000
001000000000
001000000000
001000000000
001100000000
001100000000
001100000000
000000000000
000000000000
000000000000
000000000000
000000000000
000000000000
000000000000
000000000000
000000000000
000000000000
000000000000
000000000000
000000000000
000000000000
000000000000
000000000000
000000000000
000000000000
000000000000
000000000000
000000000000
000100000000
000100000000
000100000000
001000000000
001000000000
001100000000
001100000000
001100000000
001100000000
000000000000
000000000000
000000000000
000000000000
000000000000
000000000000
000000000000
000000000000
000000000000
000000000000
000000000000
000000000000
000000000000
000000000000
000000000000
000000000000
000000000000
000000000000
000000000000
000000000000
000100000000
000100000000
000100000000
001000000000
001000000000
001000000000
001100000000
001100000000
001100000000
010000000000
000000000000
000000000000
000000000000
000000000000
000000000000
000000000000
000000000000
000000000000
000000000000
000000000000
000000000000
000000000000
000000000000
000000000000
000000000000
000000000000
000000000000
000000000000
000000000000
000000000000
000100000000
000100000000
000100000000
001000000000
001000000000
001100000000
001100000000
001100000000
010000000000
010000000000
000000000000
000000000000
000000000000
000000000000
000000000000
000000000000
000000000000
000000000000
000000000000
000000000000
000000000000
000000000000
000000000000
000000000000
000000000000
000000000000
000000000000
000000000000
000000000000
000100000000
000100000000
000100000000
001000000000
001000000000
001100000000
001100000000
001100000000
010000000000
010000000000
010000000000
000000000000
000000000000
000000000000
000000000000
000000000000
000000000000
000000000000
000000000000
000000000000
000000000000
000000000000
000000000000
000000000000
000000000000
000000000000
000000000000
000000000000
000000000000
000000000000
000100000000
000100000000
000100000000
001000000000
001000000000
001100000000
001100000000
001100000000
010000000000
010000000000
010000000000
000000000000
000000000000
000000000000
000000000000
000000000000
000000000000
000000000000
000000000000
000000000000
000000000000
000000000000
000000000000
000000000000
000000000000
000000000000
000000000000
000000000000
000000000000
000100000000
000100000000
000100000000
000100000000
001000000000
001000000000
001000000000
001100000000
001100000000
010000000000
010000000000
011000010001
000000000000
000000000000
000000000000
000000000000
000000000000
000000000000
000000000000
000000000000
000000000000
000000000000
000000000000
000000000000
000000000000
000000000000
000000000000
000000000000
000000000000
000100000000
000100000000
000100000000
000100000000
000100000000
001000000000
001000000000
001100000000
001100000000
001100000000
010000000000
010100000000
100000110011
000000000000
000000000000
000000000000
000000000000
000000000000
000000000000
000000000000
000000000000
000000000000
000000000000
000000000000
000000000000
000000000000
000000000000
000000000000
000000000000
000100000000
000100000000
000100000000
000100000000
000100000000
001000000000
001000000000
001000000000
001100000000
001100000000
001100000000
010000000000
010100010001
101001100110
000000000000
000000000000
000000000000
000000000000
000000000000
000000000000
000000000000
000000000000
000000000000
000000000000
000000000000
000000000000
000000000000
000000000000
000000000000
000000000000
000100000000
000100000000
000100000000
000100000000
000100000000
001000000000
001000000000
001100000000
001100000000
001100000000
010000000000
010000000000
011000100010
110010001000
000000000000
000000000000
000000000000
000000000000
000000000000
000000000000
000000000000
000000000000
000000000000
000000000000
000000000000
000000000000
000000000000
000000000000
000000000000
000000000000
000000000000
000100000000
000100000000
000100000000
001000000000
001000000000
001000000000
001100000000
001100000000
010000000000
010000000000
010000010001
100001000100
111010101010
000000000000
000000000000
000000000000
000000000000
000000000000
000000000000
000000000000
000000000000
000000000000
000000000000
000000000000
000000000000
000000000000
000000000000
000000000000
000000000000
000000000000
000100000000
000100000000
000100000000
001000000000
001000000000
001100000000
001100000000
001100000000
010000000000
010000000000
010100100010
101001100110
111111001100
000000000000
000000000000
000000000000
000000000000
000000000000
000000000000
000000000000
000000000000
000000000000
000000000000
000000000000
000000000000
000000000000
000000000000
000000000000
000000000000
000000000000
000100000000
000100000000
000100000000
001000000000
001000000000
001100000000
001100000000
001100000000
010000000000
010000000001
011100110011
110010011001
111111001101
000000000000
000000000000
000000000000
000000000000
000000000000
000000000000
000000000000
000000000000
000000000000
000000000000
000000000000
000000000000
000000000000
000000000000
000000000000
000000000000
000000000000
000100000000
000100000000
000100000000
001000000000
001100000000
001100000000
001100000000
001100000000
010000000000
010000010001
100001010101
111010111011
111111001100
000000000000
000000000000
000000000000
000000000000
000000000000
000000000000
000000000000
000000000000
000000000000
000000000000
000000000000
000000000000
000000000000
000000000000
000000000000
000000000000
000100000000
000100000000
000100000000
001000000000
001000000000
001100000000
001100000000
010000000000
001100000000
010000000000
010100010001
101001110111
111110111100
111111001101
000000000000
000000000000
000000000000
000000000000
000000000000
000000000000
000000000000
000000000000
000000000000
000000000000
000000000000
000000000000
000000000000
000000000000
000000000000
000000000000
000100000000
000100000000
000100000000
001000000000
001000000000
001100000000
001100000000
001100000000
001100000000
010000000001
011101000100
110110011010
111111011101
111011001100
000000000000
000000000000
000000000000
000000000000
000000000000
000000000000
000000000000
000000000000
000000000000
000000000000
000000000000
000000000000
000100000000
000000000000
000000000000
000000000000
000100000000
000100000000
000100000000
001000000000
001000000000
001100000000
001100000000
001100000000
010000010001
010000010001
100101100110
111010111011
111111011101
110110101011
000000000000
000000000000
000000000000
000000000000
000000000000
000000000000
000000000000
000000000000
000000000000
000000000000
000000000000
000000000000
000100000000
000000000000
000000000000
000100000000
000100000000
000100000000
000100000000
001000000000
001000000000
001100000000
001100000000
010000000000
010100010001
010100100010
101110001000
111111001101
111111011101
110010101010
000000000000
000000000000
000000000000
000000000000
000000000000
000000000000
000000000000
000000000000
000000000000
000000000000
000000000000
000100000000
000100000000
000100000000
000100000000
000100000000
000100000000
000100000000
001000000000
001000000000
001000000000
001100000000
001100000000
010000000000
010000010001
011000110011
110010011001
111111011101
111111001101
101110001001
000000000000
000000000000
000000000000
000000000000
000000000000
000000000000
000000000000
000000000000
000000000000
000000000000
000100000000
000100000000
000100000000
000100000000
000100000000
000100000000
000100000000
000100000000
001000000000
001000000000
001100000000
001100000000
001100000000
001100000000
010100010010
100001010101
111010111011
111111011101
111111001100
101001110111
000000000000
000000000000
000000000000
000000000000
000000000000
000000000000
000000000000
000000000000
000000000000
000000000000
000100000000
000100000000
000100000000
000100000000
000100000000
000100000000
000100000000
001000000000
001000000000
001000000000
001100000000
001100000000
010000000000
001100000000
010100100010
101001110111
111111001100
111111011101
111010111100
100001010110
000000000000
000000000000
000000000000
000000000000
000000000000
000000000000
000000000000
000000000000
000000000000
000000000000
000100000000
000100000000
000100000000
000100000000
000100000000
000100000000
000100000000
001000000000
001000000000
001000000000
001100000000
001100000000
010000000001
010000000001
011100110100
110010011010
111111011101
111111011101
110110101010
011101000101
000000000000
000000000000
000000000000
000000000000
000000000000
000000000000
000000000000
000000000000
000000000000
000000000000
000100000000
000100000000
000100000000
000100000000
000100000000
000100000000
001000000000
001000000000
001000000000
001000000000
001100000000
001100000000
010000000001
010000000001
100101100110
111010111100
111111011101
111111001101
110010001001
011100110011
000000000000
000000000000
000000000000
000000000000
000000000000
000000000000
000000000000
000000000000
000000000000
000000000000
000100000000
000100000000
000100000000
000100000000
000100000000
001000000000
001000000000
001000000000
001000000000
001100000000
001100000000
010000000000
010000000000
010100010010
101110001001
111110111100
111111001101
111111001101
101101111000
010100010010
000000000000
000000000000
000000000000
000000000000
000000000000
000000000000
000000000000
000000000000
000000000000
000000000000
000100000000
000100000000
000100000000
000100000000
000100000000
001000000000
001000000000
001100000000
001100000000
001100000000
001100000000
010000000001
010000000000
011000100011
110110101011
111111001101
111111001101
111110111100
101001100110
010100000001
000000000000
000000000000
000000000000
000000000000
000000000000
000000000000
000000000000
000000000000
000000000000
000000000000
000100000000
000100000000
000100000000
000100000000
000100000000
001000000000
001000000000
001100000000
001100000000
001100000000
010000000000
010000000001
010000010001
100001010101
111111001100
111111011101
111111001101
111010101010
100000110100
010100000001
000000000000
000000000000
000000000000
000000000000
000000000000
000000000000
000000000000
000000000000
000000000000
000000000000
000100000000
000100000000
000100000000
000100000000
000100000000
001000000000
001100000000
001100000000
010000000000
010000000000
010000000000
010000000000
011000100011
101110001001
111111001101
111111011101
111111001101
110010001001
011100100011
011000000001
000000000000
000000000000
000000000000
000000000000
000000000000
000000000000
000000000000
000000000000
000000000000
000000000000
000100000000
000100000000
000100000000
000100000000
001000000000
001000000000
001100000000
001100000000
010000000000
010000000000
010000000000
010000000000
011101000100
111010111011
111111011101
111111011101
111111001100
101101100111
011000010010
011000000001
000000000000
000000000000
000000000000
000000000000
000000000000
000000000000
000000000000
000000000000
000000000000
000000000000
000100000000
000100000000
000100000000
000100000000
001000000000
001000000000
001000000000
001100000000
010000000000
010000000000
010000000000
010100010001
100101100110
111111001101
111111011101
111111011101
111110111100
100101010110
011000010010
010100000001
000000000000
000000000000
000000000000
000000000000
000000000000
000000000000
000000000000
000000000000
000000000000
000100000000
000100000000
000100000000
000100000000
001000000000
001000000000
001000000000
001100000000
001100000000
010000000000
010000000000
010100000000
011000100010
101110001000
111111011101
111111011101
111111011101
111010101011
100001000101
010100000001
010100000000
000000000000
000000000000
000000000000
000000000000
000000000000
000000000000
000000000000
000000000000
000000000000
000100000000
000100000000
000100000000
000100000000
001000000000
001000000000
001000000000
001000000000
001100000000
010000000000
010000000000
010100010001
100101010101
110110111011
111111011101
111111011101
111111011101
110010001001
011100100011
010100000001
010100000000
000000000000
000000000000
000000000000
000000000000
000000000000
000000000000
000000000000
000000000000
000000000000
000100000000
000100000000
000100000000
001000000000
001000000000
001000000000
001000000000
001100000000
001100000000
010000000000
010000000000
011000010010
101001110111
111111001100
111111011101
111111011101
111111001100
101101110111
011000010010
010100000000
010100000000
000000000000
000000000000
000000000000
000000000000
000000000000
000000000000
000000000000
000100000000
000100000000
000100000000
000100000000
001000000000
001000000000
001000000000
001100000000
001000000000
001100000000
001100000000
010000000001
010100010001
011100110011
110010011001
111111011101
111111011101
111111011101
111010111011
100101010101
010100000001
010100000000
010100000000
000000000000
000000000000
000000000000
000000000000
000000000000
000000000000
000100000000
000100000000
000100000000
000100000000
001000000000
001000000000
001000000000
001000000000
001100000000
001100000000
001100000000
001100000000
010100000001
011000100010
100101010110
111010111011
111111011101
111111011101
111111011101
110110101010
100000110100
010100000001
010100000000
010100000000
000000000000
000000000000
000000000000
000000000000
000000000000
000000000000
000100000000
000100000000
000100000000
000100000000
001000000000
001000000000
001000000000
001000000000
001100000000
001100000000
001100000000
001100000000
010000000000
011000100010
101101111000
111111001100
111111011101
111111011101
111111011101
110010011001
011000100011
010100000001
010100000000
010000000000
000000000000
000000000000
000000000000
000000000000
000000000000
000100000000
000100000000
000100000000
000100000000
000100000000
001000000000
001000000000
001000000000
001100000000
001100000000
001100000000
001100000000
010000000000
010000000000
011100110011
110010011010
111111011101
111111011101
111111011101
111111011101
101001110111
010100010010
010100000000
010100000000
010100000000
000000000000
000000000000
000000000000
000000000000
000000000000
000100000000
000100000000
000100000000
000100000000
000100000000
001000000000
001000000000
001000000000
001100000000
001100000000
001100000000
010000000000
010000000000
010000000000
011100110100
110110101010
111111011101
111011011101
111111011101
111111011101
100101100110
010100010010
010100000000
010100000000
010000000000
000000000000
000000000000
000000000000
000000000000
000000000000
000100000000
000100000000
000100000000
000100000000
001000000000
001000000000
001000000000
001100000000
001100000000
001100000000
010000000000
010000000000
010100000001
010100010001
100101010110
111011001100
111111011101
111111011101
111111101110
111010111011
100001010101
010100010001
010100000000
010100000000
010000000000
000000000000
000000000000
000000000000
000000000000
000000000000
000100000000
000100000000
000100000000
000100000000
001000000000
001000000000
001000000000
001100000000
001100000000
010000000000
010000000000
010000000000
010000000001
011000110011
110010001001
111111011101
111111011101
111011011101
111111101101
110010101010
011100110011
010100010001
010100000000
010100000000
010000000000
000100000000
000000000000
000000000000
000000000000
000000000000
000100000000
000100000000
000100000000
001000000000
001000000000
001000000000
001000000000
001100000000
001100000000
010000000000
010000000000
010000000001
010000000001
100101010110
111010111011
111111011101
111111011101
111111011101
111111101101
101110011000
011000100010
010100010001
010100000000
010000000000
010000000000
000000000000
000000000000
000000000000
000000000000
000100000000
000100000000
000100000000
001000000000
001000000000
001000000000
001000000000
001100000000
001100000000
001100000000
010000000000
010100000001
010100010001
010100010010
101110001000
111111011101
111111101110
111111011101
111111011101
111111011100
101001100111
010100010001
010000000000
010000000000
010000000000
010000000000
000000000000
000000000000
000000000000
000000000000
000000000000
000100000000
000100000000
001000000000
001000000000
001000000000
001000000000
001100000000
001100000000
001100000000
010000000000
010000000001
010000000000
011000110011
110110101010
111111011101
111111011101
111111011101
111111011101
111111001100
100001010101
010100010001
010000000000
010000000000
010000000000
010000000000
000000000000
000000000000
000000000000
000000000000
000100000000
000100000000
000100000000
001000000000
001000000000
001000000000
001100000000
001100000000
001100000000
010000000000
010000000000
010000000001
010000000001
100001010101
111011001100
111111011101
111111011101
111111011101
111111011101
111010111011
011100110100
010100000001
010000000000
010100000000
010000000000
010000000000
000000000000
000000000000
000000000000
000000000000
000100000000
000100000000
000100000000
001000000000
001000000000
001100000000
001100000000
001100000000
001100000000
010000000000
010000000000
010000000000
010100100010
101001110111
111111011101
111111011101
111111011101
111111011101
111111011101
110010011001
011100100011
010100000001
010100000000
010000000000
010000000000
010000000000
000000000000
000000000000
000000000000
000000000000
000100000000
000100000000
000100000000
001000000000
001000000000
001100000000
001100000000
001100000000
001100000000
010000000000
010000000000
010000000000
011000110011
110010011010
111111011101
111111011101
111111011101
111111011101
111111001101
101101110111
011000010001
010100000001
010100000000
010000000000
010000000000
010000000000
000100000000
000100000000
000100000000
000100000000
000100000000
000100000000
001000000000
001000000000
001000000000
001100000000
001100000000
001100000000
010000000000
010000000001
010000000001
010000000001
100001010110
111011001101
111111101110
111011011101
111111101110
111111011101
111110111100
100101010101
010100000001
010100000000
010100000000
010000000000
010000000000
010000000000
000100000000
000100000000
000100000000
000100000000
000100000000
000100000000
001000000000
001000000000
001100000000
001100000000
001100000000
001100000000
010000000000
010100000001
010100010001
011000100011
101110001001
111111011101
111111011110
111011011101
111111101110
111111011101
111010101011
100000110100
010100000001
010100000000
010000000000
010000000000
001100000000
001100000000
000100000000
000100000000
000100000000
000100000000
000100000000
001000000000
001000000000
001000000000
001000000000
001100000000
001100000000
010000000000
010000000000
010100010001
010100010010
100001000101
110110101011
111111011101
111111101110
111011011101
111111011101
111111001101
110110011001
011000100010
010100000000
010100000000
010000000000
010000000000
001100000000
001100000000
000100000000
000100000000
000100000000
000100000000
000100000000
001000000000
001000000000
001000000000
001100000000
001100000000
010000000000
010000000000
010000000000
010100010001
011000100011
101001100111
111011001100
111111011101
111111011110
111111011110
111111011101
111111001100
101101111000
011000010001
010100000000
010100000000
010100000000
010000000000
001100000000
001100000000
000100000000
000100000000
000100000000
000100000000
001000000000
001000000000
001000000000
001000000000
001100000000
001100000000
010000000000
010000000000
010000000000
011000100010
100101010101
110010011010
111111011101
111011011101
111011011101
111111101110
111111011101
111110111100
101001010110
010100000001
010100000000
010100000000
010100000000
010000000000
001100000000
001100000000
000100000000
000100000000
000100000000
001000000000
001000000000
001000000000
001000000000
001100000000
001100000000
001100000000
010000000000
010000000000
010100010001
100001000100
110010001000
111010111011
111111011101
111111011101
111111011101
111111101110
111111011101
111010101011
100001000100
010100000001
010100000000
010100000000
010100000000
010000000000
010000000000
001100000000
000100000000
000100000000
000100000000
001000000000
001000000000
001000000000
001100000000
001100000000
001100000000
010000000000
010100000000
010000000000
011000100010
101001100110
110110101010
111111001100
111111011101
111111011110
111111011101
111111011110
111111001101
110010011001
011100100011
010100000001
010100000000
010100000000
010000000000
010000000000
010000000000
001100000000
000100000000
000100000000
000100000000
001000000000
001000000000
001000000000
001100000000
001100000000
010000000000
010000000000
010100000001
010000000000
011100110011
110010001000
111010111011
111111011101
111111011101
111111011110
111111011110
111111011101
111111001100
101101110111
011000010010
011000000001
011000000001
010100000000
010100000000
010000000000
010000000000
001100000000
000100000000
000100000000
000100000000
001000000000
001000000000
001100000000
001100000000
010000000000
010000000000
010000000000
010100010001
010000000000
011101000100
110110101010
111111001100
111111101101
111111011101
111111011110
111111101110
111111011101
111010111100
101001100110
011000010001
011000010001
011000000001
010100000000
010100000000
010000000000
010000000000
010000000000
000100000000
000100000000
000100000000
001000000000
001000000000
001100000000
001100000000
010000000000
010000000000
010000000000
010100000001
010000010001
100001010101
110110101011
111011001100
111111011101
111011011101
111111011101
111111011110
111111011101
111010101011
100101010101
011000010001
011000000000
011000000001
011000000000
010100000000
010100000000
010000000000
010000000000
000100000000
000100000000
000100000000
001000000000
001000000000
001100000000
001100000000
001100000000
010000000000
010000000000
010000000001
010100100010
101101111000
111111001100
111111011101
111111011101
111111011101
111111011110
111111011101
111111001101
110110011001
100000110011
011000000001
011000000000
011000000000
011000000001
010100000001
010100000000
010000000000
010000000000
000100000000
000100000000
000100000000
001000000000
001000000000
001100000000
001100000000
010000000000
010000000000
010000000001
010000000000
011000110011
110110101010
111111011101
111111011101
111111011101
111111101110
111111011110
111111011101
111111011101
110010001000
011100100010
011000000001
011000000001
011000000000
011000000000
011000010001
010100000001
010100000000
010000000000
000100000000
000100000000
000100000000
001000000000
001000000000
001100000000
001100000000
010000000000
010000000000
010100000001
010000000001
100001010101
111011001100
111111011101
111111011101
111011011101
111111011110
111111011110
111111011101
111111001100
101101100111
011100010010
011000010001
011100000001
011000000000
011000000001
011100100011
100000110011
010100010001
010000000000
000100000000
000100000000
000100000000
001000000000
001000000000
001100000000
001100000000
010000000000
010000000000
010000000000
011000100010
101101111000
111111011101
111111011101
111111101101
111011101101
111011011101
111111011101
111111011101
111010111011
100101010101
011100010010
011000010001
011000000001
011100010001
100000100011
101101100110
101101100110
011000010010
010000000000
000100000000
000100000000
000100000000
001000000000
001000000000
001100000000
001100000000
010000000000
010000000000
010000000000
100001000100
110110101010
111111011101
111011011101
111011011101
111011101110
111111101110
111111011101
111111011101
110110101010
100101000100
011000010010
011000000001
011000010001
100101000101
110001110111
111110101010
110001111000
011000010010
010100000000
000100000000
000100000000
000100000000
001000000000
001000000000
001100000000
010000000000
010000000000
010100000001
010100010010
101001100111
111010111011
111111011101
111011011101
111011011101
111011101110
111011011110
111011001101
111111001101
110010001001
011100110011
011000010010
011100100011
100101000100
111010011001
111110111011
111110111100
101101100111
010100000001
010000000000
000100000000
000100000000
001000000000
001000000000
001000000000
001100000000
010000000000
010000000000
010100000001
011100110011
110010001001
111111001100
111111011101
111011101110
111011101101
111111101110
111011011110
111111011101
111111001101
101001110111
011000100011
011100110100
101001100110
110110011001
111111001100
111111001100
111110101011
100101010101
010100000000
010100000000
001000000000
000100000000
001000000000
001000000000
001100000000
001100000000
010000000000
010000000000
010100010001
100001010101
110110101011
111111011101
111111011110
111011101110
111011101110
111011101110
111011011110
111111011110
111010111100
100101100111
100001000101
101001110111
110110101010
111111001101
111111011101
111111001100
111010101010
011100110011
010100000000
010100000000
001000000000
001000000000
001000000000
001000000000
001100000000
001100000000
010000000000
010000000000
010100010001
101001110111
111111001100
111111011101
111011011101
111011101110
111011101110
111011011101
111011101110
111111101110
110110101011
100101110111
101110001001
111010111100
111011001100
111111011101
111111011101
111111001100
110110011001
011100100010
010000000000
010100000000
001000000000
001000000000
001000000000
001100000000
001100000000
001100000000
010000000000
010000000000
011000110011
110010001001
111111011101
111011011101
111011011101
111011101110
111011101110
111011101110
111011011110
111111101110
111011001100
110010101010
111010111100
111111011110
111111011101
111111011101
111111011101
111111011100
101101111000
011000010010
010000000000
010100000000
001000000000
001000000000
001000000000
001100000000
001100000000
010000000000
010000000000
010100010001
100101010110
110110111011
111111011110
111011011101
111011011110
111011101110
111011101110
111011101110
111011101110
111011011110
111011011110
111011011101
111011011101
111111011110
111111011110
111011011101
111111011101
111011001100
100101010110
010100010001
010000000000
010100000000
001000000000
001000000000
001100000000
001100000000
001100000000
010000000000
010000000000
011000100010
101001111000
111111001101
111111101110
111011011110
111011011110
111011011110
111011101110
111011101110
111011101110
111011011110
111011011110
111011011110
111011011110
111111011110
111111011110
111011011101
111111011101
111010111011
100001000100
010100000000
010100000000
010100000000
001000000000
001000000000
001100000000
001100000000
010000000000
010100010001
010000000001
011100110100
110010011001
111111011101
111111011110
111011011110
111011101110
111011011110
111011101110
111011101110
111011101110
111011101110
111011011110
111011011110
111011011110
111011011110
111111101110
111111101110
111111011101
110010011010
011100110011
010000000000
010000000000
010100000000
001000000000
001000000000
001100000000
010000000000
010000000000
010000000000
010100010001
100101100110
111011001100
111111011110
111011011110
111011011110
111111101110
111011011110
111011011110
111011101110
111011101110
111011101110
111011101110
111011101110
111011101110
111011101110
111011101110
111111011101
111111011101
101110001000
011000100010
010100000000
010100000000
010100000000
001000000000
001000000000
001100000000
010000000000
010000000000
010000000000
010100100010
101110001000
111111011101
111111011110
111011011110
111011011110
111011101110
111011101110
111011101110
111011101110
111011101110
111011101110
111011101110
111011101110
111011101110
111011101110
111011011110
111111011110
111011001100
101001100111
010100010001
010100000000
010100000000
010000000000
001000000000
001000000000
001100000000
010000000000
010000000000
010000000000
100001000100
111010111011
111111011101
111011011101
111111101110
110111011101
111011011110
111011101110
111011011110
111011011110
111011101110
110111101110
110111101110
110111101110
111011101110
111011011101
111011011101
111111011110
111010111011
100001010101
010000000000
010000000000
010000000000
010000000000
001000000000
001000000000
001100000000
010000000000
010000000000
010100000001
100101010110
111111001100
111111001101
111011011101
111011101110
110111011101
111011011110
111011101110
111011011110
111011011110
111011101110
110111101110
110111101110
110111101110
111011101110
111011011101
111011011101
111111011110
110110101010
100001000100
010100010001
010000000000
010000000000
010000000000
001000000000
001100000000
001100000000
010000000000
010100000000
011000010001
101101110111
111111001100
111111011101
111111011110
111111101110
111011011110
111011101110
111011101110
111011101110
111011101110
111011101110
111011101110
111011101110
111011101110
111011101110
111011011101
111111011101
111111011101
110010011001
011100110011
010100010001
010000000000
010000000000
010000000000
001000000000
001100000000
001100000000
010000000000
010000000000
011000100010
110110011001
111111001101
111111011110
111111101110
111111101110
111011011110
111011101110
111011101110
111011101110
111011101110
111011101110
111011101110
111011101110
111011101110
111011101101
111011011101
111111011101
111111011101
101110001000
011000100010
010100000001
010000000000
010000000000
010000000000
001100000000
001100000000
001100000000
010000000000
010100000001
100001000100
111010111011
111111011101
111111011110
111111101110
111011101110
111011011110
111011101110
111011101110
111011101110
111011101110
111011101110
111011101110
111011101110
111011101110
111011011101
111111011101
111111011101
111111011101
101001100110
010100010001
010000000000
010000000000
010000000000
010000000000
001100000000
001100000000
010000000000
010000000000
011000100010
101001100111
111111011101
111111011101
111111011110
111011101110
111011011110
111011011110
111011101110
111011101110
111011101110
111011101110
111011101110
111011101110
111011101110
111011101110
111011011101
111111011101
111111011101
111011001100
100001010101
010100010001
010000000000
010000000000
010000000000
010000000000
001100000000
001100000000
010000000000
010000010001
011101000100
110010011010
111111011101
111111011101
111011011110
111011101110
111011011110
111011011110
111011011110
111011101110
111011101110
111011101110
110111101110
111011101110
111011101110
111011101110
111111011101
111111011110
111111011101
110110111011
011000110011
010000010001
010000000000
010000000000
010000000000
010000000000
001100000000
001100000000
010000000000
010100010001
100101010110
111010111011
111111101110
111011011101
111011011110
111011101110
111011011110
111011011110
111011011110
111011011110
111011011110
111011101110
111011101110
111011101110
111011101110
111011101110
111111011110
111111011110
111111011101
110110101010
010100100010
010000000001
010000000000
010000000000
010000000000
010000000000
010000000000
010000000000
010000000000
011000100010
101110001000
111111011101
111111011101
111011101110
111011101110
111011101110
111011011110
111111011110
111111011110
111011011110
111011101110
111011101110
111011101110
111011101110
111011101110
111011011110
111111101110
111111011101
111111011101
101110001000
011000100010
010000000001
010000000000
010000000000
010000000000
010000000000
010000000000
010000000000
010000000001
011101000100
110010011001
111111011101
111111101110
111011011101
111011011110
111011101110
111011011110
111111011110
111111011110
111111011110
111011011110
111011011110
110111101110
110111101110
111011101110
111011101110
111111011110
111111011110
111111001101
100101010110
010100010010
010100000001
010000000000
010000000000
010000000000
010000000000
010000000000
010000000000
010100010001
101001100111
111011001100
111111011101
111111101110
111011011101
111111101110
111111011110
111111011110
111111011110
111111011110
111111011110
111111011110
111011011110
111011101110
110111101110
111011101110
111011011110
111011011101
111111011110
111010111100
011100110100
010100010001
010100000000
010000000000
010000000000
010000000000
010000000000
010100000001
010000000000
011000100011
110010011001
111111001101
111111011101
111111101110
111111011101
111111011101
111111011101
111111011101
111111011110
111010111100
110110111100
111011001101
111011011110
111011101110
111011101110
111011101110
111011011110
111111011110
111111011101
110110011010
011100100011
010100000001
010100000000
010000000000
010000000000
010000000000
001100000000
010100000001
010100000001
100101010110
111010111011
111111011101
111111011101
111111011101
111111011101
111111001101
111111011101
111111001100
111010111100
101110001001
101110001001
110110111011
111011011101
111011101110
111011011101
111011101110
111011101110
111111011110
111111001101
101110001000
011000010010
010100000001
010100000000
010000000000
010000000000
010000000000
001100000000
010100000001
010100010010
101101111000
111111001100
111111011101
111111011101
111111011101
111111011101
111111001101
111110111011
110110011001
101001100111
100001000101
101001100111
110110111011
111011001101
111111101110
111011011101
111011101101
111111101110
111111011101
111111001100
101101100111
011000010001
010100000001
010100000000
010000000000
010000000000
001100000000
001100000000
010100000001
011100110100
110010001001
111111001100
111111001101
111111011101
111111011101
111111001100
111010101011
110001111000
100101000101
011100100011
011100110011
101110001000
111111001100
111111011101
111111101110
111011011101
111011011101
111011101101
111111011101
111010111011
100101010110
011000010001
011000000000
010100000000
010000000000
010000000000
001100000000
001100000000
010100000001
100101010110
111010101011
111111001101
111111011101
111111001100
111010111011
101101110111
100101000101
011100100010
011000010001
010100010001
100001000100
110110101010
111111011101
111111011101
111011011101
111111101101
111011011101
111011011101
111111011101
110110101010
100001000100
011000000001
011000000000
010100000000
010100000000
010000000000
010000000000
001100000000
010100000001
110001110111
111110111100
111111001100
111110111011
110110011001
101001100110
100000110011
011100100010
011000010001
011000010001
011000010001
100101010101
111010101011
111111001101
111111011101
111111011101
111111011110
111011011101
111111011101
111111011101
101110001000
011100100010
011000010001
011000000000
011000000000
010100000000
010000000000
010000000000
001100000000
011000010010
110110001000
111110111011
111010101010
101101110111
100101000100
011100100010
011000010001
011000010000
011000000000
011000010001
011000010001
101001100110
111110111100
111111001101
111111011101
111111011110
111111011101
111111011101
111111101101
111011001100
101001110111
011000100001
011000000000
011000000000
011000000000
011000000000
010100000000
010000000000
010000000000
100101000100
110110001000
110001111000
100101000101
011100100010
011000010001
011000000000
011000000000
011000000000
011000000000
011000010001
011000010001
101101110111
111111001100
111111001101
111111011110
111111011110
111011011101
111111011101
111111101101
111010111011
100101100110
011000010001
010100000000
011000000000
010100000000
010100000000
010100000000
010000000000
010000000000
100100110100
101001010101
100000110011
011000010001
011000000000
010100000000
011000000000
011000000000
011000000000
011000000000
011000000001
011000100010
110010001000
111111001100
111111011101
111111011110
111111011101
111011011101
111111011101
111111011101
110110111010
100001000100
011000010001
010100000000
011000000000
011000000000
010100000000
010100000000
010100000000
010100000000
100000100011
100000100010
011000000001
010100000000
010100000000
010100000000
011000000000
011000000000
011000000000
011000000000
011000000000
011100100011
110110011001
111111001101
111111011101
111111011110
111011011101
111111011110
111111011101
111111011101
110110101010
011100110011
011000000001
011000000000
011000000000
011000000000
010100000000
010100000000
010100000000
010100000000
011000000001
011000000001
010100000000
011000000001
011000010001
011000000000
011000000000
011000000000
011000000000
011000000000
010100000000
100000110100
111010111011
111111011101
111111011101
111111011110
111011011101
111111101110
111111011101
111111011101
110010001001
011000100010
011000000000
011000000000
011000000000
011000000000
011000000000
010100000000
010100000000
010100000000
010100000000
010100000000
010100000000
010100000000
010100000000
010100000000
011000000000
011000000000
011000000000
011000000000
010100000001
100101010110
111111001100
111111011101
111111011101
111111011110
111011011101
111111101110
111111011101
111111001100
101101110111
011000010001
011000000000
011100000001
011000000000
011000000000
011000000000
010100000000
011000000000
011000000001
010100000000
010100000000
010000000000
010100000000
010100000000
010100000000
011000000000
011000000000
010100000000
011000000001
011000010010
101101111000
111111011101
111111011101
111111101110
111011011101
111011011101
111111011110
111111011101
111110111100
101001100110
011100010010
011100000001
011100000001
011100000001
011000000000
011000000000
011000010001
100000100010
100000100011
010000000000
010000000000
010000000000
010000000000
010100000000
010100000000
010100000000
010100000000
010100000000
010100000001
011100110100
110110101010
111111011101
111111101110
111111101110
111011011101
111111101110
111111011101
111111011101
111010101011
100101000101
011100010010
011100000001
011100000001
011100000001
011000000000
011000000001
100000100011
101101010110
101101010110
010000000000
010000000000
010000000000
010000000000
010100000000
010100000000
010100000000
010100000000
010100000000
010100010001
100001010101
111010111011
111111101110
111111101110
111011101110
111011011101
111111101110
111111011101
111111011101
110110011010
100000110100
011000000001
011100010010
011100000001
011100000001
100000100010
100101000100
110101111000
111010011001
100101000100
010000000000
010000000000
010000000000
010000000000
010000000000
010100000000
010100000000
010100000000
010000000000
010100100010
100101100110
111011001100
111111101110
111011011101
110111101101
111011101101
111011011101
111111101110
111111001101
110010001001
100000100011
011100000001
011100010010
011000000001
011100010010
100101000100
110110001000
111110101011
111010011010
011100100011
010000000000
010000000000
010000000000
010000000000
010000000000
010100000000
010100000000
010100000000
010100000000
011000100010
101110001000
111111011101
111011101101
111011101101
110111101110
111011101110
111011011101
111111011110
111010111100
101101100111
011100010010
011000000001
011000000001
011000000001
100101000101
110110001000
111110101011
111110111011
110001111000
011100100010
010000000000
010000000000
010000000000
010000000000
010000000000
010100000000
010100000000
010100000000
010100000000
011000100011
110010011001
111111101110
111011011101
111011101110
111011101110
111011101110
111011011101
111111011101
111010101011
100101000101
011000010010
011000000001
011000010010
100101000101
110110011001
111111001100
111110111100
111110111011
101001010110
011000010001
010000000000
010000000000
010000000000
010000000000
010100000000
010100000000
010100000000
010100000000
010100000001
011101000100
110110101011
111111011101
111011011101
111011101110
111011101110
111011011110
111111011110
111111011110
111010101011
011100110011
011000010010
011000010010
100001000100
110010001001
111111001100
111111001100
111111001101
111010101010
011100110100
010100000001
010000000000
010000000000
010000000000
010000000000
010100000000
010100000000
010100000000
010100000000
011000010010
101001100111
111010111100
111111011101
111111011110
111011011110
111111101110
111111011110
111111011101
111111001101
110010001001
011000010010
011100100011
100101010101
110010001001
111111001100
111111011101
111111001100
111111011101
110010001001
011000100010
010100010001
010000000000
010000000000
010000000000
010000000000
010100000000
010100000000
010100000000
010100000001
011100100011
110010001001
111111001101
111111011101
111111101110
111011011101
111011101110
111011011110
111111011101
111111001101
101001111000
011100110100
101001010110
110110011010
111010111100
111111011101
111111011101
111111011101
111010111011
101001100110
011000010010
010100000001
001100000000
010000000000
010000000000
010100000000
010100000000
010100000000
010100000000
010100000001
100000110100
110110011010
111111001101
111111011110
111111101110
111011101110
111111101110
111011011110
111111011110
111011001100
100101100111
100101100111
110110101010
111111001100
111111011101
111111011101
111111011101
111111011101
110110101010
100001000100
010100000001
010000000000
001100000000
001100000000
010000000000
010100000000
010100000000
010100000000
010100000000
011000000001
100101000101
111010101011
111111011110
111111011110
111111101110
111011101110
111011101110
111011101110
111111011101
111010111100
101110001001
110110101010
111111001101
111111011101
111111101110
111111011101
111111011101
111111001100
110010001000
011000100011
010100000000
010100000000
001100000000
010000000000
010000000000
010100000000
010100000000
010100000000
010100000000
011000010001
101001100111
111110111100
111111011110
111111011110
111011101110
111011101110
111011101110
111011101110
111011011101
111011001100
110110111100
111111011101
111111011101
111111011101
111111011110
111011011101
111111011101
111111001100
101001100111
011000010010
010100000001
010100000000
001100000000
001100000000
010000000000
010100000000
010100000000
010100000000
010100000000
011100100010
110010001000
111111001101
111111011110
111011011101
111011101110
111011101110
111011101110
111011101110
111111101110
111111011110
111111011110
111111011110
111111011101
111111011101
111111011101
111111011101
111111001100
111010111011
100001000100
010100000001
010100000000
010100000000
001100000000
001100000000
010000000000
010100000000
010100000000
010100000000
010100000001
100000110011
110110011001
111111011101
111111011101
111011011101
111011101110
111011101110
111011101110
111011101110
111011011110
111111101110
111111011110
111011011101
111111011101
111111011101
111011011101
111111101101
111011001100
101110001000
011000100011
010100000001
010100000000
010100000000
001100000000
001100000000
010000000000
010100000000
010100000000
010100000000
010100000001
100001000100
110110101010
111111011101
111111011101
111011011110
111011011110
111011101110
111011101110
111011101110
111011101110
111011011110
111011011110
111011011110
111111101110
111111011110
111111011101
111111101110
111011001100
100101100110
011000010010
010100000000
010100000000
010100000000
001100000000
010000000000
010000000000
010100000000
010100000000
010100000000
010100010001
100101010101
111010111011
111111011101
111011011101
111011011110
111011011110
111011101110
111011101110
111011101110
111011101110
111011011101
111011011110
111011011110
111111011110
111011011101
111111011101
111111011101
111010111011
100001000100
010100010001
010100000000
010100000000
010000000000
010000000000
010000000000
010000000000
010100000000
010100000000
010100000000
011000010010
101001100110
111111001100
111111011110
111011011101
111011101110
111011011110
111011011110
111011101110
111011101110
111011101110
111011011110
111011011110
111011011110
111111101110
111111101110
111111011110
111111011101
110110101010
100001000100
010100000000
010100000000
010000000000
010000000000
010000000000
010000000000
010000000000
010100000000
010100000001
010100000001
011100100011
101110001000
111111011101
111111011110
111011011110
111011011110
111011011110
111011101110
111011101110
111011101110
111011011110
111011101110
111011101110
111011101110
111011101110
111011011101
111111011101
111111011101
101101111000
011000100010
010000000000
010000000000
010000000000
010000000000
010000000000
010000000000
010000000000
010100000000
010100000001
010100000001
011100110100
110110101010
111111011101
111111011110
111011011110
111011101110
111011101110
111011101110
111011011110
111011101110
111011011110
111011101110
111011101110
111011101110
111011011110
111111011101
111111011101
111111011101
101001100110
010100010001
010100000000
010000000000
010000000000
010000000000
010000000000
010000000000
010000000000
010100000000
010100000001
010100000001
100001010101
111010111100
111111011110
111011011110
111011101110
111011101110
111011101110
111011011110
111011011110
111011101110
111011101110
111011101110
111011101110
111011101110
111011011101
111111101101
111111011101
111110111100
100000110100
010100000000
010100000001
010000000000
010000000000
010000000000
010000000000
010000000000
010000000000
010100000001
010100000001
010100000001
101001100111
111111001101
111111011101
111011011110
111011101110
111011101110
111011101110
111011011110
111011101110
111011101110
111011101110
111011101110
111011101110
111011101110
111011101110
111111011101
111111011101
110110011001
011000100010
010100000000
010100000001
010000000000
010000000000
010000000000
010000000000
010000000000
010000000000
010100000001
010100000001
010100010010
110010001001
111111011101
111011011101
111011011110
111011101110
111011011110
111011101110
111011011110
111011101110
111011101110
111011101110
111011101110
111011101110
111011101110
111111101110
111111011101
111111001100
101001100111
011000010001
010100000001
010100000000
010100000000
010000000000
010000000000
001100000000
010000000000
010000000000
010100000000
010100000001
011000100011
110110101011
111111011110
111011011110
111011101110
111011101110
111011101110
111011101110
111011011110
111011101110
111011011110
111011101110
111011011110
111011011110
111011101110
111111101110
111111011101
111010101011
100001000100
010100000001
010100000001
010100000000
010000000000
010000000000
001100000000
001100000000
010000000000
010000000000
010100000000
010100000001
100001000101
111111001100
111111101110
111011011110
111011101110
111011101110
111011101110
111011011110
111011011110
111011011110
111011011110
111011101110
111011011110
111011101110
111011011110
111111101110
111111001100
110010001000
011100100011
010100000000
010100000001
010000000000
010000000000
001100000000
001100000000
001100000000
010000000000
010000000000
010100000001
010100010010
100101010110
111111001101
111111011110
111011101110
111011101110
111011011110
111011011110
111011011110
111011011110
111011011110
111011011110
111011101110
111011101110
111011101110
111011011110
111111011101
111111001100
101001100111
011000100010
010100000000
010100000000
010000000000
001100000000
001100000000
001100000000
010000000000
010000000000
010000000001
010000000001
011000100011
101110001001
111111011110
111111011110
111111011110
111011101110
111011011110
111011011110
111111101110
111011011110
111011011110
111011101110
111011101110
111011101110
111111101110
111011011101
111111011101
111010111011
100001000101
010100010001
010100000000
010100000000
010000000000
010000000000
001100000000
001100000000
010000000000
010000000000
010000000001
010000000001
011000110100
110010011010
111111011110
111111011101
111111011110
111011011110
111011011110
111011011110
111111101110
111011011110
111011011110
111011101110
111011011101
111011011101
111011101110
111111011101
111111011101
110010011001
011100110011
010000000000
010100000000
010100000000
010000000000
010000000000
001100000000
001100000000
010000000000
001100000000
010000000000
010000000001
011101000101
111010111100
111111011110
111111011110
111111011110
111011011110
111011011110
110111001101
111011011101
111111101110
111111101110
111011101110
111011011110
111011011101
111011011101
111111011101
111010111011
101001110111
011000100010
010100000001
010100000000
010000000000
010000000000
010000000000
001100000000
001100000000
010000000000
010000000000
001100000000
010000010001
100101100111
111111001100
111111011110
111111011110
111111011110
111111011110
110110111100
101110011010
110111001100
111111101110
111111101111
111011011110
111011101110
111111101110
111011011101
111111011110
110110101011
100001000100
010100010001
010100000001
010000000000
010000000000
010000000000
001100000000
001100000000
001100000000
010000000000
010000000000
001100000000
010100100010
101110001001
111111001101
111111011110
111111001101
111111001101
110110111100
101010001000
100101110111
110010111011
111011011101
111111101110
111011011101
111011101110
111111101110
111011011101
111111011101
110010011001
011000100011
010100000001
010100000000
010000000000
010000000000
010000000000
001100000000
001100000000
001100000000
010000000000
010000000000
010000000000
011000100011
110010011001
111111001101
111111011110
111111011101
111010111100
101110001001
011101000101
100001100110
111011001100
111011011101
111011011101
111011011101
111011101110
111111101110
111111011101
111111001100
101101110111
011000010010
010100000001
010100000000
010000000000
010000000000
001100000000
001100000000
001100000000
001000000000
010000000000
010000000000
010100010001
100001000101
110110101010
111111001100
111111001101
111110111100
101110001000
100001000101
011000110100
101001111000
111111011101
111111011110
111011011101
111011101110
111011011101
111111011101
111111011101
111010101011
100101010101
011000010001
010100000000
010000000000
010000000000
010000000000
001100000000
001100000000
001000000000
001000000000
010000000001
010000000000
010100010001
101001100110
111010111011
111111001100
111110101011
101101111000
100000110100
010100010010
011100110100
101110011001
111111011110
111111011101
111111101110
111111101110
111011101110
111011011101
111111011101
110010011001
011100110011
010100000001
010100000000
010100000000
010000000000
001100000000
001100000000
001100000000
001000000000
001000000000
010000000000
001100000000
010100010001
101101110111
111111001100
111110111100
110001111000
100101000101
011000010010
010100010001
100001000100
110110011010
111111011101
111111011101
111011101101
111011101101
111111011101
111111011101
111111011101
101101111000
011000100010
010100000000
010100000000
010000000000
010000000000
001100000000
001100000000
001000000000
001000000000
001000000000
010000000000
001100000000
010100010010
110010001000
111111001100
111110101010
101001010110
011100100010
011000010001
011000010010
100101010101
110110101010
111111011101
111111011101
111011011101
111111101101
111111011101
111111011101
111111001100
101001100111
011000010010
010100000000
010100000000
010000000000
001100000000
001100000000
001100000000
001000000000
001000000000
001000000000
010000000000
010000000000
011100110011
110110011001
111010101010
110001110111
100000100011
011000000001
011000000001
011100010010
101001100110
111010111011
111111011101
111011011101
111011011101
111011101101
111111011101
111111011101
111010101010
100101000101
011000000001
010100000000
010100000000
010000000000
001100000000
001100000000
001100000000
001000000000
001000000000
001000000000
010000000000
010000000000
100000110011
110010001000
110001110111
100000110011
011000000001
011100010001
011000000001
011100100010
101101110111
111111001100
111111011110
111011011101
111011011101
111011011101
111111011101
111111011101
110010001000
011100100011
010100000000
010100000000
010000000000
010000000000
001100000000
001100000000
001000000000
001000000000
001000000000
001000000000
010100000000
010100000001
011100100010
100001000100
011100100010
011000000000
011000000000
011000000001
011000000001
011100100011
110010001000
111111011101
111111011101
111111011101
111111101101
111011011101
111111011101
111111001100
100101100110
011000010010
010100000000
010100000000
010000000000
010000000000
001100000000
001000000000
001000000000
001000000000
001000000000
001000000000
010100000000
010000000000
010100000000
011000010001
010100000000
010100000000
011000000000
011000000000
011000000001
100000110100
110110011001
111111011101
111111011101
111111011101
111111101101
111111011101
111111011101
111010111011
100000110100
010100000001
010100000000
010100000000
010000000000
001100000000
001100000000
001000000000
001000000000
001000000000
001000000000
001000000000
010100000000
010100000000
010100000000
010100000000
010100000000
010100000000
011000000000
010100000000
011000000001
100101010101
111010111011
111111011101
111111011101
111111011101
111111011101
111111011101
111111011101
110010011001
011000100010
010100000000
010100000000
010100000000
010000000000
001100000000
001100000000
001000000000
001000000000
001000000000
001000000000
001000000000
010000000000
010100000000
010100000000
010000000000
010100000000
010100000000
011000000000
010100000000
011000010001
101001100110
111111001100
111111011101
111111011101
111111011101
111011011101
111111011101
111111001100
101101110111
010100010010
010100000000
010100000000
010100000000
010000000000
001100000000
001100000000
001000000000
001000000000
001000000000
001000000000
001000000000
010000000000
010000000000
010000000000
010000000000
010100000000
010100000000
010100000000
010100000000
011100100011
110010001000
111111001100
111111011101
111111011110
111011011101
111111011101
111111011101
111010111011
100101010110
010100000001
010100000000
010100000000
010000000000
010000000000
001100000000
001100000000
001000000000
001000000000
001000000000
001000000000
001000000000
010000000000
010000000000
010000000000
010000000000
010100000000
010100000000
010100000000
010100010000
100001000100
110110011010
111111011101
111111011101
111111011110
111111011110
111111011101
111111011101
110110011010
011100110100
010000000001
010100000000
010000000000
010000000000
010000000000
001100000000
001100000000
001000000000
001000000000
001000000000
001000000000
001000000000
001100000000
010000000000
010000000000
010000000000
010100000000
010100000000
010100000000
010100010001
100101010101
111010111011
111111011101
111111011110
111111011110
111111011110
111111011110
111111001101
101101111000
010100010010
010100000001
010100000000
010000000000
010000000000
001100000000
001100000000
001000000000
001000000000
001000000000
001000000000
001000000000
001000000000
001100000000
001100000000
010000000000
010000000000
010100000000
010100000000
010100000000
011000100001
101001100110
111110111011
111111011101
111111011110
111111011110
111111011101
111111011101
111010111011
100101010110
010100000001
010100000001
010100000000
010000000000
010000000000
001100000000
001100000000
001000000000
001000000000
001000000000
001000000000
001000000000
000100000000
001100000000
001100000000
010000000000
010000000000
010100000000
010100000000
010100000000
011100110010
110010001000
111111001100
111111011101
111111011101
111111011110
111111011101
111011001100
110010011001
011100110011
010000000000
010100000000
010000000000
010000000000
010000000000
001100000000
001100000000
001000000000
001000000000
001000000000
001000000000
000100000000
000100000000
001100000000
001100000000
010000000000
010100000000
010100000000
010000000000
010100000000
011101000011
110110101001
111111011101
111111011101
111111011101
111111011110
111111001101
111010101011
101001100111
011000010010
010100000001
010100000000
010000000000
010000000000
010000000000
001100000000
001100000000
001000000000
001000000000
001000000000
000100000000
000100000000
000100000000
001100000000
001100000000
010000000000
010000000000
010100000000
010100000000
010100010001
100101010101
111010111011
111111011101
111111011101
111111011101
111111011110
111010111011
110010001000
100001000100
010100000001
010100000001
010100000000
010000000000
010000000000
001100000000
001100000000
001000000000
001000000000
001000000000
001000000000
000100000000
000100000000
000100000000
001100000000
001100000000
010000000000
010000000000
010100000000
010100000000
010100010001
101001110111
111111001100
111111011101
111111011101
111111011110
111111011101
110010011001
100101010110
011100100011
010100000001
010100000001
010100000000
010000000000
010000000000
001100000000
001100000000
001000000000
001000000000
001000000000
000100000000
000100000000
000100000000
000100000000
001100000000
001100000000
010000000000
010100000000
010100000000
010100000001
011000110010
110010011000
111111011101
111111011101
111111011101
111111011110
111111001101
101101111000
011100110011
011000010001
011000000001
010100000001
010000000000
010000000000
010000000000
001100000000
001100000000
001000000000
001000000000
001000000000
000100000000
000100000000
000100000000
000100000000
001100000000
001100000000
010000000000
010000000000
010100000001
010100000001
011100110011
110110101010
111111001100
111111011100
111111011101
111111011110
111011001100
100101100110
011000010010
010100000001
010100000001
010100000000
010000000000
010000000000
001100000000
001100000000
001000000000
001000000000
001000000000
001000000000
000100000000
000100000000
000100000000
000100000000
001100000000
001100000000
010000000000
010100000000
010100000001
010100010001
100001000100
111010111011
111111001100
111111011101
111111011101
111111011101
111010111011
100001010101
010100010001
010100000000
010100000000
010100000000
010000000000
001100000000
001100000000
001000000000
001000000000
001000000000
001000000000
001000000000
000100000000
000100000000
000100000000
000100000000
001100000000
010000000000
010000000000
010100000001
010100000001
010100000001
100101010101
111011001100
111111011101
111111011101
111111011101
111111011101
110110101010
100000110100
011000010001
011000000000
010100000000
010000000000
010000000000
001100000000
001100000000
001000000000
001000000000
001000000000
001000000000
001000000000
000100000000
000100000000
000100000000
000100000000
001100000000
010000000000
010000000000
010100000001
010100000000
010100010001
101110000111
111111011100
111111011101
111111011101
111111011101
111111011101
101101111000
011000100010
011000010001
010100000000
010100000000
010000000000
010000000000
001100000000
001100000000
001000000000
001000000000
001000000000
001000000000
001000000000
000100000000
000100000000
000100000000
000100000000
001100000000
001100000000
010000000000
010000000000
010000000000
011000100010
110010011001
111111011100
111111011101
111111011101
111111011101
111111011101
100101010110
010100010001
010100000000
010100000000
010100000000
010000000000
010000000000
001100000000
001000000000
001000000000
001000000000
001000000000
001000000000
001000000000
000100000000
000100000000
000100000000
000000000000
001100000000
001100000000
010000000000
010000000000
010100000001
011100110011
111010111011
111111011100
111111011101
111111011101
111111011101
111010111011
011101000100
010100010001
010100000000
010100000000
010000000000
010000000000
010000000000
001100000000
001000000000
001000000000
001000000000
001000000000
001000000000
001000000000
000100000000
000100000000
000100000000
000000000000
001100000000
010000000000
010000000000
010000000000
010100010010
100001000100
111111001100
111111011101
111111011101
111111011101
111111011101
110010001001
011000100010
010100010001
010100000000
010100000000
010000000000
010000000000
001100000000
001100000000
001000000000
001000000000
001000000000
001000000000
001000000000
000100000000
000100000000
000100000000
000000000000
000000000000
010000000000
010000000000
010100000001
010000000001
010100010010
100101100111
111111001101
111111011101
111111011101
111111011101
111010111011
100101010101
010000010001
010000000000
010100000000
010000000000
010000000000
010000000000
001100000000
001100000000
001000000000
001000000000
001000000000
001000000000
000100000000
000100000000
000100000000
000100000000
000000000000
000000000000
010000000000
010000000000
010000000000
010000000001
010100100010
101110001001
111111011101
111111011101
111111001101
111111001101
110110011010
011101000100
010100010001
010000000000
010100000000
010000000000
010000000000
001100000000
001100000000
001100000000
001000000000
001000000000
001000000000
000100000000
000100000000
000100000000
000100000000
000100000000
000000000000
000000000000
010000000000
010000000000
010000000000
010000000001
011000110011
110110111011
111111011101
111111011101
111111001101
111111001100
101101111000
011000100010
010100000001
010000000000
010000000000
010000000000
001100000000
001100000000
001100000000
001100000000
001000000000
001000000000
000100000000
000100000000
000100000000
000100000000
000100000000
000000000000
000000000000
000000000000
010100000000
010000000000
010100000001
010000000001
100001000101
111111001100
111111011101
111111011101
111111011101
111111001100
100101100110
010100010001
010100000000
010000000000
010000000000
010000000000
001100000000
001100000000
001100000000
001100000000
001000000000
001000000000
000100000000
000100000000
000100000000
000100000000
000100000000
000000000000
000000000000
000000000000
010100000000
010000000000
010100000001
010100010001
100101100111
111111001101
111111011101
111111011101
111111011101
111010101011
100001000100
010100000000
010100000000
010000000000
010000000000
001100000000
001100000000
001100000000
001100000000
001000000000
001000000000
001000000000
000100000000
000100000000
000100000000
000100000000
000100000000
000000000000
000000000000
000000000000
010100000001
010000000000
010100000001
011000100010
110010001001
111111001101
111111011101
111111011101
111111001101
101110001000
011100100011
010100000000
010100000000
010000000000
010000000000
001100000000
001100000000
001100000000
001100000000
001000000000
001000000000
001000000000
000100000000
000100000000
000100000000
000100000000
000100000000
000000000000
000000000000
000000000000
010100000000
010100000001
010100000001
011101000100
110110101010
111111011101
111111011101
111111011101
111010111011
100101100110
011000010010
010100000000
010100000000
010000000000
010000000000
001100000000
001100000000
001100000000
001000000000
001000000000
001000000000
000100000000
000100000000
000100000000
000100000000
000100000000
000100000000
000000000000
000000000000
000000000000
010000000000
010100000001
010100000001
100101010101
111010111011
111111011101
111111011101
111111001100
110110101010
100001000100
010100010001
010100000000
010100000000
010000000000
010000000000
001100000000
001100000000
001100000000
001000000000
001000000000
001000000000
000100000000
000100000000
000100000000
000100000000
000100000000
000000000000
000000000000
000000000000
000000000000
010000000000
010100010001
010100000001
101101110111
111111001100
111111011101
111111001101
111111011101
101110001000
011000100011
010100000001
010100000000
010100000000
010000000000
010000000000
001100000000
001100000000
001000000000
001000000000
001000000000
001000000000
000100000000
000100000000
000100000000
000100000000
000100000000
000000000000
000000000000
000000000000
000000000000
010100000000
010100000001
011000100010
110010001001
111111001101
111111011101
111111011101
111011001100
101001100110
011000010010
010100000000
010100000000
010000000000
001100000000
010000000000
001100000000
001100000000
001000000000
001000000000
001000000000
001000000000
000100000000
000100000000
000100000000
000100000000
000100000000
000000000000
000000000000
000000000000
000000000000
011000000001
010100000001
100000110100
111010101010
111111001101
111111011101
111111011101
110110101010
100001000100
010100000001
010100000000
010100000000
010000000000
001100000000
001100000000
001100000000
001100000000
001000000000
001000000000
001000000000
001000000000
000100000000
000100000000
000100000000
000100000000
000100000000
000000000000
000000000000
000000000000
000000000000
010100000001
011000010001
101001010101
111110111011
111111001101
111111011101
111111011101
110010011001
011100100011
010100000001
010100000000
010100000000
010000000000
001100000000
001100000000
001100000000
001100000000
001000000000
001000000000
001000000000
000100000000
000100000000
000100000000
000100000000
000100000000
000000000000
000000000000
000000000000
000000000000
000000000000
010100000000
011000010010
101001100110
111110111100
111111011101
111111011101
111111011101
101101110111
011000010010
011000000001
011000000001
010100000000
010000000000
001100000000
001100000000
001100000000
001000000000
001000000000
001000000000
000100000000
000100000000
000100000000
000100000000
000100000000
000100000000
000000000000
000000000000
000000000000
000000000000
000000000000
011000000001
011100010010
101101110111
111111001100
111111011101
111111011101
111111001100
100101010110
011000010001
011000000001
010100000001
010100000000
001100000000
001100000000
001100000000
001100000000
001000000000
001000000000
001000000000
000100000000
000100000000
000100000000
000100000000
000100000000
000100000000
000000000000
000000000000
000000000000
000000000000
000000000000
011000000001
011100100011
110010001000
111111001100
111111011101
111111101101
110110101010
100001000100
011000000001
011000000001
010100000001
010000000000
001100000000
001100000000
001100000000
001000000000
001000000000
001000000000
001000000000
000100000000
000100000000
000100000000
000100000000
000100000000
000100000000
000000000000
000000000000
000000000000
000000000000
000000000000
011000010001
100000110100
110110101010
111111001100
111111011101
111111011101
101101110111
011000100010
010100000001
011000000001
010100000001
010000000000
001100000000
001100000000
001000000000
001000000000
001000000000
001000000000
001000000000
000100000000
000100000000
000100000000
000100000000
000100000000
000000000000
000000000000
000000000000
000000000000
000000000000
000000000000
011000000001
100101010101
111010111011
111111011101
111111011101
111111011100
100101010101
010100010001
010100000000
010100000001
010000000001
010000000000
001100000000
001100000000
001000000000
001000000000
001000000000
001000000000
001000000000
000100000000
000100000000
000100000000
000100000000
000100000000
000000000000
000000000000
000000000000
000000000000
000000000000
000000000000
011000010010
101101100111
111111001100
111111001101
111111011101
111010111011
100000110100
010000000000
010000000000
010000000000
010000000000
001100000000
001100000000
001100000000
001000000000
001000000000
001000000000
001000000000
001000000000
000100000000
000100000000
000100000000
000100000000
000100000000
000000000000
000000000000
000000000000
000000000000
000000000000
000000000000
010100010010
110010001001
111111011101
111111011101
111111011101
110010011001
011000100010
010000000000
010000000000
010000000000
010000000000
001100000000
001100000000
001100000000
001100000000
001000000000
001000000000
001000000000
001000000000
000100000000
000100000000
000100000000
000100000000
000100000000
000000000000
000000000000
000000000000
000000000000
000000000000
000000000000
010100010010
110110011010
111111011101
111111011101
111111001100
101001100110
010100010001
010100000001
010000000000
010000000000
001100000000
001100000000
001100000000
001100000000
001100000000
001000000000
001000000000
001000000000
001000000000
000100000000
000100000000
000100000000
000100000000
000100000000
000000000000
000000000000
000000000000
000000000000
000000000000
000000000000
011100110100
111010111100
111111011101
111111011101
110110101010
011101000100
010100010001
010000000000
010000000000
001100000000
001100000000
001100000000
001100000000
001100000000
001000000000
001000000000
001000000000
001000000000
000100000000
000100000000
000100000000
000100000000
000100000000
000000000000
000000000000
000000000000
000000000000
000000000000
000000000000
000000000000
101001111000
111111001101
111111011110
111111011101
110010001000
011000100010
010100000000
010000000000
001100000000
001100000000
001100000000
001100000000
001100000000
001100000000
001000000000
001000000000
001000000000
000100000000
000100000000
000100000000
000100000000
000100000000
000100000000
000000000000
000000000000
000000000000
000000000000
000000000000
000000000000
000000000000
110010101011
111111001101
111111011101
111110111100
101001100110
010100010001
010000000000
010000000000
001100000000
001100000000
001100000000
001100000000
001100000000
001100000000
001000000000
001000000000
000100000000
000100000000
000100000000
000100000000
000100000000
000100000000
000000000000
000000000000
000000000000
000000000000
000000000000
000000000000
000000000000
000000000000
111011001101
111111011110
111111011110
111010101011
100001000101
010100000001
010000000000
010000000000
001100000000
001100000000
001100000000
001100000000
001100000000
001000000000
001000000000
000100000000
000100000000
000100000000
000100000000
000100000000
000100000000
000100000000
000000000000
000000000000
000000000000
000000000000
000000000000
000000000000
000000000000
000000000000
111011011110
111111101111
111111011101
101101111000
011100100011
010100000001
010100000000
010000000000
010000000000
001100000000
001100000000
001000000000
001000000000
001000000000
000100000000
000100000000
000100000000
000100000000
000100000000
000100000000
000100000000
000000000000
000000000000
000000000000
000000000000
000000000000
000000000000
000000000000
000000000000
000000000000
111011011110
111111011110
111111001101
100101100110
011000010010
010100000000
010000000000
010000000000
001100000000
001100000000
001100000000
001000000000
001000000000
001000000000
000100000000
000100000000
000100000000
000100000000
000100000000
000100000000
000100000000
000000000000
000000000000
000000000000
000000000000
000000000000
000000000000
000000000000
000000000000
000000000000
111111011110
111111011101
111010101011
100001000101
010100000001
010100000000
010100000000
010000000000
001100000000
001100000000
001100000000
001000000000
001000000000
000100000000
000100000000
000100000000
000100000000
000100000000
000100000000
000100000000
000000000000
000000000000
000000000000
000000000000
000000000000
000000000000
000000000000
000000000000
000000000000
000000000000
111111011110
111011001100
110010001001
011100100011
010100000001
010100000000
010000000000
010000000000
001100000000
001100000000
001000000000
001000000000
001000000000
000100000000
000100000000
000100000000
000100000000
000100000000
000100000000
000000000000
000000000000
000000000000
000000000000
000000000000
000000000000
000000000000
000000000000
000000000000
000000000000
000000000000
111111011110
111010111100
101001100110
011000010010
010100000001
010100000000
010000000000
010000000000
001100000000
001100000000
001000000000
001000000000
000100000000
000100000000
000100000000
000100000000
000100000000
000100000000
000100000000
000000000000
000000000000
000000000000
000000000000
000000000000
000000000000
000000000000
000000000000
000000000000
000000000000
000000000000
111111011101
111010101011
100001000101
010100010001
010100000000
010100000000
010000000000
010000000000
001100000000
001100000000
001000000000
000100000000
000100000000
000100000000
000100000000
000100000000
000100000000
000100000000
000000000000
000000000000
000000000000
000000000000
000000000000
000000000000
000000000000
000000000000
000000000000
000000000000
000000000000
000000000000
111111001101
110010011001
011100110011
010100000001
010000000000
010100000000
010000000000
001100000000
001100000000
001000000000
001000000000
000100000000
000100000000
000100000000
000100000000
000100000000
000100000000
000100000000
000000000000
000000000000
000000000000
000000000000
000000000000
000000000000
000000000000
000000000000
000000000000
000000000000
000000000000
000000000000
111111001100
101101111000
011000100010
010100000001
010000000000
010000000000
010000000000
001100000000
001100000000
001000000000
001000000000
001000000000
000100000000
000100000000
000100000000
000100000000
000100000000
000100000000
000100000000
000000000000
000000000000
000000000000
000000000000
000000000000
000000000000
000000000000
000000000000
000000000000
000000000000
000000000000
111110111011
101001100110
011000010010
010100010001
010100000000
010000000000
010000000000
001100000000
001100000000
001000000000
001000000000
001000000000
001000000000
000100000000
000100000000
000100000000
000100000000
000100000000
000100000000
000000000000
000000000000
000000000000
000000000000
000000000000
000000000000
000000000000
000000000000
000000000000
000000000000
000000000000
111110111011
100101000101
011000010001
010100000000
010000000000
010000000000
001100000000
001100000000
001000000000
001000000000
001000000000
001000000000
001000000000
000100000000
000100000000
000100000000
000100000000
000100000000
000100000000
000100000000
000000000000
000000000000
000000000000
000000000000
000000000000
000000000000
000000000000
000000000000
000000000000
000000000000
110110001001
011100100011
010100000001
010100000000
010100000000
010000000000
001100000000
001100000000
001000000000
001000000000
001000000000
001000000000
001000000000
001000000000
000100000000
000100000000
000100000000
000100000000
000100000000
000000000000
000000000000
000000000000
000000000000
000000000000
000000000000
000000000000
000000000000
000000000000
000000000000
000000000000
101001010101
011000010001
010100000000
010100000000
010100000000
010000000000
001100000000
001000000000
001000000000
001000000000
001000000000
001000000000
001000000000
001000000000
000100000000
000100000000
000100000000
000100000000
000100000000
000000000000
000000000000
000000000000
000000000000
000000000000
000000000000
000000000000
000000000000
000000000000
000000000000
000000000000
011100100010
011000000000
010100000000
010100000000
010000000000
010000000000
001100000000
001000000000
001000000000
001000000000
001000000000
000100000000
001000000000
001000000000
000100000000
000100000000
000100000000
000100000000
000100000000
000000000000
000000000000
000000000000
000000000000
000000000000
000000000000
000000000000
000000000000
000000000000
000000000000
000000000000
011000010001
011000000000
010100000000
010000000000
010000000000
010000000000
001100000000
001000000000
001000000000
001000000000
001000000000
000100000000
000100000000
000100000000
000100000000
000100000000
000100000000
000100000000
000100000000
000000000000
000000000000
000000000000
000000000000
000000000000
000000000000
000000000000
000000000000
000000000000
000000000000
000000000000
011000000000
011000000000
010100000000
010100000000
010000000000
001100000000
001100000000
001000000000
001000000000
001000000000
001000000000
000100000000
000100000000
000100000000
000100000000
000100000000
000100000000
000100000000
000100000000
000000000000
000000000000
000000000000
000000000000
000000000000
000000000000
000000000000
000000000000
000000000000
000000000000
000000000000
011000010001
011000000000
010100000000
010100000000
010000000000
001100000000
001100000000
001000000000
001000000000
001000000000
001000000000
001000000000
001000000000
000100000000
000100000000
000100000000
000100000000
000100000000
000100000000
000000000000
000000000000
000000000000
000000000000
000000000000
000000000000
000000000000
000000000000
000000000000
000000000000
000000000000
