memory_initialization_radix=16;
memory_initialization_vector=
000,
000,
000,
000,
000,
000,
000,
010,
131,
353,
000,
000,
000,
000,
000,
000,
000,
000,
000,
000,
000,
000,
000,
000,
000,
000,
000,
000,
000,
000,
000,
000,
000,
000,
000,
000,
000,
000,
000,
000,
000,
000,
000,
000,
000,
221,
685,
9B8,
685,
9B8,
676,
010,
000,
000,
000,
000,
000,
000,
000,
000,
000,
000,
000,
000,
000,
000,
000,
000,
000,
000,
000,
000,
000,
000,
000,
000,
000,
000,
000,
000,
000,
000,
000,
000,
000,
796,
8B7,
7A5,
8B6,
472,
8B7,
9B8,
8A7,
685,
574,
463,
352,
020,
000,
000,
000,
000,
000,
000,
000,
000,
000,
000,
000,
000,
000,
000,
000,
000,
000,
000,
000,
000,
000,
000,
000,
000,
000,
000,
000,
7A6,
7B6,
7B5,
7A4,
7B5,
593,
583,
7A5,
8B6,
8A6,
8A6,
8B7,
9C8,
AC9,
796,
010,
000,
000,
000,
000,
000,
000,
000,
000,
000,
000,
000,
000,
000,
000,
000,
000,
000,
000,
000,
000,
000,
000,
000,
020,
695,
6A5,
7B5,
7B5,
7B5,
7A5,
7A5,
483,
483,
7A6,
7B6,
6A5,
7A5,
7A5,
9C8,
AC9,
010,
000,
000,
000,
000,
000,
000,
000,
000,
000,
000,
000,
000,
000,
000,
000,
000,
000,
000,
000,
000,
000,
000,
363,
695,
6B5,
6B5,
7B5,
6A4,
7B5,
7A5,
7B5,
7B6,
594,
372,
7B5,
7B5,
7A5,
6A5,
8B7,
AC9,
010,
000,
000,
000,
000,
000,
000,
000,
000,
000,
000,
000,
000,
000,
000,
000,
000,
000,
000,
000,
000,
000,
8B7,
583,
7B5,
6A4,
7B5,
7A5,
7B5,
7A4,
7B5,
7B5,
7A5,
7A5,
261,
6A5,
7B5,
7B5,
7A5,
9C8,
685,
000,
000,
000,
000,
000,
000,
000,
000,
000,
000,
000,
000,
000,
000,
000,
000,
000,
000,
000,
000,
453,
7A6,
6A5,
6A5,
7B5,
7B5,
7B5,
7B4,
7B4,
7B4,
7B5,
6A5,
7B7,
584,
372,
7A5,
7A5,
7A5,
6A5,
BDA,
010,
000,
000,
000,
000,
011,
9BA,
BED,
010,
000,
000,
000,
000,
000,
000,
000,
000,
000,
000,
000,
9B7,
584,
7B6,
7B5,
6B5,
7B5,
7B5,
7B5,
7A4,
7B5,
6A5,
595,
484,
696,
362,
473,
7A6,
7B6,
483,
8C9,
142,
021,
011,
000,
132,
BEC,
9DB,
9DC,
6A9,
000,
000,
000,
000,
000,
000,
000,
000,
000,
000,
574,
8B6,
594,
7B5,
7B5,
7B5,
7B5,
6B5,
7B5,
7A5,
7B5,
7B6,
596,
AEB,
9CA,
697,
151,
474,
595,
6A6,
8CA,
BEC,
BED,
CEE,
BDD,
8BA,
6A9,
6BA,
8CB,
BED,
000,
000,
000,
000,
000,
000,
000,
000,
000,
120,
9C7,
583,
7B5,
7B5,
7B5,
7B5,
6B5,
6B5,
6A4,
7A5,
7B5,
7A6,
597,
8DB,
8DB,
8DB,
BFD,
6A8,
9EB,
8DB,
8CA,
8CB,
8CB,
ADC,
9DC,
8CB,
9DB,
8DB,
8DB,
9DC,
677,
000,
000,
000,
000,
000,
000,
000,
000,
7A7,
7A6,
483,
694,
7B5,
7B5,
7B5,
6B5,
7B5,
7B5,
7B5,
7A5,
594,
7B9,
8DB,
7CB,
8DB,
8CB,
8DB,
7CB,
8DB,
8DB,
8DC,
6BA,
043,
376,
9EC,
8DB,
8DB,
8DB,
7BA,
ACB,
000,
000,
000,
000,
000,
000,
000,
020,
8B8,
7A6,
361,
473,
372,
6A5,
7B6,
7B5,
7B5,
7B5,
7A5,
7B6,
484,
7C9,
8DB,
8DB,
8DB,
8DB,
8DB,
8DB,
8DB,
7DB,
8DC,
265,
265,
154,
598,
9DC,
8CB,
8DC,
9CC,
8AA,
010,
000,
000,
000,
000,
000,
000,
474,
7B7,
594,
473,
473,
483,
372,
483,
6A5,
7B5,
7B5,
7B5,
7B6,
484,
8CA,
8DB,
8DB,
8DB,
8DB,
8CB,
8CB,
8DC,
7DB,
9DC,
487,
255,
265,
154,
043,
8DC,
8CB,
9CB,
BDC,
011,
000,
000,
000,
000,
000,
000,
594,
7B6,
483,
473,
473,
483,
472,
482,
372,
482,
483,
594,
594,
384,
8DB,
8DB,
8DC,
7CB,
8CB,
8DB,
8DB,
8DB,
8DC,
8DC,
376,
043,
255,
265,
043,
7CA,
9DC,
9CB,
8A9,
9AA,
000,
000,
000,
000,
000,
000,
482,
6A5,
583,
473,
483,
483,
482,
482,
483,
472,
483,
373,
373,
385,
8DB,
8DC,
8CB,
8CB,
9CB,
8BA,
ADC,
7BA,
8DC,
9DC,
043,
365,
143,
265,
265,
9EC,
7B9,
576,
9AA,
CCC,
011,
000,
000,
000,
000,
000,
472,
483,
362,
473,
483,
483,
483,
482,
482,
483,
473,
473,
263,
6A8,
8DB,
8DB,
8DB,
799,
FFF,
433,
333,
9BB,
6A9,
9DC,
154,
255,
144,
154,
9DC,
9DB,
8BA,
243,
766,
CBB,
776,
000,
000,
000,
000,
000,
472,
473,
362,
483,
473,
472,
372,
483,
372,
373,
363,
585,
ADB,
6A9,
8DB,
8DB,
9CB,
BCC,
CAB,
845,
534,
888,
8BA,
8CB,
9DC,
265,
477,
8CB,
8DB,
8CB,
ACB,
444,
533,
ECC,
AAA,
000,
000,
000,
000,
000,
241,
474,
473,
362,
483,
483,
473,
473,
484,
263,
7C9,
9DB,
8CB,
6A9,
8DB,
8DB,
8B9,
FFF,
C9A,
835,
956,
DBB,
566,
ADC,
487,
497,
8CB,
8DC,
7DB,
8DB,
ACB,
444,
644,
ECC,
ABB,
000,
000,
000,
000,
000,
010,
585,
473,
362,
372,
483,
473,
474,
041,
9DB,
8DB,
8DB,
8DB,
6A9,
8DB,
8DB,
587,
FFF,
DAA,
945,
834,
B89,
332,
BDC,
8CB,
386,
8DC,
8DB,
7DB,
8CB,
ADC,
343,
544,
FFF,
9BA,
011,
000,
000,
000,
000,
000,
342,
584,
473,
473,
151,
475,
142,
265,
487,
8DC,
8DB,
9DB,
6A9,
8DC,
8DC,
698,
FFF,
EBC,
834,
A45,
945,
544,
899,
9CB,
8DC,
8DB,
8DB,
8DB,
8CB,
ADC,
354,
333,
FFF,
8A9,
465,
000,
000,
000,
000,
000,
000,
353,
685,
474,
575,
142,
365,
255,
487,
8DC,
7DB,
8DB,
6B9,
7DB,
8DC,
698,
EFF,
FFF,
533,
633,
634,
877,
9BA,
9CB,
8DB,
8DB,
7CB,
8DB,
8DB,
8CB,
ACB,
9AA,
898,
ACB,
698,
000,
000,
000,
000,
000,
000,
010,
010,
243,
243,
365,
255,
154,
598,
8DC,
8DB,
8DB,
6A9,
8DC,
8DB,
8CB,
6A9,
698,
8AA,
BDC,
ADC,
9DC,
8DB,
8DB,
8DB,
7DB,
8DB,
7CB,
7DB,
8DB,
8CB,
9DB,
9DB,
ADC,
799,
000,
000,
000,
000,
000,
000,
000,
000,
122,
355,
265,
154,
154,
9DC,
8DB,
7DB,
8DB,
6B9,
8DB,
8DB,
8DB,
8DB,
9DC,
9CC,
9DC,
9DC,
9CB,
ADC,
ADC,
ADC,
9CA,
ACB,
ADC,
ADC,
ADC,
ADC,
8BA,
598,
597,
8A9,
000,
000,
000,
000,
000,
000,
000,
000,
8BA,
254,
043,
598,
9ED,
7CB,
8DB,
7DB,
8DB,
8DB,
8DB,
8DB,
8DB,
8DB,
7A9,
798,
998,
887,
876,
755,
643,
633,
633,
743,
643,
643,
865,
644,
322,
344,
BED,
365,
000,
000,
000,
000,
000,
000,
000,
687,
AED,
598,
9DC,
9DC,
8DB,
7DB,
8DC,
8DB,
8DB,
8DB,
8DB,
8DB,
7DB,
8DB,
ADB,
464,
765,
744,
854,
B65,
C76,
E88,
E88,
E98,
E88,
D87,
B76,
966,
544,
BDC,
8BA,
143,
000,
000,
000,
000,
000,
000,
000,
AED,
8DB,
8DB,
8DB,
8DB,
8DB,
8DB,
7DB,
7DB,
8DB,
8DB,
8DB,
8DB,
7DB,
8DC,
8CB,
9BA,
543,
955,
D87,
E88,
E88,
D87,
E88,
D77,
D88,
D88,
D98,
976,
BCB,
8BA,
7BA,
254,
244,
000,
000,
000,
000,
000,
254,
9DC,
8DC,
8DC,
8DB,
8DB,
8DB,
8DB,
8DB,
8DB,
8DC,
8DC,
8DB,
7CB,
8DC,
7CB,
8DB,
9CB,
9A9,
976,
D98,
D87,
E87,
E87,
E87,
D88,
D88,
C88,
976,
ABA,
8BA,
5A9,
9DC,
8CB,
254,
011,
000,
000,
000,
000,
698,
8DC,
8DC,
7BA,
8DB,
8DB,
8DB,
7DB,
8DB,
8DC,
7CB,
8DC,
8DB,
8DB,
5A9,
8DB,
8DB,
8DB,
9DB,
9B9,
876,
D98,
D88,
E87,
D87,
D88,
C98,
876,
ABA,
7A9,
6B9,
8DC,
8DB,
8DB,
8BA,
9CC,
000,
000,
000,
000,
8CB,
9ED,
155,
043,
9EC,
8DB,
8DB,
8DB,
598,
8DC,
8DC,
7DB,
7DB,
8DB,
8DB,
487,
9DC,
9DC,
8DB,
9DB,
9A9,
876,
966,
C88,
C88,
A76,
866,
BCB,
7A9,
6B9,
8DB,
7CB,
8DB,
8DB,
8DB,
AED,
465,
000,
000,
000,
BED,
487,
154,
043,
9DC,
8DB,
8CB,
698,
487,
9DC,
8DB,
8DB,
8DB,
8DB,
7BA,
476,
355,
799,
9CB,
9DC,
9DB,
BDC,
BCB,
898,
898,
9A9,
898,
466,
698,
9DC,
8DB,
8DC,
8DB,
8DB,
8DB,
8CB,
ACC,
000,
000,
000,
BDD,
043,
265,
154,
7CB,
8DC,
6A9,
698,
476,
8CB,
8DC,
8DB,
8DB,
9EC,
154,
365,
244,
143,
254,
476,
476,
376,
376,
476,
476,
587,
687,
8A9,
698,
6A9,
8DB,
8DB,
7DB,
8DB,
8DB,
9DB,
CEE,
011,
000,
000,
8BA,
254,
254,
043,
8DC,
8DB,
598,
698,
7A9,
476,
9DC,
8CB,
8DB,
9EC,
143,
355,
355,
254,
698,
598,
699,
699,
7A9,
7A9,
799,
122,
000,
455,
8A9,
799,
7BA,
8DB,
8DB,
8DB,
8CB,
8BA,
687,
666,
000,
000,
7A9,
143,
487,
9DC,
8DB,
8CB,
698,
698,
799,
476,
7A9,
9DC,
8DB,
8DB,
698,
254,
144,
154,
9DC,
6A9,
698,
798,
698,
577,
344,
000,
000,
000,
011,
355,
698,
7A9,
AEC,
AED,
9BB,
8A9,
898,
000,
000,
000,
AED,
9DC,
8DC,
8DB,
8DC,
7BA,
698,
799,
799,
8A9,
466,
7A9,
9EC,
497,
021,
8DB,
9DC,
9EC,
8DB,
AED,
476,
476,
598,
BED,
233,
000,
000,
000,
000,
000,
000,
010,
000,
021,
233,
455,
000,
000,
000,
010,
ADC,
8CB,
8DB,
8DB,
8DB,
6A9,
698,
799,
000,
566,
687,
577,
7A9,
8CB,
8DC,
8DC,
8DB,
8DB,
7CB,
9DC,
698,
8AA,
ADC,
9CB,
000,
000,
000,
000,
000,
000,
000,
000,
000,
000,
000,
000,
000,
000,
000,
000,
8BA,
9DC,
8CB,
9DC,
7BA,
698,
8AA,
000,
000,
000,
000,
000,
354,
7A9,
6A9,
7CB,
8DC,
8DC,
8DC,
9DC,
799,
7A9,
BDD,
243,
000,
000,
000,
000,
000,
000,
000,
000,
000,
000,
000,
000,
000,
000,
000,
000,
466,
ADC,
9DC,
8BA,
698,
8A9,
344,
000,
000,
000,
000,
000,
000,
233,
7A9,
799,
6A9,
7A9,
7BA,
7A9,
ACC,
687,
9BB,
000,
000,
000,
000,
000,
000,
000,
000,
000,
000,
000,
000,
000,
000,
000,
000,
000,
788,
566,
798,
677,
687,
121,
000,
000,
000,
000,
000,
000,
000,
000,
000,
455,
566,
CDD,
455,
CCC,
566,
565,
9A9,
010,
000,
000,
000,
000,
000,
000,
000,
000,
000,
000,
000,
000,
000,
000,
000,
000,
000,
000,
122,
676,
000,
000,
000,
000,
000,
000,
000,
000,
000,
000,
000,
000,
000,
011,
000,
000,
000,
333,
000,
000,
000,
000,
000,
000,
000,
000,
000,
000,
000,
000,
000,
000,
000,
000;
