memory_initialization_radix=16;
memory_initialization_vector=
111,
111,
111,
111,
111,
111,
111,
111,
111,
111,
111,
111,
111,
111,
111,
110,
111,
111,
011,
111,
443,
121,
333,
212,
111,
111,
111,
111,
111,
111,
111,
111,
111,
111,
111,
111,
111,
111,
111,
111,
111,
111,
111,
111,
111,
111,
111,
111,
111,
111,
111,
111,
111,
111,
111,
111,
111,
111,
110,
111,
111,
111,
111,
111,
111,
111,
111,
111,
111,
111,
111,
111,
111,
111,
111,
111,
111,
111,
111,
111,
111,
111,
111,
001,
000,
000,
000,
000,
000,
000,
000,
000,
000,
000,
000,
000,
000,
000,
000,
000,
000,
000,
000,
000,
000,
000,
000,
000,
000,
000,
000,
000,
000,
000,
000,
000,
000,
000,
000,
000,
000,
000,
000,
000,
000,
000,
000,
000,
000,
000,
000,
000,
000,
000,
000,
000,
000,
000,
000,
000,
000,
000,
000,
000,
000,
000,
000,
000,
000,
000,
000,
000,
000,
000,
000,
000,
000,
000,
000,
000,
111,
111,
111,
111,
111,
111,
111,
111,
111,
111,
111,
111,
111,
111,
111,
111,
111,
110,
222,
444,
443,
000,
444,
222,
111,
111,
111,
111,
111,
111,
111,
111,
111,
111,
111,
111,
111,
111,
111,
111,
111,
111,
111,
111,
111,
111,
111,
111,
111,
111,
111,
111,
111,
111,
111,
111,
111,
111,
111,
111,
111,
111,
111,
111,
110,
111,
111,
111,
111,
111,
111,
111,
111,
111,
111,
111,
111,
111,
111,
111,
111,
000,
000,
000,
000,
000,
000,
000,
000,
000,
000,
000,
000,
000,
000,
000,
000,
000,
000,
000,
000,
000,
000,
000,
000,
000,
000,
000,
000,
000,
000,
000,
000,
000,
000,
000,
000,
000,
000,
000,
000,
000,
000,
000,
000,
000,
000,
000,
000,
000,
000,
000,
000,
000,
000,
000,
000,
000,
000,
000,
000,
000,
000,
000,
000,
000,
000,
000,
000,
000,
000,
000,
000,
000,
000,
000,
000,
000,
000,
000,
111,
111,
111,
111,
111,
111,
111,
111,
111,
111,
111,
111,
111,
111,
111,
111,
111,
111,
323,
666,
000,
111,
444,
333,
111,
111,
110,
110,
111,
111,
111,
111,
111,
111,
111,
111,
111,
111,
111,
111,
111,
111,
111,
111,
111,
111,
111,
111,
111,
111,
111,
111,
110,
111,
111,
111,
111,
111,
111,
111,
111,
111,
111,
111,
111,
111,
111,
111,
111,
111,
111,
111,
111,
111,
111,
111,
111,
111,
111,
000,
000,
000,
000,
000,
000,
000,
000,
000,
000,
000,
000,
000,
000,
000,
000,
000,
000,
000,
000,
000,
000,
000,
000,
000,
000,
000,
000,
000,
000,
000,
000,
000,
000,
000,
000,
000,
000,
000,
000,
000,
000,
000,
000,
000,
000,
000,
000,
000,
000,
000,
000,
000,
000,
000,
000,
000,
000,
000,
000,
000,
000,
000,
000,
000,
000,
000,
000,
000,
000,
000,
000,
000,
000,
000,
000,
000,
000,
000,
000,
000,
111,
111,
111,
111,
111,
111,
111,
111,
110,
111,
111,
111,
111,
111,
111,
111,
100,
222,
767,
001,
212,
112,
333,
444,
111,
111,
110,
110,
111,
111,
111,
111,
111,
111,
111,
111,
111,
111,
111,
111,
111,
111,
111,
111,
111,
111,
111,
111,
111,
111,
111,
111,
111,
111,
111,
111,
111,
111,
111,
111,
111,
111,
111,
111,
111,
111,
111,
111,
111,
111,
111,
111,
111,
111,
111,
111,
111,
000,
000,
000,
000,
000,
000,
000,
000,
000,
000,
000,
000,
000,
000,
000,
000,
000,
000,
000,
000,
000,
000,
000,
000,
000,
000,
000,
000,
000,
000,
000,
000,
000,
000,
000,
000,
000,
000,
000,
000,
000,
000,
000,
000,
000,
000,
000,
000,
000,
000,
000,
000,
000,
000,
000,
000,
000,
000,
000,
000,
000,
000,
000,
000,
000,
000,
000,
000,
000,
000,
000,
000,
000,
000,
000,
000,
000,
000,
000,
000,
000,
000,
000,
111,
111,
110,
111,
111,
111,
111,
110,
110,
111,
111,
111,
111,
111,
011,
111,
211,
544,
333,
212,
212,
111,
333,
444,
111,
111,
111,
111,
110,
111,
111,
111,
111,
111,
111,
111,
111,
111,
111,
111,
111,
111,
111,
111,
111,
111,
111,
111,
111,
111,
111,
111,
111,
111,
111,
111,
111,
111,
111,
110,
111,
111,
111,
111,
111,
111,
111,
111,
111,
111,
111,
111,
111,
111,
000,
000,
000,
000,
000,
000,
000,
000,
000,
000,
000,
000,
000,
000,
000,
000,
000,
000,
000,
000,
000,
000,
000,
000,
000,
000,
000,
000,
000,
000,
000,
000,
000,
000,
000,
000,
000,
000,
000,
000,
000,
000,
000,
000,
000,
000,
000,
000,
000,
000,
000,
000,
000,
000,
000,
000,
000,
000,
000,
000,
000,
000,
000,
000,
000,
000,
000,
000,
000,
000,
000,
000,
000,
000,
000,
000,
000,
000,
000,
000,
000,
000,
000,
000,
000,
000,
111,
111,
110,
111,
111,
111,
111,
111,
110,
111,
111,
111,
111,
111,
011,
111,
222,
766,
000,
212,
222,
112,
222,
555,
111,
111,
111,
111,
110,
111,
111,
111,
111,
111,
111,
111,
111,
111,
111,
111,
111,
111,
111,
111,
111,
111,
111,
111,
111,
111,
111,
111,
111,
111,
111,
111,
111,
110,
110,
111,
111,
111,
111,
111,
111,
111,
111,
111,
111,
111,
111,
000,
000,
000,
000,
000,
000,
000,
000,
000,
000,
000,
000,
000,
000,
000,
000,
000,
000,
000,
000,
000,
000,
000,
000,
000,
000,
000,
000,
000,
000,
000,
000,
000,
000,
000,
000,
000,
000,
000,
000,
000,
000,
000,
000,
000,
000,
000,
000,
000,
000,
000,
000,
000,
000,
000,
000,
000,
000,
000,
000,
000,
000,
000,
000,
000,
000,
000,
000,
000,
000,
000,
000,
000,
000,
000,
000,
000,
000,
000,
000,
000,
000,
000,
000,
000,
000,
000,
000,
000,
111,
111,
111,
111,
111,
111,
111,
111,
111,
111,
111,
111,
111,
110,
010,
111,
555,
222,
212,
212,
212,
111,
222,
554,
111,
111,
011,
111,
111,
111,
111,
111,
111,
111,
111,
111,
111,
111,
111,
111,
111,
111,
111,
111,
111,
111,
111,
111,
111,
111,
111,
111,
111,
111,
111,
111,
111,
111,
111,
111,
111,
111,
111,
111,
111,
111,
111,
111,
000,
000,
000,
000,
000,
000,
000,
000,
000,
000,
000,
000,
000,
000,
000,
000,
000,
000,
000,
000,
000,
000,
000,
000,
000,
000,
000,
000,
000,
000,
000,
000,
000,
000,
000,
000,
000,
000,
000,
000,
000,
000,
000,
000,
000,
000,
000,
000,
000,
000,
000,
000,
000,
000,
000,
000,
000,
000,
000,
000,
000,
000,
000,
000,
000,
000,
000,
000,
000,
000,
000,
000,
000,
000,
000,
000,
000,
000,
000,
000,
000,
000,
000,
000,
000,
000,
000,
000,
000,
000,
000,
000,
111,
111,
111,
111,
111,
111,
111,
111,
111,
111,
111,
111,
111,
110,
111,
222,
666,
000,
222,
211,
210,
000,
220,
544,
111,
111,
011,
111,
111,
111,
111,
111,
111,
111,
111,
111,
111,
111,
111,
111,
111,
111,
111,
111,
111,
111,
111,
111,
111,
111,
111,
111,
111,
111,
111,
111,
111,
111,
111,
111,
111,
111,
111,
111,
111,
000,
000,
000,
000,
000,
000,
000,
000,
000,
000,
000,
000,
000,
000,
000,
000,
000,
000,
000,
000,
000,
000,
000,
000,
000,
000,
000,
000,
000,
000,
000,
000,
000,
000,
000,
000,
000,
000,
000,
000,
000,
000,
000,
000,
000,
000,
000,
000,
000,
000,
000,
000,
000,
000,
000,
000,
000,
000,
000,
000,
000,
000,
000,
000,
000,
000,
000,
000,
000,
000,
000,
000,
000,
000,
000,
000,
000,
000,
000,
000,
000,
000,
000,
000,
000,
000,
000,
000,
000,
000,
000,
000,
000,
000,
000,
111,
111,
111,
111,
111,
111,
111,
111,
111,
111,
001,
111,
111,
110,
111,
444,
333,
222,
211,
100,
320,
CB6,
885,
443,
111,
111,
111,
111,
111,
111,
111,
111,
111,
111,
111,
111,
111,
111,
111,
111,
111,
111,
111,
111,
111,
111,
111,
111,
111,
111,
111,
111,
110,
110,
111,
111,
111,
111,
110,
111,
111,
001,
000,
000,
000,
000,
000,
000,
000,
000,
000,
000,
000,
000,
000,
000,
000,
000,
000,
000,
000,
000,
000,
000,
000,
000,
000,
000,
000,
000,
000,
000,
000,
000,
000,
000,
000,
000,
000,
000,
000,
000,
000,
000,
000,
000,
000,
000,
000,
000,
000,
000,
000,
000,
000,
000,
000,
000,
000,
000,
000,
000,
000,
000,
000,
000,
000,
000,
000,
000,
000,
000,
000,
000,
000,
000,
000,
000,
000,
000,
000,
000,
000,
000,
000,
000,
000,
000,
000,
000,
000,
000,
000,
000,
000,
000,
000,
000,
000,
000,
111,
111,
111,
111,
111,
111,
111,
111,
111,
111,
111,
111,
010,
110,
212,
667,
000,
210,
100,
A94,
FE7,
FE7,
763,
433,
111,
111,
111,
111,
111,
111,
111,
111,
111,
111,
111,
111,
111,
111,
111,
111,
111,
111,
111,
111,
111,
111,
111,
111,
111,
111,
111,
000,
111,
111,
112,
111,
000,
000,
000,
000,
000,
000,
000,
000,
000,
000,
000,
000,
000,
000,
000,
000,
000,
000,
000,
000,
000,
000,
000,
000,
000,
000,
000,
000,
000,
000,
000,
000,
000,
000,
000,
000,
000,
000,
000,
000,
000,
000,
000,
000,
000,
000,
000,
000,
000,
000,
000,
000,
000,
000,
000,
000,
000,
000,
000,
000,
000,
000,
000,
000,
000,
000,
000,
000,
000,
000,
000,
000,
000,
000,
000,
000,
000,
000,
000,
000,
000,
000,
000,
000,
000,
000,
000,
000,
000,
000,
000,
000,
000,
000,
000,
000,
000,
000,
000,
000,
000,
000,
000,
000,
111,
111,
111,
111,
111,
111,
111,
111,
111,
110,
111,
111,
110,
111,
333,
544,
000,
110,
FD7,
FD5,
FD4,
FE7,
652,
333,
111,
111,
111,
111,
111,
111,
111,
111,
111,
111,
111,
111,
111,
111,
111,
111,
111,
111,
111,
111,
111,
111,
111,
111,
110,
111,
111,
111,
111,
000,
000,
000,
000,
000,
000,
000,
000,
000,
000,
000,
000,
000,
000,
000,
000,
000,
000,
000,
000,
000,
000,
000,
000,
000,
000,
000,
000,
000,
000,
000,
000,
211,
331,
110,
221,
000,
000,
000,
000,
000,
000,
000,
000,
000,
000,
000,
000,
000,
000,
000,
000,
000,
000,
000,
000,
000,
000,
000,
000,
000,
000,
000,
000,
000,
000,
000,
000,
000,
000,
000,
000,
000,
000,
000,
000,
000,
000,
000,
000,
000,
000,
000,
000,
000,
000,
000,
000,
000,
000,
000,
000,
000,
000,
000,
000,
000,
000,
000,
000,
000,
000,
000,
000,
000,
000,
000,
111,
111,
111,
111,
111,
111,
111,
111,
111,
111,
111,
111,
101,
111,
444,
321,
330,
FE8,
FD4,
FD3,
FD3,
FE6,
431,
333,
111,
111,
111,
111,
111,
111,
011,
111,
111,
111,
111,
111,
111,
111,
111,
111,
111,
111,
111,
111,
111,
111,
111,
111,
110,
110,
111,
011,
111,
000,
000,
000,
000,
000,
000,
000,
000,
000,
000,
000,
000,
000,
000,
000,
000,
000,
000,
000,
000,
000,
000,
000,
000,
000,
000,
000,
000,
000,
000,
000,
322,
331,
773,
AA6,
332,
000,
000,
000,
000,
000,
000,
000,
000,
000,
100,
000,
000,
000,
000,
000,
000,
000,
000,
100,
000,
000,
000,
000,
000,
000,
000,
000,
000,
000,
000,
000,
000,
000,
000,
000,
000,
000,
000,
000,
000,
000,
000,
000,
000,
000,
000,
000,
000,
000,
000,
000,
000,
000,
000,
000,
000,
000,
000,
000,
000,
000,
000,
000,
000,
000,
000,
000,
000,
000,
000,
000,
111,
111,
111,
111,
111,
111,
111,
111,
110,
110,
110,
111,
111,
221,
765,
220,
FE7,
ED4,
FD4,
FD3,
FD3,
FE6,
331,
223,
111,
111,
111,
111,
111,
111,
111,
111,
111,
111,
111,
111,
111,
111,
111,
111,
111,
111,
111,
111,
111,
111,
111,
111,
111,
110,
111,
111,
111,
111,
000,
000,
000,
000,
000,
000,
000,
000,
000,
000,
000,
000,
000,
000,
000,
000,
000,
000,
000,
000,
000,
000,
000,
000,
000,
000,
000,
000,
101,
332,
430,
BA4,
FE6,
ED7,
321,
112,
000,
000,
000,
000,
000,
000,
200,
622,
623,
300,
100,
000,
000,
000,
000,
100,
633,
200,
100,
000,
000,
211,
644,
200,
000,
000,
000,
000,
000,
000,
000,
000,
000,
000,
000,
000,
000,
000,
000,
000,
000,
000,
000,
000,
000,
000,
000,
000,
000,
000,
000,
000,
000,
000,
000,
000,
000,
000,
000,
000,
000,
000,
000,
000,
000,
000,
000,
000,
000,
000,
111,
111,
111,
111,
111,
111,
111,
111,
111,
110,
111,
111,
101,
322,
330,
FE8,
FD5,
FD3,
FD3,
FD3,
FD4,
CB4,
443,
223,
111,
111,
111,
111,
111,
111,
111,
111,
111,
111,
111,
111,
111,
111,
111,
111,
111,
111,
111,
111,
111,
111,
111,
111,
111,
111,
111,
111,
000,
111,
000,
000,
100,
110,
211,
221,
321,
331,
333,
333,
323,
222,
222,
222,
222,
111,
000,
000,
000,
000,
000,
000,
000,
000,
000,
000,
000,
110,
443,
430,
EC6,
FD5,
FD3,
FE6,
442,
222,
000,
000,
000,
000,
000,
000,
400,
712,
400,
834,
200,
100,
000,
100,
000,
200,
722,
300,
100,
100,
100,
200,
200,
200,
100,
000,
100,
100,
100,
100,
100,
100,
000,
000,
100,
100,
100,
000,
000,
000,
000,
000,
000,
000,
000,
000,
000,
000,
000,
000,
000,
000,
000,
000,
000,
000,
000,
000,
000,
000,
000,
000,
000,
000,
000,
000,
000,
000,
000,
000,
111,
111,
111,
111,
111,
111,
111,
111,
111,
111,
111,
111,
111,
432,
661,
FE7,
FD4,
FD3,
FC3,
FD4,
FD5,
982,
554,
122,
101,
110,
111,
111,
111,
111,
111,
111,
111,
111,
111,
111,
111,
111,
111,
111,
111,
111,
111,
111,
111,
111,
111,
111,
001,
111,
111,
111,
222,
222,
332,
332,
542,
431,
330,
540,
761,
662,
221,
334,
333,
333,
444,
333,
333,
222,
111,
000,
000,
000,
000,
000,
000,
000,
000,
000,
111,
543,
430,
FE7,
FD5,
FD4,
FD3,
FD6,
873,
332,
000,
000,
000,
000,
000,
000,
400,
611,
400,
834,
200,
512,
632,
733,
401,
300,
811,
600,
733,
200,
500,
822,
822,
500,
611,
833,
933,
923,
400,
611,
733,
733,
400,
300,
944,
712,
833,
200,
000,
000,
000,
000,
000,
000,
000,
000,
000,
000,
000,
000,
000,
000,
000,
000,
000,
000,
000,
000,
000,
000,
000,
000,
000,
000,
000,
000,
000,
000,
000,
000,
111,
111,
111,
111,
111,
111,
111,
111,
111,
111,
111,
111,
112,
553,
872,
FD5,
FD4,
FC3,
FD4,
FD4,
FD6,
872,
443,
112,
101,
110,
111,
111,
111,
111,
111,
111,
111,
111,
111,
111,
111,
111,
111,
111,
111,
111,
111,
111,
111,
111,
111,
111,
111,
111,
221,
442,
553,
431,
552,
873,
A94,
ED8,
FE8,
FE7,
EE7,
DD8,
000,
212,
112,
222,
111,
111,
211,
111,
222,
000,
000,
000,
000,
000,
000,
000,
000,
110,
442,
551,
FF7,
ED4,
FD4,
FD4,
FD3,
FD5,
A84,
542,
110,
000,
000,
000,
000,
000,
400,
833,
622,
300,
200,
834,
300,
300,
834,
400,
A33,
922,
300,
300,
A34,
701,
711,
933,
600,
500,
A23,
700,
600,
833,
300,
300,
833,
400,
701,
400,
933,
200,
000,
000,
000,
000,
000,
000,
000,
000,
000,
000,
000,
000,
000,
000,
000,
000,
000,
000,
000,
000,
000,
000,
000,
000,
000,
000,
000,
000,
000,
000,
000,
000,
111,
111,
111,
111,
111,
111,
111,
111,
111,
111,
111,
011,
223,
553,
BA3,
FD4,
FD4,
FD3,
FD3,
FD4,
FE7,
651,
433,
112,
111,
111,
111,
011,
111,
111,
111,
111,
111,
111,
111,
111,
111,
111,
111,
110,
010,
111,
111,
111,
101,
111,
111,
222,
333,
554,
430,
661,
981,
ED6,
FE7,
FD5,
FD5,
FD5,
FD5,
FD5,
ED5,
CB5,
000,
212,
112,
111,
222,
211,
000,
555,
111,
000,
000,
000,
000,
000,
000,
000,
221,
431,
871,
FE7,
FD4,
FD4,
FD4,
FD4,
FD4,
FD5,
ED7,
320,
110,
000,
000,
000,
000,
100,
301,
512,
100,
100,
200,
844,
300,
300,
733,
200,
722,
611,
611,
300,
933,
300,
300,
200,
622,
400,
933,
600,
500,
844,
300,
300,
622,
300,
621,
300,
834,
200,
000,
000,
000,
000,
000,
000,
000,
000,
000,
000,
000,
000,
000,
000,
000,
000,
000,
000,
000,
000,
000,
000,
000,
000,
000,
000,
000,
000,
000,
000,
000,
000,
111,
111,
111,
111,
111,
111,
111,
111,
111,
111,
000,
011,
223,
331,
FE6,
FD3,
FD3,
FD4,
FD3,
FD4,
FE8,
330,
322,
101,
111,
111,
011,
011,
011,
011,
111,
111,
111,
111,
111,
111,
101,
111,
111,
110,
110,
010,
111,
111,
111,
222,
432,
553,
430,
873,
ED7,
FD6,
FD5,
FD3,
FD3,
FD3,
FD3,
FD3,
FD4,
FD4,
FD5,
982,
100,
212,
222,
111,
211,
100,
555,
333,
000,
000,
000,
000,
000,
000,
000,
321,
431,
A94,
FE6,
FD3,
FD3,
FD3,
FC3,
FD4,
FD4,
FD4,
FE7,
540,
221,
000,
000,
000,
000,
000,
200,
311,
000,
000,
100,
200,
632,
522,
100,
200,
300,
200,
512,
300,
200,
622,
522,
311,
200,
200,
511,
400,
300,
200,
622,
522,
200,
200,
310,
100,
411,
100,
000,
000,
000,
000,
000,
000,
000,
000,
000,
000,
000,
000,
000,
000,
000,
000,
000,
000,
000,
000,
000,
000,
000,
000,
000,
000,
000,
000,
000,
000,
000,
000,
110,
110,
111,
111,
111,
111,
111,
111,
111,
110,
111,
011,
333,
442,
FE6,
FD3,
FD3,
FD3,
FD3,
FD5,
A94,
553,
221,
111,
110,
110,
110,
111,
110,
110,
111,
111,
111,
111,
111,
111,
111,
110,
111,
111,
110,
111,
111,
222,
443,
553,
550,
A93,
FF7,
FD5,
FD5,
FD4,
FC4,
FD4,
FD3,
FD3,
FD3,
FD3,
FD3,
FC4,
FE7,
540,
210,
211,
211,
211,
000,
555,
323,
000,
000,
000,
000,
000,
000,
000,
322,
431,
BA5,
FD6,
FD4,
FD3,
FD4,
FD4,
FD4,
FD3,
FD3,
FD4,
FE6,
761,
331,
000,
000,
000,
000,
000,
000,
000,
000,
000,
000,
000,
100,
000,
000,
100,
000,
000,
000,
000,
000,
000,
100,
000,
000,
000,
000,
000,
000,
000,
100,
100,
000,
000,
000,
000,
000,
000,
000,
000,
000,
000,
000,
000,
000,
000,
000,
000,
000,
000,
000,
000,
000,
000,
000,
000,
000,
000,
000,
000,
000,
000,
000,
000,
000,
000,
000,
000,
000,
000,
110,
111,
111,
111,
111,
111,
111,
111,
110,
110,
111,
111,
443,
763,
FD6,
FD3,
FD3,
FD3,
FD3,
FD6,
773,
443,
111,
000,
111,
110,
110,
110,
110,
110,
111,
111,
111,
000,
101,
111,
111,
111,
101,
111,
111,
221,
442,
553,
551,
BA5,
FE7,
FD5,
ED3,
FD3,
FC3,
FD4,
FD4,
FC3,
FD4,
FD3,
FC3,
FD3,
FD4,
FC5,
FE8,
100,
210,
211,
211,
100,
555,
333,
000,
000,
000,
000,
000,
000,
000,
332,
331,
BA6,
FD6,
FD4,
FD4,
FD3,
FD3,
FD3,
FD3,
FD3,
FD3,
FD3,
FD4,
982,
442,
000,
000,
000,
000,
000,
000,
000,
000,
000,
000,
000,
000,
000,
000,
000,
000,
000,
000,
000,
000,
000,
000,
000,
000,
000,
000,
000,
000,
000,
000,
000,
000,
000,
000,
000,
000,
000,
000,
000,
000,
000,
000,
000,
000,
000,
000,
000,
000,
000,
000,
000,
000,
000,
000,
000,
000,
000,
000,
000,
000,
000,
000,
000,
000,
000,
000,
000,
000,
000,
111,
111,
111,
111,
111,
111,
111,
111,
111,
110,
111,
111,
543,
873,
FD6,
FD4,
FD4,
FD4,
FD4,
FE7,
331,
334,
223,
223,
333,
333,
433,
432,
332,
332,
333,
233,
222,
112,
112,
101,
111,
111,
111,
122,
333,
654,
540,
BA4,
FE7,
FD5,
ED4,
FD4,
FD4,
FD4,
FD4,
FC4,
FD4,
FD3,
FD3,
FD3,
FD3,
FD3,
FD3,
FD6,
A94,
100,
221,
212,
111,
656,
222,
000,
000,
000,
000,
000,
000,
000,
332,
431,
DB5,
FE5,
FD4,
FD3,
FD3,
FC3,
FD3,
FD4,
FD3,
FD4,
FD3,
FD3,
FD4,
CB4,
442,
111,
000,
000,
000,
000,
000,
000,
000,
000,
000,
000,
000,
000,
000,
000,
000,
000,
000,
000,
000,
000,
000,
000,
000,
000,
000,
000,
000,
000,
000,
000,
000,
000,
000,
000,
000,
000,
000,
000,
000,
000,
000,
000,
000,
000,
000,
000,
000,
000,
000,
000,
000,
000,
000,
000,
000,
000,
000,
000,
000,
000,
000,
000,
000,
000,
000,
000,
000,
000,
111,
111,
111,
111,
111,
111,
111,
111,
111,
110,
111,
111,
553,
984,
FD6,
FD4,
FC4,
FD4,
FD5,
870,
885,
665,
443,
331,
542,
653,
763,
763,
662,
652,
442,
331,
542,
553,
443,
332,
211,
111,
332,
654,
431,
A85,
FE8,
FD5,
FD3,
FD3,
FD3,
FD3,
FD3,
FD4,
FC4,
FD4,
FD3,
FD3,
FD3,
FD4,
FD4,
FD4,
FD4,
FE7,
320,
210,
110,
222,
556,
111,
000,
000,
000,
000,
000,
000,
000,
332,
431,
DC7,
FD5,
FD3,
FD3,
FD3,
FD3,
FD4,
FD3,
FC3,
FD4,
FD3,
FD3,
FD3,
FD3,
FE7,
320,
212,
000,
111,
000,
000,
000,
000,
100,
000,
000,
000,
000,
000,
000,
000,
000,
000,
000,
000,
000,
000,
000,
000,
200,
311,
000,
000,
000,
000,
000,
000,
000,
000,
000,
000,
000,
000,
100,
100,
000,
000,
000,
000,
000,
000,
000,
000,
000,
000,
000,
000,
000,
000,
000,
000,
000,
000,
000,
000,
000,
000,
000,
000,
000,
000,
000,
000,
000,
000,
111,
111,
111,
111,
111,
111,
111,
111,
110,
111,
001,
221,
553,
A94,
FD5,
FD4,
FD4,
FD5,
FC5,
310,
760,
982,
CA3,
FE7,
FE6,
FE6,
FE6,
FD6,
FE6,
FE6,
FE6,
FE7,
DB5,
982,
761,
320,
665,
664,
540,
761,
FE7,
FD5,
FD5,
FD4,
FD4,
FD3,
FD3,
FD3,
FD3,
FD4,
FD4,
FD4,
FD3,
FD3,
FD3,
FD4,
FD4,
FD4,
FD5,
BA4,
000,
000,
555,
444,
111,
000,
000,
000,
000,
000,
000,
000,
322,
431,
DC6,
FD5,
FD4,
FD3,
FD4,
FD4,
FD3,
FC3,
FD3,
FD4,
FD4,
FD4,
FD3,
FD3,
FD3,
FE6,
542,
222,
111,
111,
000,
100,
300,
834,
711,
722,
100,
000,
100,
100,
000,
000,
100,
100,
000,
100,
100,
100,
100,
100,
300,
632,
100,
000,
000,
100,
200,
100,
000,
000,
000,
000,
000,
100,
300,
833,
200,
100,
000,
000,
000,
000,
000,
000,
000,
000,
000,
000,
000,
000,
000,
000,
000,
000,
000,
000,
000,
000,
000,
000,
000,
000,
000,
000,
000,
000,
111,
111,
111,
111,
111,
111,
111,
111,
111,
111,
111,
221,
552,
A95,
FD5,
FD4,
FD5,
A70,
A81,
FD6,
FE6,
FD5,
FD4,
FD3,
FD3,
FD3,
FD3,
FD3,
FD3,
FD3,
FD3,
FD3,
FD4,
FD5,
FD6,
FE8,
873,
540,
DC6,
FE6,
FD4,
FD3,
FD3,
FD3,
FD4,
FD3,
FD3,
FD3,
FD3,
FD3,
FD3,
FD3,
FD3,
FD3,
FD3,
FC4,
FD5,
FD6,
FF9,
100,
332,
556,
222,
000,
000,
000,
000,
000,
000,
000,
000,
332,
431,
DB7,
FD5,
FD3,
FD3,
FD3,
FD3,
FD4,
FD4,
FD4,
FD3,
FD3,
FC4,
FD4,
FD4,
FD3,
FD3,
FD6,
763,
433,
111,
111,
000,
100,
400,
700,
500,
933,
200,
211,
300,
533,
100,
100,
300,
622,
200,
100,
100,
623,
522,
200,
400,
622,
200,
522,
200,
100,
522,
522,
100,
100,
211,
100,
411,
200,
812,
934,
522,
200,
000,
000,
000,
000,
000,
000,
000,
000,
000,
000,
000,
000,
000,
000,
000,
000,
000,
000,
000,
000,
000,
000,
000,
000,
000,
000,
000,
000,
111,
111,
111,
111,
111,
111,
111,
111,
111,
111,
111,
221,
552,
AA5,
FE7,
CA2,
A80,
FE5,
FD5,
FD4,
FD4,
FD3,
FD3,
FD3,
FD3,
FD4,
FD3,
FD4,
FD3,
FD3,
FD3,
FD4,
FD4,
FC4,
FD5,
FD5,
DB4,
FE6,
FD4,
FD4,
FD4,
FD3,
FD3,
FD3,
FD4,
FD4,
FC3,
FD3,
FD3,
FD3,
FD3,
FD4,
FC3,
FD3,
FD3,
FD4,
FE7,
CB7,
441,
554,
332,
110,
000,
000,
000,
000,
000,
000,
000,
000,
332,
431,
EC6,
FD5,
FD4,
FD3,
FD3,
FD3,
FD3,
FD3,
FD4,
FD3,
FD3,
FD3,
FD3,
FD4,
FD3,
FD3,
FD3,
FD6,
874,
543,
211,
111,
000,
100,
400,
923,
812,
822,
300,
623,
522,
200,
744,
300,
711,
300,
834,
200,
400,
300,
500,
611,
300,
834,
722,
300,
400,
844,
100,
100,
733,
400,
622,
200,
833,
300,
400,
723,
100,
000,
000,
000,
000,
000,
000,
000,
000,
000,
000,
000,
000,
000,
000,
000,
000,
000,
000,
000,
000,
000,
000,
000,
000,
000,
000,
000,
000,
000,
111,
111,
111,
111,
111,
111,
111,
111,
111,
110,
111,
221,
552,
CB6,
A81,
DB3,
FD5,
FD4,
FD3,
FD3,
FD3,
FD3,
FD3,
FD4,
FD4,
FD4,
FD4,
FD4,
FD4,
FD5,
FD6,
FD6,
FD4,
FD4,
FC4,
FD4,
FD4,
FD3,
FD3,
FD3,
FD3,
FD3,
FD3,
FD3,
FC3,
FD4,
FD4,
FD3,
FD4,
FD4,
FD4,
FD4,
FD5,
FD5,
FE6,
CA4,
651,
441,
332,
111,
000,
000,
000,
000,
000,
000,
000,
000,
000,
332,
331,
DB7,
FD5,
FD3,
FD4,
FD3,
FD3,
FD3,
FD3,
FD3,
FD3,
FD3,
FD3,
FD3,
FD4,
FD3,
FD3,
FD3,
FD3,
FD5,
A94,
553,
111,
111,
000,
000,
400,
601,
300,
722,
400,
623,
200,
100,
200,
511,
822,
711,
511,
200,
622,
722,
722,
611,
300,
723,
833,
400,
400,
844,
100,
100,
734,
400,
611,
300,
833,
300,
300,
733,
100,
000,
000,
000,
000,
000,
000,
000,
000,
000,
000,
000,
000,
000,
000,
000,
000,
000,
000,
000,
000,
000,
000,
000,
000,
000,
000,
000,
000,
000,
111,
111,
111,
111,
111,
111,
111,
111,
110,
000,
000,
221,
764,
530,
FD6,
FD4,
FD4,
FC4,
FD4,
FD3,
FD3,
FD3,
FC3,
FD3,
FC3,
FD4,
FD3,
FD4,
FD6,
761,
540,
994,
FE7,
FD5,
FD4,
FD3,
FD3,
FD3,
FD3,
FD3,
FD3,
FD3,
FD4,
FD3,
FD4,
FD3,
FD3,
FD4,
FC4,
FD5,
FD6,
FE7,
DD7,
873,
541,
543,
543,
211,
000,
000,
000,
000,
000,
000,
000,
000,
000,
000,
222,
441,
CB5,
FD5,
FD4,
FD4,
FD3,
FD3,
FD3,
FD3,
FD3,
FD3,
FD3,
FD3,
FD3,
FD3,
FD3,
FD3,
FD3,
FD3,
FD3,
FD5,
CB6,
552,
221,
111,
000,
000,
300,
844,
612,
622,
200,
533,
200,
100,
100,
100,
733,
612,
522,
200,
733,
511,
722,
611,
300,
633,
200,
844,
300,
511,
623,
744,
200,
200,
844,
722,
844,
200,
200,
744,
522,
200,
000,
000,
000,
000,
000,
000,
000,
000,
000,
000,
000,
000,
000,
000,
000,
000,
000,
000,
000,
000,
000,
000,
000,
000,
000,
000,
000,
000,
111,
111,
111,
111,
011,
011,
111,
111,
111,
110,
211,
432,
540,
FD7,
FD4,
FD3,
FC3,
FD4,
FD4,
FC3,
FD4,
FC3,
FC3,
FD3,
FD4,
FD3,
FD3,
FE6,
873,
FFD,
CCA,
000,
430,
FE7,
FD4,
FD3,
FD4,
FD4,
FD3,
FD3,
FD4,
FD5,
FD5,
FD5,
FD5,
FD5,
FD5,
FC5,
FC6,
B93,
872,
551,
440,
553,
333,
223,
111,
111,
000,
000,
000,
000,
000,
000,
000,
000,
000,
221,
431,
CB6,
FD5,
FD3,
FD3,
FD3,
FD3,
FD3,
FD3,
FD3,
FD3,
FD3,
FD3,
FD3,
FD3,
FD3,
FD3,
FD3,
FD3,
FD3,
FC3,
FD5,
ED7,
430,
321,
111,
000,
000,
100,
200,
200,
100,
100,
000,
000,
000,
000,
000,
100,
100,
100,
100,
100,
200,
200,
200,
100,
100,
100,
100,
100,
100,
200,
200,
100,
100,
200,
200,
200,
100,
100,
200,
100,
100,
000,
000,
000,
000,
000,
000,
000,
000,
000,
000,
000,
000,
000,
000,
000,
000,
000,
000,
000,
000,
000,
000,
000,
000,
000,
000,
000,
000,
110,
110,
111,
111,
011,
011,
011,
111,
010,
110,
222,
542,
BA4,
FD5,
FD4,
FD3,
FD4,
FD3,
FC3,
FD3,
FD3,
FC3,
FD4,
FD3,
FD3,
FD4,
FD4,
BA3,
A96,
FFF,
FFF,
000,
100,
A94,
FD5,
FD3,
FD4,
FC3,
FD3,
FC3,
D92,
D92,
D93,
DA4,
B94,
862,
762,
642,
431,
654,
553,
332,
221,
211,
111,
101,
111,
010,
000,
000,
000,
000,
000,
000,
000,
000,
211,
441,
BA4,
FD5,
FD4,
FD3,
FD3,
FD3,
FD3,
FD3,
FD3,
FD3,
FD3,
FD3,
FD3,
FD3,
FD3,
FD3,
FD3,
FD3,
FD3,
FD3,
FD4,
FD5,
FE8,
430,
331,
111,
000,
000,
000,
100,
000,
000,
000,
000,
000,
000,
000,
000,
000,
000,
000,
000,
000,
000,
000,
000,
000,
000,
000,
000,
000,
000,
000,
000,
000,
000,
000,
000,
100,
000,
000,
000,
000,
000,
000,
000,
000,
000,
000,
000,
000,
000,
000,
000,
000,
000,
000,
000,
000,
000,
000,
000,
000,
000,
000,
000,
000,
000,
000,
000,
000,
000,
110,
111,
111,
111,
011,
011,
111,
111,
111,
111,
443,
552,
FE7,
FD5,
FD5,
FD4,
FD3,
FD3,
FD3,
FD3,
FD3,
FD3,
FD4,
FD3,
FD3,
FD3,
FD4,
CA3,
100,
BBB,
767,
100,
110,
540,
FD6,
FD3,
FD4,
FD4,
FC3,
FD4,
FC5,
EA3,
DA3,
B82,
530,
A86,
654,
433,
333,
122,
111,
111,
111,
110,
101,
111,
110,
111,
000,
000,
000,
000,
000,
000,
000,
110,
442,
984,
FD6,
FD3,
FD3,
FD3,
FD3,
FD3,
FD3,
FD3,
FD3,
FD3,
FD4,
FD4,
FD3,
FD3,
FD3,
FD3,
FD3,
FD4,
FD4,
FD4,
FC4,
FC5,
FE8,
440,
332,
111,
000,
000,
000,
000,
000,
000,
000,
000,
000,
000,
000,
000,
000,
000,
000,
000,
000,
000,
000,
000,
000,
000,
000,
000,
000,
000,
000,
000,
000,
000,
000,
000,
000,
000,
000,
000,
000,
000,
000,
000,
000,
000,
000,
000,
000,
000,
000,
000,
000,
000,
000,
000,
000,
000,
000,
000,
000,
000,
000,
000,
000,
000,
000,
000,
000,
000,
111,
111,
111,
111,
111,
111,
111,
111,
101,
221,
563,
995,
FE9,
871,
A83,
ED6,
FD5,
FD3,
FD3,
FD3,
FD4,
FD3,
FC3,
FD4,
FD3,
FD3,
FD3,
FE6,
100,
100,
111,
221,
110,
651,
FE6,
FD3,
FD3,
FD3,
FD3,
FD4,
FC4,
FD4,
EB3,
DA3,
B95,
541,
332,
111,
111,
111,
111,
111,
111,
111,
111,
111,
111,
110,
000,
000,
000,
000,
000,
000,
111,
442,
771,
FE6,
FD4,
FD3,
FD4,
FD4,
FD3,
FD3,
FD3,
FD3,
FD3,
FD3,
FD3,
FD3,
FD3,
FD3,
FD3,
FD4,
FD4,
FD4,
FD4,
FD4,
FD5,
FD6,
FD8,
541,
332,
111,
000,
000,
000,
000,
100,
100,
100,
100,
200,
100,
000,
000,
000,
000,
000,
000,
000,
000,
000,
000,
000,
000,
000,
000,
000,
000,
000,
000,
000,
000,
000,
000,
000,
000,
000,
000,
000,
000,
000,
000,
000,
000,
000,
000,
000,
000,
000,
000,
000,
000,
000,
000,
000,
000,
000,
000,
000,
000,
000,
000,
000,
000,
000,
000,
000,
000,
111,
111,
111,
111,
111,
111,
111,
111,
111,
332,
330,
FFA,
762,
FEA,
FFB,
871,
FD5,
FD4,
FD4,
FD3,
FD4,
FD3,
FD4,
FD3,
FD3,
FD3,
FD3,
FD5,
BA5,
100,
210,
110,
100,
ED7,
FD4,
FD3,
FD3,
FD3,
FD4,
FD3,
FD3,
FD3,
FD4,
FD5,
FD7,
651,
433,
111,
111,
111,
111,
111,
111,
111,
111,
111,
111,
111,
000,
000,
000,
000,
000,
110,
443,
551,
FE7,
FD4,
FD3,
FD4,
FD4,
FC4,
FC3,
FD3,
FD3,
FD3,
FD4,
FD4,
FD4,
FD4,
FD4,
FD4,
FD4,
FC4,
FC4,
EB3,
EB3,
DA3,
DA3,
DB5,
984,
331,
221,
111,
000,
000,
000,
100,
533,
422,
100,
311,
734,
401,
000,
000,
000,
000,
000,
000,
000,
100,
100,
100,
000,
000,
000,
000,
000,
000,
000,
000,
000,
000,
000,
000,
000,
000,
000,
000,
000,
000,
000,
000,
000,
000,
000,
000,
000,
000,
000,
000,
000,
000,
000,
000,
000,
000,
000,
000,
000,
000,
000,
000,
000,
000,
000,
000,
000,
000,
111,
111,
111,
111,
111,
111,
111,
111,
111,
332,
661,
FEA,
000,
FFD,
662,
BA5,
FD6,
FD5,
FD4,
FD3,
FD4,
FD4,
FD4,
FD3,
FD3,
FD3,
FD3,
FD4,
FD5,
EC6,
760,
860,
FD6,
FD5,
FD3,
FD3,
FD3,
FD3,
FC3,
FD4,
FD3,
FD3,
FD4,
FD4,
FD5,
972,
654,
112,
111,
111,
111,
111,
111,
110,
110,
110,
111,
011,
111,
000,
000,
000,
000,
442,
440,
FE7,
FD4,
FD3,
FD3,
FD3,
FD4,
FD3,
FD3,
FD4,
FD4,
FD4,
FD4,
FD4,
FC4,
FB4,
EB4,
DA3,
DA3,
D93,
DA3,
DA3,
DA3,
DA5,
CA6,
541,
442,
221,
111,
111,
000,
000,
200,
844,
100,
100,
100,
100,
511,
401,
000,
000,
200,
200,
100,
100,
200,
200,
200,
100,
100,
100,
200,
100,
000,
000,
000,
000,
000,
000,
000,
000,
000,
000,
000,
000,
000,
000,
000,
000,
000,
000,
000,
000,
000,
000,
000,
000,
000,
000,
000,
000,
000,
000,
000,
000,
000,
000,
000,
000,
000,
000,
000,
000,
000,
000,
111,
111,
111,
111,
010,
011,
111,
101,
111,
443,
872,
DC7,
000,
000,
100,
FE8,
FD6,
640,
FD3,
FD3,
FD3,
FD4,
FD3,
FD4,
FD3,
FC3,
FD4,
FD4,
FC3,
FD4,
FD5,
FD5,
FD4,
FC4,
FD5,
FD5,
FD4,
FC4,
FD4,
FC3,
FD3,
FD3,
FD4,
FD4,
FD4,
DB4,
442,
222,
111,
111,
111,
111,
111,
110,
110,
110,
111,
112,
111,
000,
000,
000,
332,
330,
FE7,
FD4,
FD4,
FD3,
FD4,
FD4,
FD4,
FD4,
FD4,
FC3,
FB4,
EB3,
DA2,
D92,
DA3,
DA3,
D93,
EA4,
DA4,
D93,
DA4,
DA5,
EB7,
862,
431,
443,
111,
000,
000,
111,
000,
100,
612,
500,
100,
000,
000,
100,
511,
400,
100,
100,
734,
622,
743,
200,
833,
723,
833,
400,
200,
633,
512,
633,
100,
000,
000,
000,
000,
000,
000,
000,
000,
000,
000,
000,
000,
000,
000,
000,
000,
000,
000,
000,
000,
000,
000,
000,
000,
000,
000,
000,
000,
000,
000,
000,
000,
000,
000,
000,
000,
000,
000,
000,
000,
000,
111,
111,
111,
111,
111,
111,
111,
111,
122,
554,
983,
B94,
100,
000,
A93,
FD5,
FD4,
EC3,
FD3,
FD3,
FD3,
FD4,
FD3,
FD3,
FD5,
FC4,
FC4,
FD4,
FD4,
FC3,
FD4,
FD4,
FD7,
D93,
B60,
B50,
B61,
FA4,
FD5,
FD4,
FD4,
FD3,
FD4,
FD4,
ED3,
FE7,
431,
333,
111,
111,
111,
111,
110,
111,
111,
111,
111,
001,
111,
000,
000,
221,
430,
DB6,
FD6,
FD4,
FD5,
FD4,
FC4,
EB4,
EB4,
EA3,
D93,
D93,
D93,
DA3,
DA3,
DA3,
D93,
DA3,
DA3,
EA3,
E93,
EA4,
EB6,
B95,
431,
553,
221,
000,
000,
000,
000,
112,
000,
100,
612,
400,
000,
000,
000,
100,
511,
500,
100,
523,
300,
200,
511,
400,
823,
300,
400,
611,
501,
833,
612,
844,
200,
000,
000,
000,
000,
000,
000,
000,
000,
000,
000,
000,
000,
000,
000,
000,
000,
000,
000,
000,
000,
000,
000,
000,
000,
000,
000,
000,
000,
000,
000,
000,
000,
000,
000,
000,
000,
000,
000,
000,
000,
000,
111,
111,
111,
111,
111,
111,
111,
111,
222,
441,
ED7,
FD7,
210,
762,
FE7,
FC4,
FC5,
FE7,
FD5,
FD5,
FD5,
FC5,
FD5,
FE6,
B91,
DA2,
FD4,
FD4,
FC4,
FD4,
FD4,
FD5,
A50,
B51,
D63,
E63,
D63,
B40,
C81,
FD5,
FD4,
FD4,
FD4,
FD3,
FD3,
FE6,
552,
333,
111,
011,
111,
111,
110,
111,
111,
111,
111,
111,
111,
001,
001,
442,
973,
FD7,
FB4,
EB3,
DA2,
DA2,
D92,
DA3,
D93,
D93,
D93,
D93,
EA4,
D93,
DA3,
DA4,
DA4,
DA4,
DA4,
D93,
EA4,
EB6,
641,
542,
332,
000,
000,
000,
000,
000,
000,
001,
000,
000,
200,
845,
100,
100,
000,
100,
511,
400,
100,
422,
522,
200,
733,
300,
834,
300,
400,
612,
400,
612,
300,
200,
100,
000,
000,
000,
000,
000,
000,
000,
000,
000,
000,
000,
000,
000,
000,
000,
000,
000,
000,
000,
000,
000,
000,
000,
000,
000,
000,
000,
000,
000,
000,
000,
000,
000,
000,
000,
000,
000,
000,
000,
000,
000,
111,
110,
111,
111,
111,
111,
111,
111,
544,
763,
FE7,
FD4,
FE6,
FD6,
FD5,
FD7,
FC8,
400,
840,
B73,
DA5,
DA5,
C84,
730,
A81,
FD5,
FD4,
FC3,
FD4,
FD4,
FD4,
D93,
C51,
E63,
E52,
F53,
E53,
E63,
940,
FC6,
FD5,
FD4,
FD3,
FD3,
FD3,
FD5,
873,
543,
111,
010,
111,
111,
111,
111,
111,
111,
111,
111,
111,
111,
111,
210,
FC8,
C93,
DA3,
DA3,
EA3,
D93,
D93,
EA3,
DA3,
DA3,
DA3,
DA3,
D93,
EA4,
D94,
D94,
E93,
E93,
DA4,
EB6,
973,
431,
543,
211,
000,
000,
000,
000,
000,
000,
000,
000,
000,
000,
000,
200,
533,
422,
100,
422,
522,
522,
311,
100,
411,
522,
200,
100,
411,
100,
200,
310,
100,
301,
623,
623,
000,
000,
000,
000,
000,
000,
000,
000,
000,
000,
000,
000,
000,
000,
000,
000,
000,
000,
000,
000,
000,
000,
000,
000,
000,
000,
000,
000,
000,
000,
000,
000,
000,
000,
000,
000,
000,
000,
000,
000,
000,
000,
111,
111,
111,
111,
111,
111,
111,
322,
643,
862,
FC5,
FD4,
FD3,
FD4,
C91,
A61,
400,
721,
720,
610,
610,
510,
610,
610,
961,
FD5,
FD4,
FD3,
FD3,
FD4,
FE6,
A60,
E62,
F52,
F53,
F42,
F53,
E52,
C62,
C72,
FD5,
FD4,
FD3,
FD3,
FD3,
FD5,
A84,
653,
121,
011,
111,
111,
111,
111,
111,
111,
111,
101,
000,
111,
111,
432,
A83,
DA4,
DA3,
EA4,
EA3,
EA4,
EA4,
D93,
EA4,
EA4,
DA4,
DA3,
EA3,
EA4,
EA4,
EA4,
D94,
EA5,
DA5,
641,
542,
221,
000,
000,
000,
000,
000,
000,
000,
000,
000,
000,
000,
000,
000,
000,
100,
200,
100,
100,
100,
100,
000,
000,
100,
100,
000,
000,
000,
000,
000,
000,
000,
100,
100,
100,
000,
000,
000,
000,
000,
000,
000,
000,
000,
000,
000,
000,
000,
000,
000,
000,
000,
000,
000,
000,
000,
000,
000,
000,
000,
000,
000,
000,
000,
000,
000,
000,
000,
000,
000,
000,
000,
000,
000,
000,
000,
000,
111,
111,
111,
111,
111,
011,
122,
544,
832,
D64,
930,
FC6,
FC4,
FD4,
FE5,
960,
620,
721,
711,
711,
721,
600,
722,
731,
850,
FD6,
FD4,
FD4,
FD4,
FC4,
FD6,
A60,
D62,
F52,
F52,
F52,
F53,
E52,
D63,
C71,
FD5,
FD3,
FD3,
FD3,
FD3,
FD5,
DB6,
542,
221,
111,
111,
111,
111,
111,
111,
111,
111,
111,
111,
110,
111,
332,
751,
EB6,
DA4,
D93,
DA3,
EA3,
D93,
EA3,
EA4,
D93,
EA4,
D93,
EA3,
EA3,
D93,
DA5,
EB8,
753,
431,
432,
110,
000,
000,
000,
000,
000,
000,
000,
000,
000,
000,
000,
000,
000,
000,
000,
100,
100,
000,
000,
000,
000,
000,
000,
000,
000,
000,
000,
000,
000,
000,
000,
000,
000,
000,
000,
000,
000,
000,
000,
000,
000,
000,
000,
000,
000,
000,
000,
000,
000,
000,
000,
000,
000,
000,
000,
000,
000,
000,
000,
000,
000,
000,
000,
000,
000,
000,
000,
000,
000,
000,
000,
000,
000,
000,
000,
000,
000,
111,
111,
111,
110,
111,
011,
122,
654,
B43,
E63,
D63,
C72,
FD5,
FD3,
FD4,
FE7,
400,
721,
722,
711,
711,
A45,
A45,
943,
850,
FD6,
FD4,
FD3,
FD3,
FD4,
FD5,
B71,
D62,
E53,
F53,
F52,
F53,
E53,
D62,
D82,
FD4,
FD3,
FD3,
FD4,
FD4,
FD4,
FE8,
430,
332,
111,
111,
111,
111,
111,
011,
111,
111,
111,
110,
110,
111,
221,
420,
DB7,
DA4,
EA3,
EA3,
DA3,
DA3,
EA3,
D93,
EA4,
D93,
EA4,
D93,
DA4,
EB6,
B84,
431,
543,
222,
000,
000,
000,
000,
000,
000,
000,
000,
000,
000,
000,
000,
000,
000,
000,
000,
000,
000,
000,
000,
000,
000,
000,
000,
000,
000,
000,
000,
000,
000,
000,
000,
000,
000,
000,
000,
000,
000,
000,
000,
000,
000,
000,
000,
000,
000,
000,
000,
000,
000,
000,
000,
000,
000,
000,
000,
000,
000,
000,
000,
000,
000,
000,
000,
000,
000,
000,
000,
000,
000,
000,
000,
000,
000,
000,
000,
000,
000,
000,
111,
111,
111,
111,
011,
011,
333,
533,
D75,
E52,
D62,
C71,
FD4,
FD3,
FD3,
FD5,
B83,
510,
721,
712,
B45,
A35,
A34,
A43,
840,
FD7,
FD4,
FD4,
FC3,
FD4,
FD4,
FC5,
A30,
E63,
F53,
E53,
E53,
E63,
940,
FD6,
FD3,
FD3,
FD3,
FD4,
FD4,
FD4,
FE6,
761,
543,
112,
111,
111,
001,
111,
111,
111,
111,
111,
110,
110,
110,
111,
443,
763,
DA5,
EA3,
EA3,
DA3,
EA3,
DA3,
EA3,
D93,
EA3,
EA4,
DA5,
DB6,
642,
432,
332,
100,
000,
000,
000,
000,
000,
000,
000,
000,
000,
000,
000,
000,
000,
000,
000,
000,
000,
000,
000,
000,
000,
000,
000,
000,
000,
000,
000,
000,
000,
000,
000,
000,
000,
000,
000,
000,
000,
000,
000,
000,
000,
000,
000,
000,
000,
000,
000,
000,
000,
000,
000,
000,
000,
000,
000,
000,
000,
000,
000,
000,
000,
000,
000,
000,
000,
000,
000,
000,
000,
000,
000,
000,
000,
000,
000,
000,
000,
000,
000,
000,
111,
111,
111,
111,
111,
011,
333,
643,
D64,
E62,
D62,
C61,
FD5,
FD3,
FD3,
FD4,
FE7,
520,
610,
B55,
A34,
B34,
A34,
A33,
730,
FE8,
FC4,
FD3,
FC3,
FD4,
FD3,
FD4,
FA4,
930,
D52,
D62,
C51,
930,
FC5,
FD4,
FD3,
FD3,
FD3,
FD3,
FD4,
FD4,
FD4,
BA3,
653,
222,
111,
001,
111,
111,
111,
111,
111,
111,
110,
110,
111,
111,
222,
431,
EB7,
D93,
EA4,
D94,
D93,
DA3,
DA3,
DA3,
DA4,
EB6,
962,
531,
443,
111,
000,
000,
000,
000,
000,
000,
000,
000,
000,
000,
000,
000,
000,
000,
000,
000,
000,
000,
000,
000,
000,
000,
000,
000,
000,
000,
000,
000,
000,
000,
000,
000,
000,
000,
000,
000,
000,
000,
000,
000,
000,
000,
000,
000,
000,
000,
000,
000,
000,
000,
000,
000,
000,
000,
000,
000,
000,
000,
000,
000,
000,
000,
000,
000,
000,
000,
000,
000,
000,
000,
000,
000,
000,
000,
000,
000,
000,
000,
000,
000,
000,
000,
110,
111,
111,
111,
111,
111,
223,
533,
D64,
E52,
D62,
D82,
FC4,
FD4,
FD4,
FD3,
FD4,
FC5,
500,
934,
C55,
D66,
E77,
D75,
730,
FD7,
FC4,
FD3,
FD3,
FC3,
FD3,
FD4,
FD4,
FE6,
C92,
B81,
DA3,
FE6,
FD4,
FD3,
FD3,
FD4,
FD3,
FD3,
FD4,
FD4,
FD4,
FE7,
440,
332,
111,
111,
101,
111,
000,
111,
111,
010,
110,
111,
111,
101,
222,
443,
973,
EA5,
D94,
E94,
EA4,
E94,
DA3,
DA4,
EB6,
530,
653,
321,
000,
000,
000,
000,
000,
000,
000,
000,
000,
000,
000,
000,
000,
000,
000,
000,
000,
000,
000,
000,
000,
000,
000,
000,
000,
000,
000,
000,
000,
000,
000,
000,
000,
000,
000,
000,
000,
000,
000,
000,
000,
000,
000,
000,
000,
000,
000,
000,
000,
000,
000,
000,
000,
000,
000,
000,
000,
000,
000,
000,
000,
000,
000,
000,
000,
000,
000,
000,
000,
000,
000,
000,
000,
000,
000,
000,
000,
000,
000,
000,
000,
000,
000,
000,
111,
111,
111,
111,
111,
011,
122,
644,
A42,
E63,
940,
FC5,
FD4,
FC3,
FD3,
FD4,
FD3,
FD5,
A62,
D76,
E77,
E77,
E77,
E86,
A62,
FD7,
FC4,
FD3,
FD3,
FD3,
FD4,
FD4,
FD3,
FD3,
FD4,
FD5,
FD4,
FD4,
FD3,
FC3,
FD3,
FD4,
FD3,
FD4,
FD4,
FD4,
FD3,
FD6,
873,
663,
211,
111,
111,
111,
111,
111,
111,
011,
111,
111,
111,
111,
112,
332,
530,
EB7,
D94,
E94,
E94,
D94,
DA4,
DA4,
EB7,
541,
332,
000,
000,
000,
000,
000,
000,
000,
000,
000,
000,
000,
000,
000,
000,
000,
000,
000,
000,
000,
000,
000,
000,
000,
000,
000,
000,
000,
000,
000,
000,
000,
000,
000,
000,
000,
000,
000,
000,
000,
000,
000,
000,
000,
000,
000,
000,
000,
000,
000,
000,
000,
000,
000,
000,
000,
000,
000,
000,
000,
000,
000,
000,
000,
000,
000,
000,
000,
000,
000,
000,
000,
000,
000,
000,
000,
000,
000,
000,
000,
000,
000,
000,
000,
000,
000,
111,
111,
111,
111,
111,
111,
111,
543,
631,
941,
B82,
FD4,
FD3,
FD3,
FD3,
FD4,
FD3,
FD4,
FD7,
951,
E86,
E77,
E77,
E87,
A52,
FD6,
FD4,
FD4,
FD4,
FD3,
FD3,
FD4,
FD3,
FD4,
FC3,
FD3,
FD4,
FD4,
FD4,
FD4,
FD3,
FD3,
FD4,
FD4,
FD3,
FD3,
FD3,
FC4,
FE7,
430,
332,
111,
111,
111,
101,
111,
111,
111,
111,
111,
111,
111,
111,
121,
442,
A85,
DA5,
D94,
D94,
DA4,
DA4,
DA4,
EB6,
641,
321,
000,
000,
000,
000,
000,
000,
000,
000,
000,
000,
000,
000,
000,
000,
000,
000,
000,
000,
000,
000,
000,
000,
000,
000,
000,
000,
000,
000,
000,
000,
000,
000,
000,
000,
000,
000,
000,
000,
000,
000,
000,
000,
000,
000,
000,
000,
000,
000,
000,
000,
000,
000,
000,
000,
000,
000,
000,
000,
000,
000,
000,
000,
000,
000,
000,
000,
000,
000,
000,
000,
000,
000,
000,
000,
000,
000,
000,
000,
000,
000,
000,
000,
000,
000,
000,
111,
111,
111,
110,
111,
111,
110,
211,
654,
B96,
FE7,
FD4,
FD3,
FD3,
FC3,
FD4,
FC4,
FD4,
FD5,
FC5,
A52,
D76,
E77,
E77,
A62,
FD7,
FC4,
FD3,
FD3,
FD4,
FD3,
FD3,
FD3,
FD3,
FD3,
FD3,
FD3,
FD4,
FC3,
FD4,
FD3,
FD3,
FD4,
FD4,
FD3,
FD3,
FD3,
FD4,
FE6,
771,
654,
211,
101,
111,
111,
111,
111,
011,
111,
111,
111,
111,
111,
121,
332,
541,
EB6,
D94,
DA4,
DA4,
DA4,
D94,
EB6,
752,
432,
000,
000,
000,
000,
000,
000,
000,
000,
000,
000,
000,
000,
000,
000,
000,
000,
000,
000,
000,
000,
000,
000,
000,
000,
000,
000,
000,
000,
000,
000,
000,
000,
000,
000,
000,
000,
000,
000,
000,
000,
000,
000,
000,
000,
000,
000,
000,
000,
000,
000,
000,
000,
000,
000,
000,
000,
000,
000,
000,
000,
000,
000,
000,
000,
000,
000,
000,
000,
000,
000,
000,
000,
000,
000,
000,
000,
000,
000,
000,
000,
000,
000,
000,
000,
000,
111,
111,
111,
110,
110,
110,
100,
211,
333,
432,
ED7,
FD5,
FD3,
FD3,
FD4,
FD4,
FD4,
FD4,
FD4,
FD5,
DA4,
A62,
E88,
E87,
A62,
FD5,
FD4,
FD3,
FD3,
FD3,
FD3,
FD3,
FD4,
FD3,
FD3,
FD4,
FD3,
FD3,
FD4,
FD3,
FD4,
FD3,
FD3,
FD3,
FD4,
FD3,
FD3,
FD3,
FD4,
FE7,
431,
333,
111,
101,
101,
111,
010,
111,
111,
111,
111,
111,
111,
110,
222,
432,
B84,
EA4,
DA4,
DA3,
EA3,
DA3,
DA5,
963,
432,
000,
000,
000,
000,
000,
000,
000,
000,
000,
000,
000,
000,
000,
000,
000,
000,
000,
000,
000,
000,
000,
000,
000,
000,
000,
000,
000,
000,
000,
000,
000,
000,
000,
000,
000,
000,
000,
000,
000,
000,
000,
000,
000,
000,
000,
000,
000,
000,
000,
000,
000,
000,
000,
000,
000,
000,
000,
000,
000,
000,
000,
000,
000,
000,
000,
000,
000,
000,
000,
000,
000,
000,
000,
000,
000,
000,
000,
000,
000,
000,
000,
000,
000,
000,
000,
111,
111,
111,
110,
110,
111,
110,
111,
112,
454,
440,
FE8,
FD4,
FD3,
FD4,
FD3,
FD3,
FD4,
FD4,
FD4,
FD5,
DA4,
A42,
B63,
DA4,
FD4,
FD4,
FD3,
FD3,
FD3,
FD3,
FD3,
FD3,
FD3,
FD4,
FD3,
FD3,
FD3,
FD3,
FD3,
FD4,
FD4,
FD4,
FD4,
FD4,
FD4,
FD4,
FD3,
FD3,
FD5,
984,
553,
221,
111,
111,
111,
111,
110,
101,
111,
111,
110,
111,
111,
112,
432,
641,
EB6,
DA4,
EA3,
D93,
EA3,
EA4,
973,
543,
000,
000,
000,
000,
000,
000,
000,
000,
000,
000,
000,
000,
000,
000,
000,
000,
000,
000,
000,
000,
000,
000,
000,
000,
000,
000,
000,
000,
000,
000,
000,
000,
000,
000,
000,
000,
000,
000,
000,
000,
000,
000,
000,
000,
000,
000,
000,
000,
000,
000,
000,
000,
000,
000,
000,
000,
000,
000,
000,
000,
000,
000,
000,
000,
000,
000,
000,
000,
000,
000,
000,
000,
000,
000,
000,
000,
000,
000,
000,
000,
000,
000,
000,
000,
000,
111,
111,
111,
111,
011,
111,
110,
111,
111,
221,
554,
541,
FE7,
FD4,
FD4,
FD4,
FC3,
FD4,
FD4,
FD4,
FD4,
FD5,
FD6,
EA3,
FD4,
FD3,
FD3,
FD3,
FD3,
FD3,
FD3,
FD3,
FD3,
FD3,
FD4,
FD3,
FD3,
FD3,
FD3,
FD4,
FD5,
DB3,
B91,
B91,
B91,
B91,
B90,
DB2,
FD4,
FD4,
FE7,
540,
553,
112,
101,
111,
110,
110,
111,
111,
111,
111,
111,
111,
111,
221,
531,
B96,
DA5,
EA4,
EA3,
EA3,
EA4,
B84,
543,
011,
000,
000,
000,
000,
000,
000,
000,
000,
000,
000,
000,
000,
000,
000,
000,
000,
000,
000,
000,
000,
000,
000,
000,
000,
000,
000,
000,
000,
000,
000,
000,
000,
000,
000,
000,
000,
000,
000,
000,
000,
000,
000,
000,
000,
000,
000,
000,
000,
000,
000,
000,
000,
000,
000,
000,
000,
000,
000,
000,
000,
000,
000,
000,
000,
000,
000,
000,
000,
000,
000,
000,
000,
000,
000,
000,
000,
000,
000,
000,
000,
000,
000,
000,
000,
111,
111,
111,
111,
111,
011,
111,
101,
111,
221,
443,
874,
550,
FE6,
FD4,
FD4,
FD4,
FD3,
FD3,
FD4,
FD4,
FD3,
FD3,
FD3,
FD3,
FD3,
FD4,
FD3,
FD3,
FD3,
FD3,
FD3,
FD4,
FD3,
FD4,
FD3,
FD3,
FD3,
FD4,
EB3,
A80,
CA3,
A91,
FE7,
DB4,
FE6,
FD5,
FD4,
FD4,
FD4,
ED4,
ED6,
441,
433,
111,
101,
110,
110,
010,
111,
101,
101,
111,
110,
000,
221,
543,
752,
EA5,
D93,
EA3,
EA3,
EA3,
DB6,
321,
112,
000,
000,
000,
000,
000,
000,
000,
000,
000,
000,
000,
000,
000,
000,
000,
000,
000,
000,
000,
000,
000,
000,
000,
000,
000,
000,
000,
000,
000,
000,
000,
000,
000,
000,
000,
000,
000,
000,
000,
000,
000,
000,
000,
000,
000,
000,
000,
000,
000,
000,
000,
000,
000,
000,
000,
000,
000,
000,
000,
000,
000,
000,
000,
000,
000,
000,
000,
000,
000,
000,
000,
000,
000,
000,
000,
000,
000,
000,
000,
000,
000,
000,
000,
000,
111,
111,
101,
101,
110,
111,
111,
222,
333,
554,
552,
440,
760,
870,
FE5,
FD4,
FD3,
FD3,
FD3,
FD3,
FD3,
FD4,
FD4,
FD4,
FD3,
FD4,
FD4,
FD3,
FD3,
FD3,
FD3,
FD4,
FC3,
FD4,
FD4,
FD3,
FD3,
FD4,
FE5,
A80,
EB4,
B91,
FD5,
970,
EC4,
A70,
EC4,
FD5,
FC4,
FD3,
FD4,
FD6,
B95,
653,
322,
111,
110,
111,
111,
111,
111,
111,
111,
010,
111,
221,
765,
420,
EB6,
DA3,
EA3,
EA3,
EA3,
EB6,
432,
222,
000,
000,
000,
000,
000,
000,
000,
000,
000,
000,
000,
000,
000,
000,
000,
000,
000,
000,
000,
000,
220,
884,
A95,
220,
000,
553,
DD8,
430,
000,
000,
000,
000,
000,
000,
000,
000,
000,
000,
000,
000,
000,
000,
000,
000,
000,
000,
000,
000,
000,
000,
000,
000,
000,
000,
000,
000,
000,
000,
000,
000,
000,
000,
000,
000,
000,
000,
000,
000,
000,
000,
000,
000,
000,
000,
000,
000,
000,
000,
000,
000,
000,
000,
000,
000,
110,
110,
111,
111,
111,
321,
442,
553,
431,
874,
CB6,
FE8,
FE6,
FE5,
860,
FE5,
FD4,
FD3,
FD3,
FD3,
FD3,
FD4,
FD4,
FD4,
FD3,
FD3,
FD4,
FD3,
FD3,
FD3,
FD4,
FD4,
FD3,
FD4,
FD4,
FD4,
FD4,
FD4,
CA2,
EC4,
FD5,
FD5,
FD5,
FD5,
FD5,
EC3,
DB2,
B80,
FD4,
FC3,
FD3,
FD5,
EC6,
320,
665,
222,
111,
111,
111,
111,
111,
111,
011,
121,
222,
654,
531,
DA7,
DA4,
DA3,
EA3,
EA3,
EA3,
EB6,
543,
122,
000,
000,
000,
000,
000,
000,
000,
000,
000,
000,
000,
000,
000,
000,
000,
000,
000,
000,
000,
000,
550,
771,
000,
EE9,
100,
000,
872,
430,
000,
000,
000,
000,
000,
000,
000,
000,
000,
000,
000,
000,
000,
000,
000,
000,
000,
000,
000,
000,
000,
000,
000,
000,
000,
000,
000,
000,
000,
000,
000,
000,
000,
000,
000,
000,
000,
000,
000,
000,
000,
000,
000,
000,
000,
000,
000,
000,
000,
000,
000,
000,
000,
000,
000,
000,
010,
121,
222,
222,
553,
440,
761,
CA4,
FE7,
FD5,
FD5,
FD4,
FD4,
FD4,
FE5,
860,
FD4,
FD4,
FD4,
FD4,
FD3,
FD3,
FD3,
FD3,
FD3,
FD3,
FD4,
FD4,
FD3,
FD3,
FD4,
FD4,
FD3,
FD3,
FD3,
FD4,
FD5,
970,
980,
FD5,
FD4,
FD4,
FD4,
FD4,
FD4,
FD4,
FD4,
DA1,
FD4,
FC3,
FD4,
FD4,
FD6,
861,
542,
555,
112,
111,
110,
110,
111,
111,
111,
443,
542,
762,
EB7,
DA4,
DA3,
DA3,
EA3,
D93,
E93,
EB6,
653,
222,
000,
000,
000,
000,
000,
000,
000,
000,
000,
000,
000,
000,
000,
000,
000,
000,
000,
000,
000,
000,
450,
660,
000,
EE9,
000,
000,
773,
440,
000,
100,
BA5,
870,
BA4,
000,
550,
883,
DC6,
430,
100,
BB6,
883,
540,
000,
771,
982,
CB5,
310,
100,
000,
000,
000,
000,
DD7,
BA3,
DC6,
320,
210,
DD7,
993,
EE8,
000,
772,
882,
BB5,
320,
100,
CB5,
882,
542,
000,
782,
882,
884,
100,
000,
000,
000,
000,
000,
000,
000,
000,
000,
000,
121,
333,
443,
542,
662,
ED7,
FE6,
FD4,
FD4,
FC3,
FD3,
FD3,
FD3,
FD3,
FD4,
FE5,
DA1,
FC4,
FD4,
FD4,
FD3,
FD3,
FD3,
FD4,
FD3,
FD3,
FD4,
FD4,
FD4,
FD4,
FD4,
FC3,
FD3,
FD3,
FD3,
FD4,
FD6,
B91,
FE5,
FD4,
FD3,
FD3,
FD4,
FC4,
FD3,
FD4,
FD3,
FD4,
FD4,
FD3,
FD4,
FC4,
FD6,
750,
863,
543,
443,
111,
110,
110,
111,
322,
654,
431,
B95,
DA5,
DA4,
D93,
DA3,
DA3,
DA3,
DA4,
EA5,
A84,
431,
111,
000,
000,
000,
000,
000,
000,
000,
000,
000,
000,
000,
000,
000,
000,
000,
000,
000,
000,
000,
000,
440,
CC6,
994,
000,
000,
000,
772,
440,
000,
663,
BA3,
870,
FE7,
110,
110,
881,
AA2,
760,
100,
CB6,
982,
210,
000,
EE8,
870,
992,
BA6,
100,
000,
000,
000,
000,
DC5,
100,
210,
CB4,
210,
BA4,
000,
440,
000,
EE8,
770,
992,
BA6,
100,
CB4,
981,
100,
000,
550,
BB4,
661,
000,
000,
000,
000,
000,
000,
000,
000,
000,
000,
000,
332,
664,
CB5,
ED5,
FD6,
FD5,
FD4,
FD4,
FD3,
FD4,
FC3,
FD4,
FD4,
FD4,
FD4,
FD4,
FD4,
FD3,
FD3,
FD4,
FC3,
FD4,
FD4,
FD4,
FD4,
FD4,
FD4,
FC4,
FD4,
FD4,
FC4,
FD4,
FD4,
FC3,
FD3,
FD4,
FD5,
A80,
FE5,
FD3,
FD3,
FD3,
FC3,
FC3,
FD3,
FD3,
FD4,
FD3,
FD4,
FD4,
FD3,
FC3,
FD5,
860,
A80,
EC7,
431,
433,
111,
111,
332,
553,
640,
EB6,
DA5,
DA4,
D94,
EA4,
DA3,
EA4,
D94,
EB7,
763,
432,
221,
000,
000,
000,
000,
000,
000,
000,
000,
000,
000,
000,
000,
000,
000,
000,
000,
000,
000,
000,
000,
000,
551,
662,
000,
000,
000,
000,
772,
430,
000,
562,
660,
000,
000,
000,
FF8,
000,
881,
761,
000,
000,
000,
EE8,
000,
CD8,
000,
000,
100,
000,
000,
000,
000,
000,
CC6,
100,
540,
872,
210,
AA6,
000,
000,
000,
DD8,
000,
000,
000,
000,
100,
000,
FEA,
000,
000,
000,
772,
662,
000,
000,
000,
000,
000,
000,
000,
000,
000,
000,
543,
430,
FE7,
FD4,
FD4,
FD4,
FD4,
FD4,
FD4,
FD3,
FD3,
FD3,
FC3,
FC3,
FD4,
FD3,
FD3,
FD3,
FD3,
FD3,
FD4,
FC3,
C91,
DA3,
EA3,
EB3,
EB3,
EB3,
EB3,
DA2,
DA2,
EB3,
FD4,
FD4,
FD3,
FD4,
FD4,
CB2,
EC3,
FD4,
FD3,
FD3,
FC3,
FD4,
FD4,
FD4,
FD3,
FD3,
FD3,
FD3,
FD3,
FD4,
FD4,
DA2,
FD4,
FD6,
B95,
542,
332,
332,
443,
874,
EB6,
DA4,
DA3,
DA3,
EA4,
D94,
EA4,
D94,
EB7,
531,
543,
221,
000,
000,
000,
000,
000,
000,
000,
000,
000,
000,
000,
000,
000,
000,
000,
000,
000,
000,
000,
000,
000,
000,
220,
330,
000,
000,
000,
774,
883,
994,
330,
000,
662,
995,
885,
000,
330,
994,
550,
330,
110,
997,
995,
110,
000,
010,
995,
996,
331,
000,
000,
000,
000,
000,
CC7,
982,
762,
000,
110,
442,
000,
000,
000,
010,
995,
996,
332,
110,
996,
995,
110,
000,
663,
995,
773,
000,
000,
000,
000,
000,
000,
000,
000,
000,
000,
000,
540,
A94,
FD6,
DC3,
B90,
FD4,
FD4,
FD4,
FD3,
FD3,
FD3,
FD4,
FD3,
FD3,
FD3,
FD3,
FD3,
FD3,
FD4,
FD4,
FD3,
FD4,
EB3,
DA2,
DA3,
DA3,
DA3,
DA3,
DA3,
DA3,
D92,
FC4,
FD4,
FD3,
FD4,
FD3,
FD3,
FE5,
A80,
FD5,
FD4,
FD4,
FD3,
FD3,
FD3,
FD3,
FD3,
FD3,
FD3,
FD3,
FD3,
FD3,
FD4,
FD4,
FD3,
FD4,
FE6,
871,
553,
444,
543,
EB8,
DA4,
D93,
DA4,
DA4,
EA4,
E94,
EA4,
CA5,
431,
544,
110,
000,
000,
000,
000,
000,
000,
000,
000,
000,
000,
000,
000,
000,
000,
000,
000,
000,
000,
000,
000,
000,
000,
000,
000,
000,
000,
000,
000,
000,
000,
000,
000,
000,
000,
000,
000,
000,
000,
000,
000,
000,
000,
000,
000,
000,
000,
000,
000,
000,
000,
000,
000,
000,
000,
000,
DD9,
000,
000,
000,
000,
000,
000,
000,
000,
000,
000,
000,
000,
000,
000,
000,
000,
000,
000,
000,
000,
000,
000,
000,
000,
000,
000,
000,
000,
000,
000,
000,
430,
FE8,
FD6,
A90,
DB3,
FD4,
FD4,
FD3,
FD3,
FD3,
FD3,
FD4,
FD3,
FD3,
FD3,
FD3,
FD4,
FD4,
FD4,
FD4,
FD3,
FD3,
FD5,
EB3,
D92,
D93,
DA3,
EA3,
DA3,
DA3,
DA2,
FD4,
FD4,
FD3,
FC3,
FD4,
FD3,
FD4,
B90,
FD5,
FD5,
FD4,
FD3,
FD3,
FD4,
FC3,
FD4,
FD4,
FD3,
FD3,
FD4,
FD4,
FD4,
FD4,
FD4,
FD3,
FD4,
FE7,
540,
774,
654,
752,
EB6,
DA4,
D93,
DA4,
D93,
EA4,
B83,
541,
554,
122,
000,
000,
000,
000,
000,
000,
000,
000,
000,
000,
000,
000,
000,
000,
000,
000,
000,
000,
000,
000,
000,
000,
000,
000,
000,
000,
000,
000,
000,
000,
000,
000,
000,
000,
000,
000,
000,
000,
000,
000,
000,
000,
000,
000,
000,
000,
000,
000,
000,
000,
000,
000,
000,
000,
000,
000,
000,
000,
000,
000,
000,
000,
000,
000,
000,
000,
000,
000,
000,
000,
000,
000,
000,
000,
000,
000,
000,
000,
000,
000,
000,
000,
000,
000,
000,
000,
000,
000,
763,
430,
FE6,
FD4,
EC3,
FD4,
FD4,
FD3,
FD3,
FD3,
FD3,
FC3,
FC4,
FC4,
FD3,
FD3,
FD4,
FD4,
EC3,
FD4,
FD3,
FD3,
FD4,
FD4,
FC4,
C92,
DA3,
D93,
DA3,
D92,
FC4,
FD3,
FD4,
FD3,
FD4,
FD3,
FD4,
FD4,
FE6,
960,
FC5,
FD5,
FD5,
FD4,
FD5,
FD5,
FD4,
FD4,
FC4,
FC4,
EB3,
FD4,
FD4,
FD4,
FD3,
FD3,
FD3,
FD4,
FE7,
440,
775,
665,
852,
EB6,
DA4,
D93,
EA3,
DA4,
541,
654,
211,
111,
010,
000,
000,
000,
000,
000,
000,
000,
000,
000,
000,
000,
000,
000,
000,
000,
000,
000,
000,
000,
000,
000,
000,
000,
000,
000,
000,
000,
000,
000,
000,
000,
000,
000,
000,
000,
000,
000,
000,
000,
000,
000,
000,
000,
000,
000,
000,
000,
000,
000,
000,
000,
000,
000,
000,
000,
000,
000,
000,
000,
000,
000,
000,
000,
000,
000,
000,
000,
000,
000,
000,
000,
000,
000,
000,
000,
000,
000,
000,
000,
000,
000,
000,
000,
000,
000,
000,
000,
320,
DC8,
FD6,
FD4,
FD4,
FC3,
FD3,
FD3,
FD3,
FD3,
FD3,
FD3,
FC4,
FD4,
FD4,
FD3,
FD4,
FC3,
FD5,
A70,
FE5,
FD4,
FC3,
FD4,
FC4,
FD5,
EB3,
EB3,
EB4,
FD5,
FD4,
FD3,
FD3,
FD4,
FD3,
FC3,
FD3,
FD4,
FD5,
DB3,
A70,
DA3,
DA2,
DA3,
DA3,
EA3,
DA2,
DA2,
DA2,
D92,
EB3,
FD5,
FD4,
FD4,
FD3,
FD3,
FD3,
FD3,
FD4,
ED7,
341,
665,
653,
863,
EB6,
DA4,
EA4,
EB6,
753,
766,
221,
111,
111,
000,
000,
000,
000,
000,
000,
000,
000,
000,
000,
000,
000,
000,
000,
000,
000,
000,
000,
000,
000,
000,
000,
000,
000,
000,
000,
000,
000,
000,
000,
000,
000,
000,
000,
000,
000,
000,
000,
000,
000,
000,
000,
000,
000,
000,
000,
000,
000,
000,
000,
000,
000,
000,
000,
000,
000,
000,
000,
000,
000,
000,
000,
000,
000,
000,
000,
000,
000,
000,
000,
000,
000,
000,
000,
000,
000,
000,
000,
000,
000,
000,
000,
000,
000,
000,
000,
000,
443,
320,
EE7,
FD5,
FD4,
FD3,
FD3,
FD3,
FD3,
FD3,
FD4,
FD4,
FD4,
FD4,
FD4,
FD3,
FD3,
FD3,
FD4,
FD4,
A80,
FD5,
FD4,
FD4,
FD4,
FD4,
FC4,
FD4,
FD4,
FD4,
FC4,
FD4,
FD4,
FD4,
FD4,
FD4,
FD4,
FD4,
FC4,
FD4,
DB3,
860,
DA3,
DA4,
DA4,
DA4,
DA4,
DA4,
DA3,
CA2,
FD4,
FD4,
FD4,
FD3,
FD3,
FD3,
FD4,
FD3,
FD3,
FD6,
A95,
553,
544,
654,
863,
EB6,
D84,
B73,
C96,
521,
654,
112,
111,
111,
000,
000,
000,
000,
000,
000,
000,
000,
000,
000,
000,
000,
000,
000,
000,
000,
000,
000,
000,
000,
000,
000,
000,
896,
EEA,
000,
000,
000,
000,
000,
000,
000,
000,
000,
000,
000,
886,
884,
CC7,
000,
000,
000,
000,
000,
000,
000,
000,
000,
000,
110,
996,
AA6,
874,
100,
000,
000,
000,
000,
000,
000,
000,
000,
000,
000,
000,
000,
000,
000,
000,
000,
000,
000,
000,
000,
000,
000,
000,
000,
000,
000,
000,
000,
000,
000,
000,
000,
223,
332,
994,
881,
FE7,
FD6,
FD5,
FD4,
FD4,
FD4,
FD4,
FD4,
FD4,
FD3,
FD4,
FD3,
FD3,
FD4,
FD4,
EB3,
A70,
FD6,
FC4,
FD3,
FD3,
FD3,
FD4,
FD3,
FC3,
FD4,
FD4,
FD3,
FD4,
FC3,
FD3,
FD4,
FC4,
FD4,
FD3,
FD3,
FD4,
FE6,
B81,
B81,
A70,
A71,
A70,
960,
C92,
FD5,
FD4,
FD4,
FD3,
FD3,
FD3,
FD3,
FC3,
FD4,
FD3,
FD5,
CA4,
530,
665,
443,
653,
974,
953,
730,
831,
732,
543,
443,
111,
111,
111,
000,
000,
000,
000,
000,
000,
000,
000,
000,
000,
000,
000,
000,
000,
000,
000,
000,
000,
000,
000,
000,
331,
000,
EE8,
000,
000,
000,
000,
000,
000,
000,
000,
000,
000,
000,
000,
000,
982,
440,
000,
000,
000,
000,
000,
000,
000,
000,
000,
000,
000,
000,
CA6,
100,
000,
000,
000,
000,
000,
000,
000,
000,
000,
000,
000,
000,
000,
000,
000,
000,
000,
000,
000,
000,
000,
000,
000,
000,
000,
000,
000,
000,
000,
000,
000,
000,
111,
332,
443,
764,
430,
763,
BA5,
FE8,
FE6,
FD5,
FD4,
FD4,
FC3,
FC3,
FD4,
FD4,
FD5,
EB3,
DA2,
DA3,
DA4,
A71,
FD4,
FD3,
FD3,
FD3,
FD3,
FD4,
FD4,
FD4,
FD3,
FD3,
FD3,
FD3,
FC3,
FD3,
FD4,
FD3,
FD3,
FD3,
FD4,
FD4,
FD5,
FD4,
FD5,
FD5,
FD5,
FD5,
FD4,
FC3,
FD3,
FD3,
FD4,
FD4,
FC3,
FD3,
FD3,
FD4,
FD4,
FD5,
DA4,
A84,
431,
554,
443,
665,
521,
842,
831,
842,
531,
755,
332,
111,
111,
111,
000,
000,
000,
000,
000,
000,
000,
000,
000,
000,
000,
000,
000,
000,
000,
000,
000,
000,
000,
000,
000,
000,
EE8,
000,
000,
000,
000,
000,
000,
000,
000,
000,
000,
000,
000,
000,
FEA,
100,
000,
000,
000,
000,
000,
000,
000,
000,
000,
000,
673,
9A5,
772,
100,
000,
000,
000,
000,
000,
000,
000,
000,
000,
000,
000,
000,
000,
000,
000,
000,
000,
000,
000,
000,
000,
000,
000,
000,
000,
000,
000,
000,
000,
000,
000,
000,
111,
111,
111,
212,
333,
443,
553,
330,
761,
872,
CA4,
FD6,
FE6,
FD6,
EC5,
DB5,
DA4,
DA4,
DA5,
DA5,
DA5,
A71,
FD5,
FD3,
FD3,
FD3,
FD3,
FD4,
FD4,
FD3,
FD3,
FD3,
FD3,
FD3,
FD3,
FD4,
FD3,
FD3,
FD3,
FD3,
FD3,
FD3,
FD3,
FD3,
FD3,
FD3,
FD3,
FD3,
FD3,
FD3,
FD3,
FC3,
FD4,
FD4,
FD3,
FD3,
FD3,
FD3,
FD4,
FD5,
EB4,
961,
752,
653,
665,
988,
521,
842,
842,
832,
843,
521,
765,
222,
111,
111,
000,
000,
000,
000,
000,
000,
000,
000,
000,
000,
000,
000,
000,
000,
000,
000,
000,
000,
000,
000,
000,
000,
EE8,
000,
000,
000,
000,
000,
000,
000,
000,
000,
000,
000,
000,
EE9,
100,
000,
000,
000,
000,
000,
000,
000,
000,
000,
000,
000,
000,
000,
DD9,
000,
000,
000,
000,
000,
000,
000,
000,
000,
000,
000,
000,
000,
000,
000,
000,
000,
000,
000,
000,
000,
000,
000,
000,
000,
000,
000,
000,
000,
000,
000,
000,
000,
111,
111,
111,
111,
111,
111,
221,
332,
442,
553,
552,
431,
431,
652,
763,
764,
873,
973,
974,
A95,
B96,
CA5,
A81,
FD5,
FD3,
FD3,
FD3,
FD3,
FD4,
FD4,
FD3,
FD3,
FD3,
FD3,
FD3,
FD3,
FD3,
FD3,
FD3,
FD3,
FD3,
FD3,
FD3,
FD3,
FD3,
FD3,
FD3,
FD3,
FD3,
FD3,
FD3,
FD3,
FD3,
FD3,
FD3,
FD3,
FD3,
FD3,
FD4,
FC4,
FD6,
850,
972,
863,
642,
421,
842,
841,
832,
832,
831,
843,
421,
444,
111,
011,
111,
000,
000,
000,
000,
000,
000,
000,
000,
000,
000,
000,
000,
000,
000,
000,
000,
111,
000,
000,
110,
885,
EE9,
883,
000,
000,
000,
000,
000,
000,
000,
000,
000,
000,
DD9,
BB5,
984,
552,
000,
000,
000,
000,
000,
000,
000,
000,
000,
221,
995,
AA6,
653,
000,
000,
000,
000,
000,
000,
000,
000,
000,
000,
000,
000,
000,
000,
000,
000,
000,
000,
000,
000,
000,
000,
000,
000,
000,
000,
000,
000,
000,
000,
000,
000,
000,
111,
111,
111,
111,
111,
001,
111,
111,
111,
112,
222,
222,
333,
433,
444,
554,
653,
653,
654,
542,
542,
763,
760,
FD6,
FD4,
FD3,
FD3,
FD3,
FD4,
FD4,
FD3,
FD3,
FD3,
FD3,
FD3,
FD3,
FD3,
FD3,
FD3,
FD3,
FD3,
FD3,
FD3,
FD3,
FD3,
FD3,
FD3,
FD3,
FD3,
FD3,
FD3,
FD3,
FD3,
FD3,
FD3,
FD3,
FD3,
FD3,
FD4,
FD4,
FD5,
850,
EB4,
FE8,
520,
843,
841,
842,
842,
842,
842,
632,
422,
322,
111,
111,
111,
110,
000,
000,
000,
000,
000,
000,
000,
000,
000,
000,
000,
000,
000,
111,
111,
111,
000,
000,
000,
000,
000,
000,
000,
000,
000,
000,
000,
000,
000,
000,
000,
000,
000,
000,
000,
000,
000,
000,
000,
000,
000,
000,
000,
000,
000,
000,
000,
000,
000,
000,
000,
000,
000,
000,
000,
000,
000,
000,
000,
000,
000,
000,
000,
000,
000,
000,
000,
000,
000,
000,
000,
000,
000,
000,
000,
000,
000,
000,
000,
000,
000,
000,
111,
111,
111,
111,
111,
111,
111,
111,
111,
111,
000,
111,
111,
111,
111,
111,
211,
221,
221,
211,
321,
542,
540,
FE8,
FD4,
FD3,
FD3,
FD3,
FD4,
FD3,
FD3,
FD3,
FD3,
FD3,
FD3,
FD3,
FD3,
FD3,
FD3,
FD3,
FD3,
FD3,
FD3,
FD3,
FD3,
FD3,
FD3,
FD3,
FD4,
FD4,
FD3,
FD3,
FD3,
FD3,
FD3,
FD3,
FD3,
FD3,
FD4,
FD3,
FD4,
FD4,
FD4,
FD5,
A72,
741,
831,
942,
842,
521,
432,
655,
555,
222,
111,
111,
111,
111,
111,
000,
000,
000,
000,
000,
000,
000,
000,
000,
000,
000,
111,
111,
111,
111,
000,
000,
000,
000,
000,
000,
000,
000,
000,
000,
000,
000,
000,
000,
000,
000,
000,
000,
000,
000,
000,
000,
000,
000,
000,
000,
000,
000,
000,
000,
000,
000,
000,
000,
000,
000,
000,
000,
000,
000,
000,
000,
000,
000,
000,
000,
000,
000,
000,
000,
000,
000,
000,
000,
000,
000,
000,
000,
000,
000,
000,
000,
000,
000,
000,
000,
111,
111,
111,
111,
111,
111,
111,
111,
111,
111,
111,
111,
110,
111,
111,
111,
111,
001,
011,
111,
100,
331,
430,
FD8,
FD5,
FD3,
FD4,
FD4,
FD3,
FD3,
FD3,
FD3,
FD3,
FD3,
FD3,
FD3,
FD3,
FD3,
FD3,
FD3,
FD3,
FD3,
FD3,
FD3,
FD3,
FD3,
FD3,
FD3,
FD4,
FD4,
FD3,
FD3,
FD3,
FD3,
FD3,
FD3,
FD4,
FD3,
FD3,
FD3,
FD3,
FD3,
FD3,
FD4,
FD7,
520,
731,
521,
643,
765,
444,
222,
112,
111,
111,
111,
111,
111,
111,
111,
000,
000,
000,
000,
000,
000,
000,
000,
000,
111,
111,
111,
111,
111,
000,
000,
000,
000,
000,
000,
000,
000,
000,
000,
000,
000,
000,
000,
000,
000,
000,
000,
000,
000,
000,
000,
000,
000,
000,
000,
000,
000,
000,
000,
000,
000,
000,
000,
000,
000,
000,
000,
000,
000,
000,
000,
000,
000,
000,
000,
000,
000,
000,
000,
000,
000,
000,
000,
000,
000,
000,
000,
000,
000,
000,
000,
000,
000,
000,
000,
111,
111,
111,
111,
111,
111,
111,
111,
111,
111,
111,
111,
111,
111,
111,
111,
011,
011,
111,
111,
000,
321,
441,
DC7,
FD5,
FD3,
FD3,
FD4,
FD3,
FD3,
FD3,
FD3,
FD3,
FD3,
FD3,
FD3,
FD3,
FD3,
FD3,
FD3,
FD3,
FD3,
FD3,
FD3,
FD3,
FD3,
FD3,
FD3,
FD4,
FD4,
FD4,
FD4,
FD4,
FD4,
FD4,
FD4,
FD4,
FC3,
FD4,
FD4,
FD3,
FD3,
FD3,
FD4,
FD6,
540,
764,
766,
333,
111,
111,
111,
111,
111,
101,
111,
111,
110,
111,
111,
000,
000,
000,
000,
000,
000,
000,
111,
111,
111,
111,
111,
111,
111,
000,
000,
000,
000,
000,
000,
000,
000,
000,
000,
000,
000,
000,
000,
000,
000,
000,
000,
000,
000,
000,
000,
000,
000,
000,
000,
000,
000,
000,
000,
000,
000,
000,
000,
000,
000,
000,
000,
000,
000,
000,
000,
000,
000,
000,
000,
000,
000,
000,
000,
000,
000,
000,
000,
000,
000,
000,
000,
000,
000,
000,
000,
000,
000,
000,
000,
111,
111,
111,
111,
111,
111,
111,
111,
111,
111,
111,
111,
111,
111,
111,
111,
111,
111,
011,
011,
111,
221,
653,
CA6,
FD5,
FD3,
FD3,
FD3,
FD3,
FD3,
FD3,
FD3,
FD3,
FD3,
FD3,
FD3,
FD3,
FD3,
FD3,
FD3,
FD3,
FD3,
FD3,
FD3,
FD3,
FD3,
FD3,
FD3,
FD3,
FD4,
FD4,
FD4,
FD4,
FD4,
FD4,
FD4,
FD4,
FD4,
FD3,
FD3,
FD3,
FD4,
FD3,
FD4,
FD5,
871,
654,
545,
112,
011,
111,
111,
100,
111,
111,
111,
111,
111,
010,
111,
111,
000,
000,
000,
000,
000,
000,
111,
111,
111,
111,
111,
111,
111,
000,
000,
000,
553,
000,
000,
000,
000,
000,
000,
000,
000,
000,
000,
000,
000,
000,
000,
000,
000,
000,
552,
000,
000,
000,
000,
000,
000,
000,
000,
000,
000,
000,
000,
100,
552,
000,
000,
000,
000,
000,
000,
000,
000,
000,
000,
000,
000,
000,
000,
000,
000,
000,
000,
000,
000,
000,
000,
000,
000,
000,
000,
000,
000,
000,
000,
111,
111,
111,
111,
111,
111,
111,
111,
111,
111,
111,
111,
111,
111,
111,
110,
111,
000,
111,
110,
110,
221,
542,
BA5,
FD5,
FD3,
FD3,
FD3,
FD3,
FD3,
FD3,
FD3,
FD3,
FD3,
FD3,
FD3,
FD3,
FD3,
FD3,
FD3,
FD3,
FD3,
FD3,
FD3,
FD3,
FD3,
FD3,
FD3,
FD3,
FD3,
FD3,
FD3,
FD3,
FD3,
FD3,
FD3,
FD3,
FD3,
FD4,
FD3,
FC3,
FD4,
FC3,
FD4,
FD5,
C94,
420,
655,
333,
122,
111,
111,
111,
111,
111,
111,
010,
111,
111,
111,
111,
111,
000,
000,
000,
000,
000,
000,
111,
111,
111,
111,
111,
111,
000,
000,
000,
BC5,
110,
000,
000,
000,
000,
000,
000,
000,
000,
000,
000,
000,
000,
000,
000,
000,
000,
BB5,
110,
000,
000,
000,
000,
000,
000,
000,
100,
000,
100,
000,
210,
AA4,
000,
000,
000,
000,
000,
000,
000,
000,
000,
000,
000,
000,
000,
000,
000,
000,
000,
000,
000,
000,
000,
000,
000,
000,
000,
000,
000,
000,
000,
000,
111,
111,
111,
111,
111,
111,
111,
111,
111,
111,
111,
111,
111,
111,
111,
111,
111,
111,
110,
111,
100,
221,
652,
BA5,
FD5,
FD3,
FD3,
FD3,
FD3,
FD3,
FD3,
FD3,
FD3,
FD3,
FD3,
FD3,
FD3,
FD3,
FD3,
FD3,
FD3,
FD3,
FD3,
FD3,
FD3,
FD3,
FD3,
FD3,
FD3,
FD3,
FD3,
FD3,
FD3,
FD3,
FD3,
FD3,
FD3,
FD3,
FD3,
FD3,
FD4,
FD4,
FD4,
FD4,
FC4,
EB5,
520,
533,
444,
232,
111,
111,
111,
111,
110,
111,
111,
111,
111,
111,
111,
111,
111,
000,
000,
000,
000,
000,
111,
111,
111,
111,
111,
111,
000,
000,
570,
DD6,
984,
874,
000,
894,
994,
DC8,
420,
100,
000,
000,
000,
000,
774,
884,
985,
000,
570,
DE6,
994,
874,
000,
452,
783,
CC7,
220,
210,
EC8,
A94,
EDA,
100,
AA3,
DC6,
985,
320,
000,
000,
000,
000,
000,
000,
000,
000,
000,
000,
000,
000,
000,
000,
000,
000,
000,
000,
000,
000,
000,
000,
000,
000,
000,
000,
000,
000,
111,
111,
111,
111,
111,
111,
111,
111,
111,
111,
111,
111,
111,
111,
111,
111,
111,
111,
111,
111,
110,
220,
552,
BA5,
FD5,
FD3,
FD3,
FD3,
FD3,
FD3,
FD4,
FD4,
FD4,
FD4,
FD4,
FD4,
FD4,
FD4,
FD4,
FD4,
FD4,
FD4,
FD4,
FD3,
FD3,
FD3,
FD3,
FD3,
FD3,
FD3,
FD3,
FD3,
FD3,
FD3,
FD3,
FD3,
FD3,
FD3,
FD3,
FD3,
FD3,
FD3,
FD4,
FD4,
EB3,
EB5,
630,
422,
221,
222,
212,
101,
111,
110,
110,
110,
111,
111,
111,
111,
111,
111,
111,
111,
000,
000,
000,
000,
000,
111,
111,
111,
111,
111,
000,
000,
000,
AB5,
100,
100,
110,
CC7,
000,
000,
DC8,
100,
000,
000,
000,
000,
552,
BB6,
661,
000,
010,
9B5,
100,
000,
000,
110,
782,
9A4,
662,
210,
BA5,
100,
542,
100,
210,
A94,
100,
000,
000,
000,
000,
000,
000,
000,
000,
000,
000,
000,
000,
000,
000,
000,
000,
000,
000,
000,
000,
000,
000,
000,
000,
000,
000,
000,
000,
000,
111,
111,
111,
111,
111,
111,
111,
111,
111,
111,
111,
111,
111,
111,
111,
111,
111,
111,
111,
111,
110,
221,
552,
CA5,
FD5,
FD3,
FD3,
FD3,
FD3,
FD3,
FD4,
FD4,
FD4,
FD4,
FD4,
FD4,
FD4,
FD4,
FD4,
FD4,
FD4,
FD4,
FD4,
FD3,
FD3,
FD3,
FD4,
FD4,
FD3,
FD3,
FD3,
FD3,
FD3,
FD3,
FD3,
FD4,
FD3,
FD3,
FD4,
FD3,
FD4,
FD4,
FC3,
FD4,
D92,
EB6,
531,
877,
443,
221,
111,
111,
111,
110,
110,
110,
111,
111,
111,
111,
111,
111,
111,
111,
111,
000,
000,
000,
000,
000,
111,
111,
111,
111,
000,
000,
000,
AA7,
210,
100,
100,
EE9,
000,
230,
A95,
100,
000,
000,
000,
000,
000,
000,
873,
661,
010,
AB7,
110,
100,
000,
EEA,
010,
782,
662,
110,
B96,
100,
000,
000,
210,
CB8,
000,
000,
000,
000,
000,
000,
000,
000,
000,
000,
000,
000,
000,
000,
000,
000,
000,
000,
000,
000,
000,
000,
000,
000,
000,
000,
000,
000,
000,
000,
111,
111,
111,
111,
111,
111,
111,
111,
111,
111,
111,
111,
111,
111,
111,
111,
111,
111,
111,
111,
110,
221,
552,
CB6,
FD5,
FD4,
FD3,
FD3,
FD3,
FD3,
FD4,
FD3,
FD3,
FD3,
FD3,
FD4,
FD4,
FD3,
FD4,
FD3,
FD4,
FD3,
FD3,
FD3,
FD3,
FD3,
FD3,
FD3,
FC3,
FD3,
FD4,
FD4,
FD4,
FD4,
FD4,
FD3,
FD3,
FD3,
FD3,
FD3,
FD4,
FD4,
FD5,
EA3,
DA2,
EB6,
543,
334,
111,
110,
111,
011,
110,
110,
111,
111,
111,
111,
111,
111,
111,
111,
111,
111,
111,
000,
000,
000,
000,
000,
000,
111,
111,
111,
000,
000,
000,
010,
996,
874,
000,
010,
996,
885,
000,
000,
000,
000,
000,
000,
673,
995,
773,
000,
000,
000,
996,
874,
000,
331,
995,
551,
220,
100,
542,
000,
000,
000,
000,
552,
997,
220,
000,
000,
000,
000,
000,
000,
000,
000,
000,
000,
000,
000,
000,
000,
000,
000,
000,
000,
000,
000,
000,
000,
000,
000,
000,
000,
000,
000,
111,
111,
111,
111,
111,
111,
111,
111,
111,
111,
111,
111,
111,
111,
111,
111,
111,
111,
111,
111,
110,
221,
552,
BA5,
FD5,
FD4,
FD3,
FD3,
FD3,
FD3,
FD4,
FD4,
FD3,
FD3,
FD3,
FD3,
FD3,
FD3,
FD4,
FD4,
FD3,
FD3,
FD3,
FD3,
FD3,
FD3,
FD3,
FD3,
FD3,
FD4,
FD4,
FD4,
FD3,
FD3,
FD3,
FD3,
FD3,
FD3,
FD3,
FD4,
FC3,
FC4,
FC4,
D92,
EA3,
EB6,
432,
223,
111,
110,
111,
011,
111,
111,
111,
111,
111,
111,
111,
111,
111,
111,
111,
111,
111,
111,
000,
000,
000,
000,
000,
000,
111,
111,
000,
000,
000,
000,
000,
000,
000,
000,
000,
000,
000,
000,
000,
000,
000,
000,
000,
000,
000,
000,
000,
000,
000,
000,
000,
000,
000,
000,
000,
000,
000,
000,
000,
000,
000,
000,
000,
000,
000,
000,
000,
000,
000,
000,
000,
000,
000,
000,
000,
000,
000,
000,
000,
000,
000,
000,
000,
000,
000,
000,
000,
000,
000,
000,
000,
000,
111,
111,
111,
111,
111,
111,
111,
111,
111,
111,
111,
111,
111,
111,
111,
111,
111,
111,
111,
111,
110,
211,
653,
A94,
FD5,
FD3,
FD3,
FD3,
FD3,
FC3,
FD3,
FD4,
FD3,
FD3,
FD3,
FD3,
FD3,
FC3,
FC3,
FD3,
FD3,
FD3,
FD3,
FD3,
FD3,
FD3,
FD3,
FD3,
FD3,
FD3,
FD3,
FD4,
FD4,
FD3,
FD3,
FD3,
FD3,
FD3,
FD3,
FC3,
FD4,
FD5,
D92,
DA3,
DA3,
B84,
543,
223,
111,
100,
111,
111,
111,
111,
111,
111,
111,
111,
111,
111,
111,
111,
111,
111,
111,
111,
111,
000,
000,
000,
000,
000,
000,
111,
000,
000,
000,
000,
000,
000,
000,
000,
000,
000,
000,
000,
000,
000,
000,
000,
000,
000,
000,
000,
000,
000,
000,
000,
000,
000,
000,
000,
000,
000,
000,
000,
000,
000,
000,
000,
000,
000,
000,
000,
000,
000,
000,
000,
000,
000,
000,
000,
000,
000,
000,
000,
000,
000,
000,
000,
000,
000,
000,
000,
000,
000,
000,
000,
000,
000,
111,
111,
111,
111,
111,
111,
111,
111,
111,
111,
111,
111,
111,
111,
111,
111,
111,
111,
110,
111,
110,
111,
543,
873,
FD6,
FD3,
FD3,
FD3,
FD3,
FD3,
FD3,
FD3,
FD3,
FD3,
FD3,
FD3,
FD3,
FD3,
FD4,
FD4,
FD4,
FD4,
FD4,
FD4,
FD4,
FD4,
FD4,
FD4,
FD3,
FD3,
FD3,
FD3,
FD3,
FD3,
FD3,
FD3,
FD4,
FC3,
FC4,
FD5,
FC4,
C92,
EA4,
DA4,
EB5,
862,
654,
111,
100,
111,
111,
111,
111,
111,
111,
111,
111,
111,
111,
111,
111,
111,
111,
111,
111,
111,
111,
111,
000,
000,
000,
000,
000,
000,
000,
000,
000,
000,
000,
000,
000,
000,
000,
000,
000,
000,
000,
000,
000,
000,
000,
000,
000,
000,
000,
000,
000,
000,
000,
000,
000,
000,
000,
000,
000,
000,
000,
000,
000,
000,
000,
000,
000,
000,
000,
000,
000,
000,
000,
000,
000,
000,
000,
000,
000,
000,
000,
000,
000,
000,
000,
000,
000,
000,
000,
000,
000,
000,
000,
000,
111,
111,
111,
111,
111,
111,
111,
111,
111,
111,
111,
111,
111,
111,
111,
111,
111,
111,
111,
111,
011,
111,
333,
652,
FD6,
FD3,
FD3,
FD3,
FD3,
FD3,
FD3,
FD3,
FD3,
FD3,
FD3,
FD4,
FD4,
FD4,
FD4,
FD4,
FC4,
FC4,
FC4,
FC4,
FC4,
FD5,
FD5,
FD5,
FD4,
FD4,
FD4,
FD4,
FD4,
FD4,
FD4,
FD4,
FC4,
FD5,
FC4,
EA3,
D93,
EA3,
EA3,
DA4,
DB7,
541,
432,
111,
111,
111,
111,
111,
111,
111,
111,
110,
110,
110,
111,
111,
111,
111,
111,
111,
111,
111,
111,
111,
111,
000,
000,
000,
000,
000,
000,
000,
000,
000,
000,
000,
000,
000,
000,
000,
000,
000,
000,
000,
000,
000,
000,
000,
000,
000,
000,
000,
000,
000,
000,
000,
000,
000,
000,
000,
000,
000,
000,
000,
000,
000,
000,
000,
000,
000,
000,
000,
000,
000,
000,
000,
000,
000,
000,
000,
000,
000,
000,
000,
000,
000,
000,
000,
000,
000,
000,
000,
000,
000,
000,
000,
111,
111,
111,
111,
111,
111,
111,
111,
111,
111,
111,
111,
111,
111,
111,
111,
111,
111,
111,
111,
011,
111,
222,
441,
EC6,
ED4,
FD4,
FD3,
FD3,
FD3,
FD3,
FD3,
FD4,
FD4,
FD4,
FD5,
FC4,
FB3,
DA2,
DA2,
DA2,
DA3,
DA3,
CA3,
C93,
DA2,
DA2,
DA2,
DA3,
EB3,
EB3,
FC4,
FC4,
FC4,
FC4,
FC4,
EB3,
D93,
D93,
EA3,
D93,
EA3,
EA3,
DA5,
B96,
543,
221,
111,
110,
111,
111,
111,
111,
111,
110,
110,
110,
110,
111,
111,
111,
111,
111,
111,
111,
111,
111,
111,
111,
000,
000,
000,
000,
000,
000,
000,
000,
000,
000,
000,
000,
000,
000,
000,
000,
000,
000,
000,
000,
000,
000,
000,
000,
000,
000,
000,
000,
000,
000,
000,
000,
000,
000,
000,
000,
000,
000,
000,
000,
000,
000,
000,
000,
000,
000,
000,
000,
000,
000,
000,
000,
000,
000,
000,
000,
000,
000,
000,
000,
000,
000,
000,
000,
000,
000,
000,
000,
000,
000,
000,
111,
111,
111,
111,
111,
111,
111,
111,
111,
111,
111,
111,
111,
111,
111,
111,
111,
111,
111,
111,
111,
101,
211,
543,
540,
FE7,
FD4,
FD3,
FD3,
FD3,
FD3,
FD4,
FD4,
FC4,
FC5,
EA3,
D92,
EA3,
DA3,
DA3,
C92,
B82,
A83,
EB6,
DB5,
DA4,
DA4,
DA3,
DA3,
D93,
DA3,
D92,
DA3,
DA3,
D93,
DA3,
DA3,
EA3,
D93,
EA4,
EA4,
DA3,
EA3,
EB6,
652,
443,
111,
111,
111,
111,
111,
111,
111,
111,
111,
111,
111,
111,
111,
111,
111,
111,
111,
111,
111,
111,
111,
111,
111,
111,
000,
000,
000,
000,
000,
000,
000,
000,
000,
000,
000,
000,
000,
000,
000,
000,
000,
000,
000,
000,
000,
000,
000,
000,
000,
000,
000,
000,
000,
000,
000,
000,
000,
000,
000,
000,
000,
000,
000,
000,
000,
000,
000,
000,
000,
000,
000,
000,
000,
000,
000,
000,
000,
000,
000,
000,
000,
000,
000,
000,
000,
000,
000,
000,
000,
000,
000,
000,
000,
000,
111,
111,
111,
111,
111,
111,
111,
111,
111,
111,
111,
111,
111,
111,
111,
111,
111,
111,
111,
111,
111,
111,
111,
221,
553,
872,
FE7,
FD5,
FD4,
FD4,
FD4,
FD5,
FC4,
EA3,
D93,
D93,
EA4,
D94,
DA5,
DB5,
EB7,
A84,
863,
420,
751,
862,
CA5,
EB6,
DA5,
DA4,
D94,
DA4,
DA4,
D93,
EA4,
DA4,
EA3,
EA3,
EA4,
D93,
EA4,
DA4,
DA3,
B94,
543,
333,
111,
111,
111,
111,
111,
111,
111,
111,
111,
111,
111,
111,
111,
111,
111,
111,
111,
111,
111,
111,
111,
111,
111,
111,
111,
000,
000,
000,
000,
000,
000,
000,
000,
000,
000,
000,
000,
000,
000,
000,
000,
000,
000,
000,
000,
000,
000,
000,
000,
000,
000,
000,
000,
000,
000,
000,
000,
000,
000,
000,
000,
000,
000,
000,
000,
000,
000,
000,
000,
000,
000,
000,
000,
000,
000,
000,
000,
000,
000,
000,
000,
000,
000,
000,
000,
000,
000,
000,
000,
000,
000,
000,
000,
000,
111,
111,
111,
111,
111,
111,
111,
111,
111,
111,
111,
111,
111,
111,
111,
111,
111,
111,
111,
111,
111,
011,
011,
111,
222,
543,
873,
FD7,
EC4,
EB3,
EA3,
D93,
DA3,
DA3,
DA3,
DA3,
DB5,
EB7,
974,
753,
431,
654,
554,
543,
442,
654,
543,
542,
863,
DA7,
EB6,
DA4,
DA3,
DA3,
EA3,
EA3,
E93,
EA3,
EA3,
EA3,
EA4,
EA4,
DA4,
861,
553,
222,
111,
111,
111,
111,
111,
111,
111,
111,
111,
111,
111,
111,
111,
111,
111,
111,
111,
111,
111,
111,
111,
111,
111,
111,
111,
000,
000,
000,
000,
000,
000,
000,
000,
000,
000,
000,
000,
000,
000,
000,
000,
000,
000,
000,
000,
000,
000,
000,
000,
000,
000,
000,
000,
000,
000,
000,
000,
000,
000,
000,
000,
000,
000,
000,
000,
000,
000,
000,
000,
000,
000,
000,
000,
000,
000,
000,
000,
000,
000,
000,
000,
000,
000,
000,
000,
000,
000,
000,
000,
000,
000,
000,
000,
000,
111,
111,
111,
111,
111,
111,
111,
111,
111,
111,
111,
111,
111,
111,
111,
111,
111,
111,
111,
110,
011,
111,
011,
011,
111,
332,
553,
530,
B94,
EB5,
EA5,
EA5,
DA4,
EA4,
EA4,
DA4,
851,
541,
653,
544,
333,
222,
111,
111,
111,
122,
222,
443,
654,
531,
752,
962,
DA5,
EB6,
DA5,
DA5,
EA5,
DA5,
DA4,
DA4,
FB6,
B71,
A60,
DA6,
543,
222,
111,
111,
111,
111,
111,
111,
111,
111,
111,
111,
111,
111,
111,
111,
111,
111,
111,
111,
111,
111,
111,
111,
111,
111,
111,
111,
000,
000,
000,
000,
000,
000,
000,
000,
000,
000,
000,
000,
000,
000,
000,
000,
000,
000,
000,
000,
000,
000,
000,
000,
000,
000,
000,
000,
000,
000,
000,
000,
000,
000,
000,
000,
000,
000,
000,
000,
000,
000,
000,
000,
000,
000,
000,
000,
000,
000,
000,
000,
000,
000,
000,
000,
000,
000,
000,
000,
000,
000,
000,
000,
000,
000,
000,
000,
111,
111,
111,
111,
111,
111,
111,
111,
111,
111,
111,
111,
111,
111,
111,
111,
111,
110,
110,
110,
110,
111,
111,
111,
111,
110,
221,
443,
543,
542,
863,
973,
A72,
A71,
A71,
B84,
753,
654,
221,
211,
111,
001,
111,
111,
111,
001,
111,
111,
211,
322,
443,
654,
432,
542,
754,
864,
974,
974,
862,
972,
961,
D94,
EA4,
DA6,
432,
223,
111,
111,
111,
111,
111,
111,
111,
111,
111,
111,
111,
111,
111,
111,
111,
111,
111,
111,
111,
111,
111,
111,
111,
111,
111,
111,
111,
000,
000,
000,
000,
000,
000,
000,
000,
000,
000,
000,
000,
000,
000,
000,
000,
000,
000,
000,
000,
000,
000,
000,
000,
000,
000,
000,
000,
000,
000,
000,
000,
000,
000,
000,
000,
000,
000,
000,
000,
000,
000,
000,
000,
000,
000,
000,
000,
000,
000,
000,
000,
000,
000,
000,
000,
000,
000,
000,
000,
000,
000,
000,
000,
000,
000,
000,
111,
111,
111,
111,
111,
111,
111,
111,
111,
111,
111,
111,
111,
111,
111,
111,
111,
110,
110,
111,
111,
111,
111,
101,
111,
000,
111,
111,
222,
443,
876,
763,
EB6,
DA4,
DA4,
DB6,
432,
333,
101,
001,
011,
111,
111,
111,
111,
111,
111,
001,
111,
111,
111,
111,
223,
333,
443,
543,
553,
653,
986,
762,
EB6,
DA3,
DA3,
EB6,
432,
333,
111,
111,
111,
111,
111,
111,
111,
111,
111,
111,
111,
111,
111,
111,
111,
111,
111,
111,
111,
111,
111,
111,
111,
111,
111,
111,
111,
000,
000,
000,
000,
000,
000,
000,
000,
000,
000,
000,
000,
000,
000,
000,
000,
000,
000,
000,
000,
000,
000,
000,
000,
000,
000,
000,
000,
000,
000,
000,
000,
000,
000,
000,
000,
000,
000,
000,
000,
000,
000,
000,
000,
000,
000,
000,
000,
000,
000,
000,
000,
000,
000,
000,
000,
000,
000,
000,
000,
000,
000,
000,
000,
000,
000,
000,
111,
111,
111,
111,
111,
111,
111,
111,
111,
111,
111,
111,
111,
111,
111,
111,
111,
111,
111,
111,
111,
111,
111,
111,
111,
110,
110,
111,
010,
111,
443,
653,
DB5,
FD6,
DB4,
BA5,
554,
223,
101,
111,
111,
111,
010,
110,
110,
110,
111,
111,
111,
110,
101,
101,
111,
011,
111,
110,
110,
221,
543,
652,
EC5,
EB3,
EB3,
DB5,
542,
333,
111,
111,
111,
111,
111,
111,
111,
111,
111,
111,
111,
111,
111,
111,
111,
111,
111,
111,
111,
111,
111,
111,
111,
111,
111,
111,
111,
111,
000,
000,
000,
000,
000,
000,
000,
000,
000,
000,
000,
000,
000,
000,
000,
000,
000,
000,
000,
000,
000,
000,
000,
000,
000,
000,
000,
000,
000,
000,
000,
000,
000,
000,
000,
000,
000,
000,
000,
000,
000,
000,
000,
000,
000,
000,
000,
000,
000,
000,
000,
000,
000,
000,
000,
000,
000,
000,
000,
000,
000,
000,
000,
000,
000,
000,
111,
111,
111,
111,
111,
111,
111,
111,
111,
111,
111,
111,
111,
111,
111,
111,
111,
111,
111,
011,
011,
011,
111,
111,
111,
111,
111,
011,
111,
010,
333,
431,
CB5,
FE6,
B92,
BA5,
554,
122,
101,
111,
111,
011,
110,
110,
110,
111,
111,
111,
111,
110,
111,
111,
001,
011,
110,
010,
010,
110,
222,
431,
FD7,
FD5,
FD5,
FE8,
553,
333,
111,
110,
111,
111,
111,
111,
111,
111,
111,
111,
111,
111,
111,
111,
111,
111,
111,
111,
111,
111,
111,
111,
111,
111,
111,
111,
111,
111,
000,
000,
000,
000,
000,
000,
000,
000,
000,
000,
000,
000,
000,
000,
000,
000,
000,
000,
000,
000,
000,
000,
000,
000,
000,
000,
000,
000,
000,
000,
000,
000,
000,
000,
000,
000,
000,
000,
000,
000,
000,
000,
000,
000,
000,
000,
000,
000,
000,
000,
000,
000,
000,
000,
000,
000,
000,
000,
000,
000,
000,
000,
000,
000,
000,
000,
000,
000,
000,
000,
000,
111,
111,
111,
111,
111,
111,
111,
111,
111,
111,
111,
111,
111,
111,
011,
011,
011,
111,
111,
111,
111,
111,
111,
111,
110,
222,
553,
BA4,
DB4,
CA4,
984,
443,
111,
101,
111,
111,
111,
111,
111,
111,
111,
111,
111,
111,
111,
111,
111,
111,
111,
111,
111,
111,
010,
111,
654,
983,
DB4,
B91,
FE7,
774,
443,
110,
110,
110,
111,
111,
111,
111,
111,
111,
111,
111,
111,
111,
111,
111,
111,
111,
111,
111,
111,
111,
111,
111,
111,
111,
111,
111,
111,
000,
000,
000,
000,
000,
000,
000,
000,
000,
000,
000,
000,
000,
000,
000,
000,
000,
000,
000,
000,
000,
000,
000,
000,
000,
000,
000,
000,
000,
000,
000,
000,
000,
000,
000,
000,
000,
000,
000,
000,
000,
000,
000,
000,
000,
000,
000,
000,
000,
000,
000,
000,
000,
000,
000,
000,
000,
000,
000,
000,
000,
000,
000,
000,
000,
000,
000,
000,
000,
000,
000,
111,
111,
111,
111,
111,
111,
111,
111,
111,
111,
111,
111,
111,
111,
111,
011,
011,
111,
111,
111,
111,
111,
111,
111,
111,
111,
432,
662,
983,
B95,
763,
332,
111,
100,
111,
111,
111,
111,
111,
111,
111,
111,
111,
111,
111,
111,
111,
111,
111,
111,
111,
010,
111,
111,
433,
541,
CB5,
FD6,
A92,
885,
443,
110,
110,
111,
111,
111,
111,
111,
111,
111,
111,
111,
111,
111,
111,
111,
111,
111,
111,
111,
111,
111,
111,
111,
111,
111,
111,
111,
111,
000,
000,
000,
000,
000,
000,
000,
000,
000,
000,
000,
000,
000,
000,
000,
000,
000,
000,
000,
000,
000,
000,
000,
000,
000,
000,
000,
000,
000,
000,
000,
000,
000,
000,
000,
000,
000,
000,
000,
000,
000,
000,
000,
000,
000,
000,
000,
000,
000,
000,
000,
000,
000,
000,
000,
000,
000,
000,
000,
000,
000,
000,
000,
000,
000,
000,
000,
000,
000,
000,
000,
111,
111,
111,
111,
111,
111,
111,
111,
111,
111,
111,
111,
111,
111,
111,
111,
111,
111,
111,
111,
111,
111,
111,
111,
111,
111,
221,
442,
553,
321,
433,
121,
110,
100,
111,
111,
111,
111,
111,
111,
111,
111,
111,
111,
110,
111,
111,
111,
111,
111,
111,
111,
110,
111,
221,
543,
BA6,
BA3,
BA4,
AA7,
443,
110,
110,
110,
111,
111,
101,
111,
111,
111,
111,
111,
111,
111,
111,
111,
111,
111,
111,
111,
111,
111,
111,
111,
111,
111,
111,
111,
111,
000,
000,
000,
000,
000,
000,
000,
000,
000,
000,
000,
000,
000,
000,
000,
000,
000,
000,
000,
000,
000,
000,
000,
000,
000,
000,
000,
000,
000,
000,
000,
000,
000,
000,
000,
000,
000,
000,
000,
000,
000,
000,
000,
000,
000,
000,
000,
000,
000,
000,
000,
000,
000,
000,
000,
000,
000,
000,
000,
000,
000,
000,
000,
000,
000,
000,
000,
000,
000,
000,
000,
111,
111,
111,
111,
111,
111,
111,
111,
111,
111,
111,
111,
111,
111,
111,
111,
111,
111,
111,
111,
111,
111,
111,
111,
111,
011,
111,
111,
222,
323,
212,
111,
111,
111,
111,
111,
111,
110,
111,
111,
111,
111,
111,
111,
111,
111,
111,
111,
111,
111,
111,
111,
010,
011,
111,
432,
441,
661,
EE9,
110,
443,
111,
110,
111,
111,
111,
111,
111,
111,
111,
111,
111,
111,
111,
111,
111,
111,
111,
111,
111,
111,
111,
111,
111,
111,
111,
111,
111,
111,
000,
000,
000,
000,
000,
000,
000,
000,
000,
000,
000,
000,
000,
000,
000,
000,
000,
000,
000,
000,
000,
000,
000,
000,
000,
000,
000,
000,
000,
000,
000,
000,
000,
000,
000,
000,
000,
000,
000,
000,
000,
000,
000,
000,
000,
000,
000,
000,
000,
000,
000,
000,
000,
000,
000,
000,
000,
000,
000,
000,
000,
000,
000,
000,
000,
000,
000,
000,
000,
000,
000,
000,
111,
111,
111,
111,
111,
111,
111,
111,
111,
111,
111,
111,
111,
111,
111,
111,
111,
111,
111,
111,
111,
110,
110,
111,
111,
111,
011,
111,
101,
111,
110,
110,
111,
111,
111,
111,
110,
110,
111,
111,
111,
111,
111,
111,
111,
111,
111,
111,
111,
111,
111,
111,
011,
111,
111,
332,
554,
442,
332,
222,
110,
110,
110,
111,
111,
111,
111,
111,
111,
111,
111,
111,
111,
111,
111,
111,
111,
111,
111,
111,
111,
111,
111,
111,
111,
111,
111,
111,
000,
000,
000,
000,
000,
000,
000,
000,
000,
000,
000,
000,
000,
000,
000,
000,
000,
000,
000,
000,
000,
000,
000,
000,
000,
000,
000,
000,
000,
000,
000,
000,
000,
000,
000,
000,
000,
000,
000,
000,
000,
000,
000,
000,
000,
000,
000,
000,
000,
000,
000,
000,
000,
000,
000,
000,
000,
000,
000,
000,
000,
000,
000,
000,
000,
000,
000,
000,
000,
000,
000,
000,
111,
111,
111,
111,
111,
111,
111,
111,
111,
111,
111,
111,
111,
111,
111,
111,
111,
111,
111,
111,
111,
110,
110,
111,
111,
111,
111,
111,
111,
111,
111,
110,
111,
111,
111,
111,
110,
110,
111,
111,
111,
111,
111,
111,
111,
111,
111,
111,
111,
111,
111,
111,
111,
111,
111,
111,
122,
222,
222,
111,
111,
111,
111,
110,
111,
111,
111,
111,
111,
111,
111,
111,
111,
111,
111,
111,
111,
111,
111,
111,
111,
111,
111,
111,
111,
111,
111,
111,
000,
000,
000,
000,
000,
000,
000,
000,
000,
000,
000,
000,
000,
000,
000,
000,
000,
000,
000,
000,
000,
000,
000,
000,
000,
000,
000,
000,
000,
000,
000,
000,
000,
000,
000,
000,
000,
000,
000,
000,
000,
000,
000,
000,
000,
000,
000,
000,
000,
000,
000,
000,
000,
000,
000,
000,
000,
000,
000,
000,
000,
000,
000,
000,
000,
000,
000,
000,
000,
000,
000,
000,
111,
111,
111,
111,
111,
111,
111,
111,
111,
111,
111,
111,
111,
111,
111,
111,
111,
111,
111,
111,
111,
111,
111,
111,
111,
111,
111,
101,
111,
110,
111,
011,
111,
111,
111,
111,
111,
111,
111,
111,
111,
111,
111,
111,
111,
111,
111,
111,
111,
111,
111,
111,
111,
111,
111,
111,
001,
111,
111,
111,
111,
101,
111,
111,
110,
111,
111,
111,
111,
111,
111,
111,
111,
111,
111,
111,
111,
111,
111,
111,
111,
111,
111,
111,
111,
111,
111,
111,
000,
000,
000,
000,
000,
000,
000,
000,
000,
000,
000,
000,
000,
000,
000,
000,
000,
000,
000,
000,
000,
000,
000,
000,
000,
000,
000,
000,
000,
000,
000,
000,
000,
000,
000,
000,
000,
000,
000,
000,
000,
000,
000,
000,
000,
000,
000,
000,
000,
000,
000,
000,
000,
000,
000,
000,
000,
000,
000,
000,
000,
000,
000,
000,
000,
000,
000,
000,
000,
000,
000,
000,
111,
111,
111,
111,
111,
111,
111,
111,
111,
111,
111,
111,
111,
111,
111,
111,
110,
110,
110,
111,
111,
111,
111,
111,
111,
111,
111,
111,
110,
111,
111,
111,
111,
111,
111,
111,
111,
111,
111,
111,
111,
111,
111,
111,
111,
111,
111,
111,
111,
111,
110,
111,
111,
111,
111,
111,
111,
111,
111,
111,
111,
111,
111,
111,
111,
110,
111,
111,
111,
111,
111,
111,
111,
111,
111,
111,
111,
111,
111,
111,
111,
111,
111,
111,
111,
111,
111,
111,
000,
000,
000,
000,
000,
000,
000,
000,
000,
000,
000,
000,
000,
000,
000,
000,
000,
000,
000,
000,
000,
000,
000,
000,
000,
000,
000,
000,
000,
000,
000,
000,
000,
000,
000,
000,
000,
000,
000,
000,
000,
000,
000,
000,
000,
000,
000,
000,
000,
000,
000,
000,
000,
000,
000,
000,
000,
000,
000,
000,
000,
000,
000,
000,
000,
000,
000,
000,
000,
000,
000,
000,
111,
111,
111,
111,
111,
111,
111,
111,
111,
100,
111,
000,
001,
011,
010,
010,
110,
111,
110,
110,
111,
111,
111,
011,
111,
110,
011,
111,
111,
100,
111,
011,
111,
111,
111,
111,
111,
111,
111,
110,
111,
111,
111,
111,
111,
011,
111,
111,
000,
111,
111,
111,
111,
111,
111,
111,
111,
111,
111,
111,
111,
111,
011,
011,
111,
111,
111,
111,
111,
111,
000,
111,
111,
111,
111,
111,
111,
111,
111,
111,
111,
111,
111,
111,
111,
111,
111,
111,
000,
000,
000,
000,
000,
000,
000,
000,
000,
000,
000,
000,
000,
000,
000,
000,
000,
000,
000,
000,
000,
000,
000,
000,
000,
000,
000,
000,
000,
000,
000,
000,
000,
000,
000,
000,
000,
000,
000,
000,
000,
000,
000,
000,
000,
000,
000,
000,
000,
000,
000,
000,
000,
000,
000,
000,
000,
000,
000,
000,
000,
000,
000,
000,
000,
000,
000,
000,
000,
000,
000,
000,
111,
111,
111,
111,
111,
111,
111,
111,
221,
222,
222,
332,
333,
222,
221,
121,
110,
111,
111,
111,
111,
111,
011,
111,
010,
111,
111,
111,
110,
111,
111,
111,
111,
000,
111,
111,
111,
111,
101,
111,
111,
110,
111,
111,
111,
111,
011,
010,
111,
111,
000,
111,
111,
001,
111,
111,
111,
111,
111,
111,
111,
222,
222,
111,
111,
111,
111,
111,
111,
122,
222,
111,
111,
111,
111,
111,
111,
111,
111,
111,
111,
111,
111,
111,
111,
111,
111,
111,
000,
000,
000,
000,
000,
000,
000,
000,
000,
000,
000,
000,
000,
000,
000,
000,
000,
000,
000,
000,
000,
000,
000,
000,
000,
000,
000,
000,
000,
000,
000,
000,
000,
000,
000,
000,
000,
000,
000,
000,
000,
000,
000,
000,
000,
000,
000,
000,
000,
000,
000,
000,
000,
000,
000,
000,
000,
000,
000,
000,
000,
000,
000,
000,
000,
000,
000,
000,
000,
000,
000,
000,
111,
111,
111,
111,
111,
111,
111,
111,
333,
444,
443,
442,
332,
332,
443,
554,
333,
111,
100,
110,
111,
101,
111,
111,
000,
111,
011,
111,
111,
111,
110,
111,
111,
111,
111,
111,
011,
111,
111,
111,
000,
111,
111,
111,
111,
101,
110,
110,
010,
111,
111,
111,
001,
111,
111,
011,
111,
111,
111,
111,
222,
332,
222,
332,
111,
110,
101,
111,
223,
333,
343,
332,
111,
111,
111,
111,
111,
111,
111,
111,
111,
111,
111,
111,
111,
111,
111,
111,
000,
000,
000,
000,
000,
000,
000,
000,
000,
000,
000,
000,
000,
000,
000,
000,
000,
000,
000,
000,
000,
000,
000,
000,
000,
000,
000,
000,
000,
000,
000,
000,
000,
000,
000,
000,
000,
000,
000,
000,
000,
000,
000,
000,
000,
000,
000,
000,
000,
000,
000,
000,
000,
000,
000,
000,
000,
000,
000,
000,
000,
000,
000,
000,
000,
000,
000,
000,
000,
000,
000,
000,
111,
111,
111,
111,
111,
111,
111,
222,
555,
887,
BBA,
DDB,
CCB,
EEC,
DDB,
665,
444,
222,
111,
110,
111,
111,
000,
111,
111,
111,
111,
001,
111,
111,
010,
110,
111,
111,
111,
110,
011,
011,
011,
011,
111,
111,
111,
101,
101,
111,
110,
110,
111,
011,
101,
100,
001,
001,
111,
111,
111,
101,
101,
112,
333,
998,
DDC,
231,
332,
111,
111,
111,
222,
888,
AA9,
222,
332,
111,
111,
111,
111,
111,
111,
111,
111,
111,
111,
111,
111,
111,
111,
111,
000,
000,
000,
000,
000,
000,
000,
000,
000,
000,
000,
000,
000,
000,
000,
000,
000,
000,
000,
000,
000,
000,
000,
000,
000,
000,
000,
000,
000,
000,
000,
000,
000,
000,
000,
000,
000,
000,
000,
000,
000,
000,
000,
000,
000,
000,
000,
000,
000,
000,
000,
000,
000,
000,
000,
000,
000,
000,
000,
000,
000,
000,
000,
000,
000,
000,
000,
000,
000,
000,
000,
000,
111,
111,
111,
111,
111,
111,
111,
222,
555,
555,
FFD,
664,
655,
444,
665,
FFE,
776,
766,
332,
322,
222,
111,
111,
111,
222,
111,
111,
111,
111,
111,
111,
110,
111,
111,
111,
222,
111,
111,
111,
111,
111,
010,
111,
222,
333,
433,
443,
443,
333,
233,
222,
222,
233,
333,
211,
111,
111,
212,
322,
333,
776,
665,
EEC,
664,
221,
100,
100,
111,
555,
666,
DDB,
664,
221,
010,
111,
111,
111,
111,
111,
111,
111,
111,
111,
111,
111,
111,
111,
111,
000,
000,
000,
000,
000,
000,
000,
000,
000,
000,
000,
000,
000,
000,
000,
000,
000,
000,
000,
000,
000,
000,
000,
000,
000,
000,
000,
000,
000,
000,
000,
000,
000,
000,
000,
000,
000,
000,
000,
000,
000,
000,
000,
000,
000,
000,
000,
000,
000,
000,
000,
000,
000,
000,
000,
000,
000,
000,
000,
000,
000,
000,
000,
000,
000,
000,
000,
000,
000,
000,
000,
000,
111,
111,
111,
111,
111,
111,
111,
000,
444,
554,
FFC,
775,
555,
323,
776,
664,
FFD,
543,
543,
332,
333,
222,
333,
444,
543,
332,
222,
333,
443,
443,
111,
111,
111,
111,
443,
221,
343,
221,
110,
111,
000,
111,
343,
444,
333,
655,
665,
655,
443,
443,
433,
333,
332,
332,
322,
211,
222,
332,
432,
432,
554,
665,
EDB,
653,
221,
111,
111,
110,
555,
554,
CCA,
664,
221,
111,
111,
111,
111,
111,
111,
111,
111,
111,
111,
111,
111,
111,
111,
111,
000,
000,
000,
000,
000,
000,
000,
000,
000,
000,
000,
000,
000,
000,
000,
000,
000,
000,
000,
000,
000,
000,
000,
000,
000,
000,
000,
000,
000,
000,
000,
000,
000,
000,
000,
000,
000,
000,
000,
000,
000,
000,
000,
000,
000,
000,
000,
000,
000,
000,
000,
000,
000,
000,
000,
000,
000,
000,
000,
000,
000,
000,
000,
000,
000,
000,
000,
000,
000,
000,
000,
000,
111,
111,
111,
111,
111,
111,
111,
001,
333,
443,
FEB,
763,
433,
212,
665,
553,
FEC,
652,
884,
FFB,
554,
343,
221,
775,
886,
320,
443,
221,
875,
764,
222,
121,
111,
221,
653,
996,
664,
453,
111,
111,
112,
444,
442,
875,
998,
654,
544,
775,
EEB,
EDA,
554,
443,
DC9,
BB7,
443,
222,
222,
332,
CC8,
BA6,
775,
665,
DCA,
664,
221,
010,
100,
211,
655,
664,
CCA,
664,
221,
110,
111,
111,
111,
111,
111,
111,
111,
111,
111,
111,
111,
111,
111,
111,
000,
000,
000,
000,
000,
000,
000,
000,
000,
000,
000,
000,
000,
000,
000,
000,
000,
000,
000,
000,
000,
000,
000,
000,
000,
000,
000,
000,
000,
000,
000,
000,
000,
000,
000,
000,
000,
000,
000,
000,
000,
000,
000,
000,
000,
000,
000,
000,
000,
000,
000,
000,
000,
000,
000,
000,
000,
000,
000,
000,
000,
000,
000,
000,
000,
000,
000,
000,
000,
000,
000,
000,
111,
111,
111,
111,
111,
111,
111,
111,
333,
443,
FEA,
884,
775,
554,
665,
664,
DCA,
995,
661,
FFA,
564,
443,
665,
775,
EDB,
663,
554,
432,
DDB,
442,
332,
111,
111,
443,
441,
DD9,
CC9,
653,
221,
111,
323,
554,
985,
996,
664,
443,
333,
654,
430,
DDA,
554,
997,
772,
BB6,
665,
111,
121,
775,
883,
BA5,
BB8,
553,
EEB,
552,
222,
011,
111,
111,
554,
553,
DDA,
552,
221,
111,
111,
111,
111,
111,
111,
111,
111,
111,
111,
111,
111,
111,
111,
111,
000,
000,
000,
000,
000,
000,
000,
000,
000,
000,
000,
000,
000,
000,
000,
000,
000,
000,
000,
000,
000,
000,
000,
000,
000,
000,
000,
000,
000,
000,
000,
000,
000,
000,
000,
000,
000,
000,
000,
000,
000,
000,
000,
000,
000,
000,
000,
000,
000,
000,
000,
000,
000,
000,
000,
000,
000,
000,
000,
000,
000,
000,
000,
000,
000,
000,
000,
000,
000,
000,
000,
000,
111,
111,
111,
111,
111,
111,
111,
111,
333,
443,
FFA,
220,
552,
665,
886,
A98,
543,
775,
550,
FFA,
564,
333,
665,
664,
CB8,
985,
764,
654,
443,
443,
111,
001,
222,
655,
875,
540,
FE9,
651,
443,
211,
665,
542,
EEB,
552,
432,
110,
111,
211,
433,
110,
343,
997,
771,
AA4,
997,
333,
334,
BA8,
871,
BA4,
CB8,
875,
EDA,
552,
232,
001,
111,
111,
443,
886,
EEA,
552,
322,
101,
111,
111,
111,
111,
111,
111,
111,
111,
111,
111,
111,
111,
111,
111,
000,
000,
000,
000,
000,
000,
000,
000,
000,
000,
000,
000,
000,
000,
000,
000,
000,
000,
000,
000,
000,
000,
000,
000,
000,
000,
000,
000,
000,
000,
000,
000,
000,
000,
000,
000,
000,
000,
000,
000,
000,
000,
000,
000,
000,
000,
000,
000,
000,
000,
000,
000,
000,
000,
000,
000,
000,
000,
000,
000,
000,
000,
000,
000,
000,
000,
000,
000,
000,
000,
000,
000,
111,
111,
111,
111,
111,
111,
111,
001,
333,
553,
EE9,
873,
663,
331,
432,
443,
333,
553,
551,
FFA,
553,
433,
655,
654,
CB8,
CB7,
541,
653,
655,
212,
111,
111,
444,
432,
986,
CA7,
761,
BB6,
765,
433,
654,
885,
AA7,
774,
221,
101,
101,
111,
111,
111,
333,
210,
BA4,
ED7,
552,
776,
654,
542,
A93,
DC6,
986,
664,
CB8,
763,
221,
001,
101,
111,
664,
663,
BB7,
764,
221,
001,
111,
111,
111,
111,
111,
111,
111,
111,
111,
111,
111,
111,
111,
111,
000,
000,
000,
000,
000,
000,
000,
000,
000,
000,
000,
000,
000,
000,
000,
000,
000,
000,
000,
000,
000,
000,
000,
000,
000,
000,
000,
000,
000,
000,
000,
000,
000,
000,
000,
000,
000,
000,
000,
000,
000,
000,
000,
000,
000,
000,
000,
000,
000,
000,
000,
000,
000,
000,
000,
000,
000,
000,
000,
000,
000,
000,
000,
000,
000,
000,
000,
000,
000,
000,
000,
000,
111,
111,
111,
111,
111,
111,
111,
111,
333,
543,
ED9,
762,
553,
221,
221,
211,
101,
543,
551,
EEA,
554,
333,
665,
653,
CB7,
440,
CB5,
884,
665,
112,
001,
322,
653,
652,
975,
CB8,
873,
FEA,
431,
875,
430,
ED9,
995,
774,
210,
101,
111,
111,
011,
001,
122,
876,
873,
CB5,
CA6,
A95,
B97,
984,
CB5,
A83,
A87,
655,
DC9,
652,
221,
111,
111,
110,
553,
653,
CB8,
763,
221,
111,
111,
111,
111,
111,
111,
111,
111,
111,
111,
111,
111,
111,
111,
111,
000,
000,
000,
000,
000,
000,
000,
000,
000,
000,
000,
000,
000,
000,
000,
000,
000,
000,
000,
000,
000,
000,
000,
000,
000,
000,
000,
000,
000,
000,
000,
000,
000,
000,
000,
000,
000,
000,
000,
000,
000,
000,
000,
000,
000,
000,
000,
000,
000,
000,
000,
000,
000,
000,
000,
000,
000,
000,
000,
000,
000,
000,
000,
000,
000,
000,
000,
000,
000,
000,
000,
000,
111,
111,
111,
111,
111,
111,
111,
111,
333,
543,
ED9,
762,
332,
111,
101,
101,
111,
442,
551,
ED9,
554,
333,
654,
653,
FE9,
771,
771,
FEA,
442,
333,
111,
443,
430,
DC9,
986,
652,
541,
CC8,
DC8,
430,
A96,
874,
BB6,
874,
321,
101,
111,
111,
011,
111,
222,
887,
862,
B93,
BA5,
A85,
653,
DC9,
750,
A94,
CBA,
644,
CB7,
763,
221,
001,
111,
110,
664,
653,
BA7,
653,
221,
000,
111,
111,
111,
111,
111,
111,
111,
111,
111,
111,
111,
111,
111,
111,
000,
000,
000,
000,
000,
000,
000,
000,
000,
000,
000,
000,
000,
000,
000,
000,
000,
000,
000,
000,
000,
000,
000,
000,
000,
000,
000,
000,
000,
000,
000,
000,
000,
000,
000,
000,
000,
000,
000,
000,
000,
000,
000,
000,
000,
000,
000,
000,
000,
000,
000,
000,
000,
000,
000,
000,
000,
000,
000,
000,
000,
000,
000,
000,
000,
000,
000,
000,
000,
000,
000,
000,
111,
111,
111,
111,
111,
111,
111,
000,
333,
553,
ED8,
762,
432,
011,
111,
111,
101,
543,
650,
ED9,
554,
433,
665,
653,
A96,
A95,
874,
996,
885,
664,
332,
776,
652,
974,
764,
CB9,
775,
663,
FD9,
761,
986,
653,
FE8,
650,
664,
112,
111,
111,
122,
233,
111,
886,
761,
A94,
986,
443,
544,
986,
761,
A94,
A98,
544,
EC8,
762,
544,
212,
111,
332,
986,
652,
996,
654,
110,
111,
111,
111,
111,
111,
111,
111,
111,
111,
111,
111,
111,
111,
111,
111,
000,
000,
000,
000,
000,
000,
000,
000,
000,
000,
000,
000,
000,
000,
000,
000,
000,
000,
000,
000,
000,
000,
000,
000,
000,
000,
000,
000,
000,
000,
000,
000,
000,
000,
000,
000,
000,
000,
000,
000,
000,
000,
000,
000,
000,
000,
000,
000,
000,
000,
000,
000,
000,
000,
000,
000,
000,
000,
000,
000,
000,
000,
000,
000,
000,
000,
000,
000,
000,
000,
000,
000,
111,
111,
111,
111,
111,
111,
111,
111,
444,
543,
DC8,
763,
543,
011,
111,
111,
101,
543,
651,
DC8,
665,
544,
665,
653,
A96,
874,
654,
432,
EDA,
430,
776,
543,
A97,
763,
765,
331,
776,
775,
B95,
983,
997,
654,
CA6,
CB6,
542,
665,
443,
333,
554,
333,
333,
997,
751,
A84,
876,
112,
112,
876,
751,
A84,
987,
544,
DC8,
863,
654,
766,
766,
876,
320,
DC9,
543,
443,
110,
110,
111,
111,
111,
111,
111,
111,
111,
111,
111,
111,
111,
111,
111,
111,
000,
000,
000,
000,
000,
000,
000,
000,
000,
000,
000,
000,
000,
000,
000,
000,
000,
000,
000,
000,
000,
000,
000,
000,
000,
000,
000,
000,
000,
000,
000,
000,
000,
000,
000,
000,
000,
000,
000,
000,
000,
000,
000,
000,
000,
000,
000,
000,
000,
000,
000,
000,
000,
000,
000,
000,
000,
000,
000,
000,
000,
000,
000,
000,
000,
000,
000,
000,
000,
000,
000,
000,
111,
111,
111,
111,
111,
111,
000,
111,
444,
442,
DC8,
974,
443,
111,
110,
110,
111,
443,
541,
ED9,
654,
332,
654,
653,
DC9,
431,
322,
554,
541,
CB9,
654,
543,
CB9,
542,
321,
110,
121,
665,
652,
ED9,
442,
665,
552,
985,
DB9,
642,
542,
542,
543,
432,
444,
543,
974,
CB7,
443,
122,
222,
443,
984,
CA7,
543,
666,
442,
DB9,
B96,
641,
642,
652,
BB8,
653,
554,
111,
110,
111,
111,
111,
111,
111,
111,
111,
111,
111,
111,
111,
111,
111,
111,
111,
000,
000,
000,
000,
000,
000,
000,
000,
000,
000,
000,
000,
000,
000,
000,
000,
000,
000,
000,
000,
000,
000,
000,
000,
000,
000,
000,
000,
000,
000,
000,
000,
000,
000,
000,
000,
000,
000,
000,
000,
000,
000,
000,
000,
000,
000,
000,
000,
000,
000,
000,
000,
000,
000,
000,
000,
000,
000,
000,
000,
000,
000,
000,
000,
000,
000,
000,
000,
000,
000,
000,
000,
111,
111,
111,
111,
111,
110,
111,
111,
111,
443,
652,
653,
211,
111,
010,
111,
111,
221,
432,
542,
654,
332,
210,
543,
542,
321,
222,
221,
543,
321,
543,
443,
432,
442,
221,
110,
111,
222,
542,
542,
443,
222,
432,
654,
541,
753,
654,
654,
332,
443,
332,
221,
542,
653,
443,
222,
121,
221,
541,
652,
332,
222,
443,
542,
652,
873,
763,
763,
542,
553,
222,
111,
110,
110,
111,
111,
111,
111,
111,
111,
111,
111,
111,
111,
111,
111,
111,
111,
000,
000,
000,
000,
000,
000,
000,
000,
000,
000,
000,
000,
000,
000,
000,
000,
000,
000,
000,
000,
000,
000,
000,
000,
000,
000,
000,
000,
000,
000,
000,
000,
000,
000,
000,
000,
000,
000,
000,
000,
000,
000,
000,
000,
000,
000,
000,
000,
000,
000,
000,
000,
000,
000,
000,
000,
000,
000,
000,
000,
000,
000,
000,
000,
000,
000,
000,
000,
000,
000,
000,
000,
111,
111,
111,
111,
111,
111,
111,
111,
111,
222,
332,
332,
221,
111,
111,
111,
111,
111,
222,
332,
332,
222,
222,
322,
322,
221,
111,
111,
111,
221,
322,
332,
322,
221,
111,
111,
111,
111,
322,
332,
222,
111,
111,
221,
322,
432,
433,
332,
222,
221,
111,
221,
332,
332,
222,
111,
111,
221,
332,
322,
221,
111,
111,
221,
432,
443,
443,
433,
322,
111,
111,
111,
111,
111,
111,
111,
111,
111,
111,
111,
111,
111,
111,
111,
111,
111,
111,
111,
000,
000,
000,
000,
000,
000,
000,
000,
000,
000,
000,
000,
000,
000,
000,
000,
000,
000,
000,
000,
000,
000,
000,
000,
000,
000,
000,
000,
000,
000,
000,
000,
000,
000,
000,
000,
000,
000,
000,
000,
000,
000,
000,
000,
000,
000,
000,
000,
000,
000,
000,
000,
000,
000,
000,
000,
000,
000,
000,
000,
000,
000,
000,
000,
000,
000,
000,
000,
000,
000,
000,
000,
111,
111,
111,
111,
111,
111,
111,
111,
111,
111,
111,
111,
111,
111,
111,
111,
111,
111,
111,
111,
111,
111,
111,
111,
111,
111,
111,
111,
111,
111,
111,
111,
111,
111,
111,
111,
111,
111,
111,
111,
111,
111,
111,
111,
111,
111,
111,
111,
111,
111,
111,
111,
111,
111,
111,
111,
111,
111,
000,
111,
111,
111,
111,
111,
111,
111,
111,
111,
111,
111,
111,
111,
111,
111,
111,
111,
111,
111,
111,
111,
111,
111,
111,
111,
111,
111,
111,
111,
000,
000,
000,
000,
000,
000,
000,
000,
000,
000,
000,
000,
000,
000,
000,
000,
000,
000,
000,
000,
000,
000,
000,
000,
000,
000,
000,
000,
000,
000,
000,
000,
000,
000,
000,
000,
000,
000,
000,
000,
000,
000,
000,
000,
000,
000,
000,
000,
000,
000,
000,
000,
000,
000,
000,
000,
000,
000,
000,
000,
000,
000,
000,
000,
000,
000,
000,
000,
000,
000,
000,
000,
000,
111,
111,
111,
111,
111,
111,
111,
111,
000,
111,
111,
111,
111,
111,
111,
111,
111,
111,
111,
111,
111,
111,
111,
111,
111,
111,
111,
111,
111,
111,
111,
111,
111,
111,
111,
111,
111,
111,
111,
111,
111,
111,
111,
111,
111,
111,
111,
111,
111,
111,
111,
111,
111,
111,
111,
111,
111,
111,
111,
111,
111,
111,
111,
111,
111,
111,
111,
111,
111,
111,
111,
111,
111,
111,
111,
111,
111,
111,
111,
111,
111,
111,
111,
111,
111,
111,
111,
000,
000,
000,
000,
000,
000,
000,
000,
000,
000,
000,
000,
000,
000,
000,
000,
000,
000,
000,
000,
000,
000,
000,
000,
000,
000,
000,
000,
000,
000,
000,
000,
000,
000,
000,
000,
000,
000,
000,
000,
000,
000,
000,
000,
000,
000,
000,
000,
000,
000,
000,
000,
000,
000,
000,
000,
000,
000,
000,
000,
000,
000,
000,
000,
000,
000,
000,
000,
000,
000,
000,
000,
000,
111,
111,
111,
111,
111,
111,
111,
111,
111,
111,
111,
111,
111,
111,
111,
111,
111,
111,
111,
111,
111,
111,
111,
111,
111,
111,
111,
111,
111,
111,
111,
111,
111,
111,
111,
111,
111,
111,
111,
111,
111,
111,
111,
111,
111,
111,
111,
111,
111,
111,
111,
111,
111,
111,
111,
111,
111,
111,
111,
111,
111,
111,
111,
111,
111,
111,
111,
111,
111,
111,
111,
111,
111,
111,
111,
111,
111,
111,
111,
111,
111,
111,
111,
111,
111,
111,
111,
000,
000,
000,
000,
000,
000,
000,
000,
000,
000,
000,
000,
000,
000,
000,
000,
000,
000,
000,
000,
000,
000,
000,
000,
000,
000,
000,
000,
000,
000,
000,
000,
000,
000,
000,
000,
000,
000,
000,
000,
000,
000,
000,
000,
000,
000,
000,
000,
000,
000,
000,
000,
000,
000,
000,
000,
000,
000,
000,
000,
000,
000,
000,
000,
000,
000,
000,
000,
000,
000,
000,
000,
000,
111,
111,
111,
111,
111,
111,
111,
111,
111,
111,
111,
111,
111,
111,
111,
111,
111,
111,
111,
111,
111,
111,
111,
111,
111,
111,
111,
111,
111,
111,
111,
111,
111,
111,
111,
111,
111,
111,
111,
111,
111,
111,
111,
111,
111,
111,
111,
111,
111,
111,
111,
111,
111,
111,
111,
111,
111,
111,
111,
111,
111,
111,
111,
111,
111,
111,
111,
111,
111,
111,
111,
111,
111,
111,
111,
111,
111,
111,
111,
111,
111,
111,
111,
111,
111,
111,
111,
000,
000,
000,
000,
000,
000,
000,
000,
000,
000,
000,
000,
000,
000,
000,
000,
000,
000,
000,
000,
000,
000,
000,
000,
000,
000,
000,
000,
000,
000,
000,
000,
000,
000,
000,
000,
000,
000,
000,
000,
000,
000,
000,
000,
000,
000,
000,
000,
000,
000,
000,
000,
000,
000,
000,
000,
000,
000,
000,
000,
000,
000,
000,
000,
000,
000,
000,
000,
000,
000,
000,
000,
000,
111,
111,
111,
111,
111,
111,
111,
111,
111,
111,
111,
111,
111,
111,
111,
111,
111,
111,
111,
111,
111,
111,
111,
111,
111,
111,
111,
111,
111,
111,
111,
111,
111,
111,
111,
111,
111,
111,
111,
111,
111,
111,
111,
111,
111,
111,
111,
111,
111,
111,
111,
111,
111,
111,
111,
111,
111,
111,
111,
111,
111,
111,
111,
111,
111,
111,
111,
111,
111,
111,
111,
111,
111,
111,
111,
111,
111,
111,
111,
111,
111,
111,
111,
111,
111,
111,
111,
000,
000,
000,
000,
000,
000,
000,
000,
000,
000,
000,
000,
000,
000,
000,
000,
000,
000,
000,
000,
000,
000,
000,
000,
000,
000,
000,
000,
000,
000,
000,
000,
000,
000,
000,
000,
000,
000,
000,
000,
000,
000,
000,
000,
000,
000,
000,
000,
000,
000,
000,
000,
000,
000,
000,
000,
000,
000,
000,
000,
000,
000,
000,
000,
000,
000,
000,
000,
000,
000,
000,
000,
000,
000,
111,
111,
111,
111,
111,
111,
111,
111,
111,
111,
111,
111,
111,
111,
111,
111,
111,
111,
111,
111,
111,
111,
111,
111,
111,
111,
111,
111,
111,
111,
111,
111,
111,
111,
111,
111,
111,
111,
111,
111,
111,
111,
111,
111,
111,
111,
111,
111,
111,
111,
111,
111,
111,
111,
111,
111,
111,
111,
111,
111,
111,
111,
111,
111,
111,
111,
111,
111,
111,
111,
111,
111,
111,
111,
111,
111,
111,
111,
111,
111,
111,
111,
111,
111,
111,
111,
000,
000,
000,
000,
000,
000,
000,
000,
000,
000,
000,
000,
000,
000,
000,
000,
000,
000,
000,
000,
000,
000,
000,
000,
000,
000,
000,
000,
000,
000,
000,
000,
000,
000,
000,
000,
000,
000,
000,
000,
000,
000,
000,
000,
000,
000,
000,
000,
000,
000,
000,
000,
000,
000,
000,
000,
000,
000,
000,
000,
000,
000,
000,
000,
000,
000,
000,
000,
000,
000,
000,
000,
000,
000,
111,
111,
111,
111,
111,
111,
111,
111,
111,
111,
111,
111,
111,
111,
111,
111,
111,
111,
111,
111,
111,
111,
111,
111,
111,
111,
111,
111,
111,
111,
111,
111,
111,
111,
111,
111,
111,
111,
111,
111,
111,
111,
111,
111,
111,
111,
111,
111,
111,
111,
111,
111,
111,
111,
111,
111,
111,
111,
111,
111,
111,
111,
111,
111,
111,
111,
111,
111,
111,
111,
111,
111,
111,
111,
111,
111,
111,
111,
111,
111,
111,
111,
111,
111,
111,
111,
000,
000,
000,
000,
000,
000,
000,
000,
000,
000,
000,
000,
000,
000,
000,
000,
000,
000,
000,
000,
000,
000,
000,
000,
000,
000,
000,
000,
000,
000,
000,
000,
000,
000,
000,
000,
000,
000,
000,
000,
000,
000,
000,
000,
000,
000,
000,
000,
000,
000,
000,
000,
000,
000,
000,
000,
000,
000,
000,
000,
000,
000,
000,
000,
000,
000;
