memory_initialization_radix=16;
memory_initialization_vector=
000,
000,
000,
000,
000,
000,
000,
000,
000,
000,
000,
A97,
DCA,
000,
000,
000,
000,
000,
000,
000,
000,
000,
000,
000,
000,
000,
000,
000,
000,
000,
000,
000,
000,
000,
000,
000,
000,
000,
000,
000,
431,
FFC,
FEB,
210,
000,
000,
000,
000,
000,
000,
000,
000,
000,
000,
000,
000,
000,
000,
000,
000,
000,
000,
000,
000,
000,
000,
000,
000,
000,
000,
330,
FFB,
FFA,
551,
000,
000,
000,
000,
000,
000,
000,
000,
000,
000,
000,
000,
000,
000,
000,
000,
000,
000,
000,
000,
000,
000,
000,
000,
000,
000,
AA5,
FFA,
FFA,
995,
000,
000,
000,
000,
000,
000,
000,
000,
000,
000,
000,
000,
000,
000,
000,
000,
000,
000,
000,
000,
000,
000,
000,
000,
000,
000,
996,
FFA,
FFA,
AA6,
000,
000,
000,
000,
000,
000,
000,
000,
000,
000,
000,
000,
000,
000,
000,
000,
000,
000,
000,
000,
000,
000,
000,
000,
000,
000,
FEC,
FFC,
EEA,
AA7,
000,
000,
000,
000,
000,
000,
000,
000,
000,
000,
000,
000,
000,
000,
000,
000,
000,
000,
000,
000,
000,
000,
000,
000,
000,
000,
EEC,
000,
543,
BA9,
000,
000,
000,
000,
000,
000,
000,
000,
000,
000,
000,
000,
000,
000,
000,
000,
000,
000,
000,
000,
000,
000,
000,
000,
000,
000,
442,
220,
000,
887,
000,
000,
000,
000,
000,
000,
000,
000,
000,
000,
000,
000,
000,
000,
000,
000,
000,
000,
000,
000,
000,
000,
000,
000,
000,
000,
000,
FEC,
553,
443,
000,
000,
000,
000,
000,
000,
000,
000,
000,
000,
000,
000,
000,
000,
000,
000,
000,
000,
000,
000,
000,
000,
000,
000,
000,
000,
441,
FFC,
AA8,
443,
000,
000,
000,
000,
000,
000,
000,
000,
000,
000,
000,
000,
000,
000,
000,
000,
000,
000,
000,
000,
000,
000,
000,
000,
000,
000,
441,
FFC,
997,
000,
000,
000,
000,
000,
000,
000,
000,
000,
000,
000,
000,
000,
000,
000,
000,
000,
000,
000,
000,
000,
000,
000,
000,
000,
000,
000,
441,
FFB,
FFC,
000,
000,
000,
000,
000,
000,
000,
000,
000,
000,
000,
000,
000,
000,
000,
000,
000,
000,
000,
000,
000,
000,
000,
000,
000,
000,
000,
430,
FFB,
FFC,
000,
000,
000,
000,
000,
000,
000,
000,
000,
000,
000,
000,
000,
000,
000,
000,
000,
000,
000,
000,
000,
000,
000,
000,
000,
000,
000,
AA6,
FFA,
FFB,
000,
000,
000,
000,
000,
000,
000,
000,
000,
000,
000,
000,
000,
000,
000,
000,
000,
000,
000,
000,
000,
000,
000,
000,
000,
000,
000,
BB7,
FF9,
FFA,
330,
000,
000,
000,
000,
000,
000,
000,
000,
000,
000,
000,
000,
000,
000,
000,
000,
000,
000,
000,
000,
000,
000,
000,
332,
000,
000,
FFA,
FF8,
FFA,
995,
000,
000,
000,
000,
000,
000,
000,
000,
000,
000,
000,
000,
000,
000,
000,
000,
000,
000,
000,
000,
000,
000,
100,
FFC,
320,
000,
FFA,
FF8,
FF9,
CB7,
000,
000,
100,
100,
000,
000,
000,
000,
000,
000,
000,
000,
000,
000,
000,
000,
000,
000,
000,
000,
000,
000,
430,
FEA,
ED9,
762,
FF9,
FF7,
FF8,
EE9,
000,
100,
976,
310,
000,
000,
000,
000,
000,
000,
000,
000,
000,
000,
000,
000,
000,
000,
000,
000,
000,
000,
863,
FE9,
FE9,
CB6,
FF8,
FF8,
FF8,
FFA,
210,
974,
EB9,
410,
000,
000,
000,
000,
000,
000,
000,
000,
000,
000,
000,
000,
000,
000,
000,
000,
000,
000,
DC7,
FE8,
FE8,
FF8,
FF8,
FF8,
FF8,
FE8,
DB6,
FD8,
EA7,
742,
100,
000,
000,
000,
200,
100,
000,
000,
000,
000,
000,
000,
000,
000,
000,
000,
000,
220,
DB7,
FE8,
FF8,
FF7,
FF7,
FF8,
FF8,
FF8,
FE7,
FD7,
EA6,
842,
100,
000,
000,
000,
733,
743,
100,
000,
000,
000,
000,
000,
000,
000,
000,
000,
000,
110,
FE9,
FF8,
FF8,
FE7,
FF8,
FF8,
FF8,
FE7,
FD6,
FD7,
EA6,
A63,
000,
000,
000,
100,
E98,
D87,
100,
000,
000,
000,
000,
000,
000,
000,
000,
000,
000,
431,
FE9,
FF8,
FF8,
FF7,
FF8,
FF8,
FF8,
FF7,
FD6,
FD7,
FB6,
C85,
100,
000,
000,
100,
D87,
E87,
300,
000,
000,
000,
000,
000,
000,
000,
000,
000,
000,
764,
FE9,
FF8,
FF8,
EE7,
FF8,
FF8,
FF8,
FE7,
ED6,
FE8,
FD7,
B84,
100,
000,
000,
100,
943,
E87,
632,
100,
000,
000,
000,
000,
000,
000,
000,
000,
100,
753,
FE9,
FF8,
FF7,
EE6,
FF8,
FF8,
FF8,
FF8,
FE7,
FF8,
FE8,
C95,
100,
000,
000,
100,
610,
E98,
A65,
100,
000,
000,
000,
000,
000,
000,
000,
000,
100,
863,
FE8,
FF8,
FF7,
FE7,
FF8,
FF8,
FF8,
FF8,
FF7,
FF8,
FE9,
DA6,
100,
000,
000,
100,
300,
E98,
C87,
410,
000,
000,
000,
000,
000,
000,
000,
000,
100,
DB8,
FE9,
FF8,
FF8,
FF7,
FF7,
FF8,
FF8,
FF8,
FF8,
FF8,
FD7,
D95,
521,
200,
410,
743,
200,
C87,
E98,
300,
100,
000,
000,
000,
000,
000,
000,
000,
100,
BA7,
FE9,
FF8,
FF8,
FF7,
FF7,
FF8,
FF8,
FF8,
FF8,
FF8,
FE8,
D95,
953,
400,
C76,
A54,
300,
410,
C87,
410,
000,
000,
000,
000,
000,
000,
000,
000,
100,
A85,
FE9,
FF9,
FF8,
FF8,
FF8,
FF8,
FF8,
FF8,
FF8,
FF8,
FF8,
D94,
E95,
F96,
F86,
F97,
410,
200,
854,
522,
000,
000,
000,
000,
000,
000,
000,
000,
521,
B84,
FE9,
FF8,
FF8,
FF8,
FF8,
FF8,
FF8,
FF8,
FF8,
FF8,
FF8,
DA4,
E95,
F95,
F85,
E86,
742,
100,
855,
522,
000,
000,
000,
000,
000,
000,
000,
100,
D97,
C85,
FE8,
FF8,
FF8,
FF8,
FF8,
FF8,
FF8,
FF8,
FF8,
FF8,
FF8,
EC5,
DA4,
FD8,
FA5,
E85,
C86,
200,
310,
321,
000,
000,
000,
000,
000,
000,
000,
200,
720,
E95,
FE8,
FF8,
FF8,
FF8,
FF7,
FF8,
FF8,
FF8,
FF8,
FF8,
FF8,
FD6,
FD6,
FF8,
FC7,
D94,
C86,
410,
310,
311,
000,
000,
000,
000,
000,
000,
100,
954,
F86,
E83,
FD7,
FF8,
FF8,
FF8,
FF8,
FF8,
FF8,
FF8,
FF8,
FF8,
FF8,
FF8,
FF8,
FE8,
FE8,
DA5,
D96,
300,
311,
211,
000,
000,
000,
000,
000,
000,
200,
C76,
F85,
E83,
FD7,
FF8,
FF8,
FF8,
FF8,
FF8,
FF8,
FF8,
FF8,
FF8,
FF8,
FF7,
FF8,
FF8,
FF8,
DB6,
D96,
300,
100,
000,
000,
000,
000,
000,
000,
000,
300,
E97,
E74,
E83,
FC7,
FD7,
FF8,
FE7,
FF8,
FF8,
FF8,
FF8,
FF8,
FF8,
FF8,
FF8,
FF8,
FF8,
FF9,
EC6,
D95,
510,
100,
000,
000,
000,
000,
000,
000,
000,
300,
E97,
E74,
E73,
FB6,
FD7,
FE8,
FE7,
FF8,
FF8,
FF8,
FF8,
FF8,
FF8,
FF8,
FF8,
FF8,
FF8,
FF8,
FD7,
D95,
943,
100,
000,
000,
000,
000,
000,
000,
000,
843,
E86,
F85,
E73,
E94,
FD7,
FD7,
FD6,
FE7,
FF8,
FF8,
FF8,
FF8,
FF8,
FF8,
FF8,
FF8,
FF8,
FF8,
FE8,
D85,
832,
100,
000,
000,
000,
000,
000,
000,
100,
842,
E86,
E74,
E73,
E84,
FD7,
FD6,
FD6,
FE7,
FF8,
FF8,
FF8,
FF8,
FF8,
FF8,
FF8,
FF8,
FF8,
FF8,
FE8,
E95,
942,
100,
000,
000,
000,
000,
000,
000,
100,
842,
F86,
F75,
E73,
D83,
FC7,
FD6,
FE7,
FE7,
FF8,
FF8,
FF8,
FF8,
FF8,
FF8,
FF8,
FF8,
FF8,
FF8,
FF8,
D95,
942,
100,
000,
000,
000,
000,
000,
000,
100,
842,
E85,
F75,
E73,
D83,
FD7,
FD6,
FE7,
FD7,
FF8,
FF8,
FF8,
FF8,
FF8,
FF8,
FF8,
FF8,
FF8,
FF7,
FF9,
EA5,
841,
100,
000,
000,
000,
000,
000,
000,
100,
831,
F85,
F75,
D63,
D94,
FE7,
FE7,
FE7,
FE7,
FE7,
FF8,
FF8,
FF8,
FF8,
FF8,
FF8,
FF8,
FF8,
FF8,
FF9,
EA6,
741,
000,
000,
000,
000,
000,
000,
000,
100,
842,
F96,
F74,
E63,
EA5,
FE8,
FE7,
FF7,
FE7,
FE7,
FF8,
FF8,
FF8,
FF8,
FF8,
FF8,
FF8,
FF8,
FF8,
FF8,
EB6,
741,
000,
000,
000,
000,
000,
000,
000,
100,
942,
F96,
F74,
D63,
FC7,
FF8,
FF8,
FF8,
FE7,
FE7,
FF8,
FF8,
FF8,
FF8,
FF8,
FF8,
FF8,
FF8,
FF8,
FF9,
EB7,
741,
000,
000,
000,
000,
000,
000,
000,
100,
952,
F85,
E64,
D63,
FE8,
FF8,
FF8,
FF8,
FF7,
FE7,
FF8,
FF8,
FF8,
FF8,
FF8,
FF8,
FF8,
FF8,
FE7,
FF9,
EB7,
742,
000,
000,
000,
000,
000,
000,
000,
100,
953,
E85,
E64,
D73,
FE8,
FF8,
FF8,
FF8,
FF7,
FE6,
FF8,
FF8,
FF8,
FF8,
FF8,
FF8,
FF8,
FF8,
FD6,
FD8,
FB7,
742,
000,
000,
000,
000,
000,
000,
000,
100,
943,
F85,
E64,
E83,
FF8,
FF8,
FF8,
FF8,
FF8,
FD6,
FF8,
FF8,
FF8,
FF8,
FF8,
FF8,
FF8,
FF8,
EB5,
FB6,
FB7,
742,
100,
000,
000,
000,
000,
000,
000,
100,
943,
F85,
E63,
E84,
FF8,
FF8,
FF8,
FF8,
FF7,
FD6,
FF8,
FF8,
FF8,
FF8,
FF8,
FF8,
FF8,
FE8,
D94,
E95,
FA7,
742,
100,
000,
000,
000,
000,
000,
000,
100,
A53,
F85,
E63,
E84,
FF8,
FF8,
FF8,
FF8,
FF8,
FD6,
FF8,
FF8,
FF8,
FF8,
FF8,
FF8,
FF8,
FD7,
E94,
F85,
E96,
842,
100,
000,
000,
000,
000,
000,
000,
100,
A53,
F85,
D63,
E84,
FF9,
FF8,
FF8,
FF8,
FF8,
C93,
FF8,
FF8,
FF8,
ED6,
FF8,
FF8,
FF8,
EB6,
E84,
F85,
F86,
842,
100,
000,
000,
000,
000,
000,
000,
100,
942,
F85,
E63,
E84,
FD7,
FF8,
FF8,
FF8,
FE7,
C93,
FF9,
FF8,
FE8,
B93,
FE7,
FE7,
FE9,
EA5,
E84,
E74,
F86,
831,
100,
000,
000,
000,
000,
000,
000,
100,
942,
F85,
E63,
D63,
DA4,
FF8,
FF8,
FF8,
FD7,
B93,
FF8,
FF8,
FE8,
B82,
EB5,
FE8,
FB6,
E84,
F84,
F85,
F85,
942,
100,
000,
000,
000,
000,
000,
000,
100,
842,
F85,
E63,
D63,
C83,
FE8,
FF8,
FF8,
FC6,
C93,
FF8,
FF8,
FD7,
C72,
D83,
FA5,
E73,
F84,
F84,
F74,
F85,
942,
100,
000,
000,
000,
000,
000,
000,
100,
832,
F86,
E63,
D62,
D73,
FD7,
FF8,
FF8,
FC6,
C93,
FF8,
FF8,
FC7,
C62,
D63,
E74,
E62,
F74,
F85,
F85,
E85,
942,
100,
000,
000,
000,
000,
000,
000,
100,
943,
F86,
E64,
D52,
D73,
FC6,
FF8,
FF8,
FB6,
D93,
FF8,
FF8,
FC7,
C52,
D53,
E53,
E62,
F73,
F95,
E84,
F85,
942,
100,
000,
000,
000,
000,
000,
000,
100,
943,
E76,
E54,
E63,
D73,
FB6,
FE7,
FF8,
FB5,
D94,
FF8,
FF8,
FC7,
C52,
D53,
E53,
D52,
F84,
FD8,
E95,
F85,
B64,
100,
000,
000,
000,
000,
000,
000,
100,
621,
F87,
E54,
E53,
D52,
FA5,
FF8,
FF8,
FB5,
D94,
FF8,
FF8,
FB7,
C52,
E53,
E53,
D52,
FA5,
FE9,
FB6,
E84,
D85,
100,
000,
000,
000,
000,
000,
000,
100,
400,
E87,
E64,
E53,
D62,
E94,
FF8,
FF8,
FB6,
D94,
FF8,
FF8,
FA6,
C52,
E43,
D42,
D62,
FC7,
FE8,
FD8,
E95,
C75,
100,
000,
000,
000,
000,
000,
000,
000,
400,
E87,
D65,
810,
E64,
E84,
FF9,
FF8,
FB6,
C93,
FF8,
FF8,
E95,
D42,
E43,
D42,
C62,
FD8,
FF8,
FF8,
E95,
C85,
100,
000,
000,
000,
000,
000,
000,
000,
300,
E97,
C65,
500,
E74,
D73,
FF9,
FF8,
FC6,
C83,
FF8,
FF8,
E73,
D42,
E43,
D42,
C62,
FE9,
FF8,
FF9,
FB6,
D85,
100,
000,
000,
000,
000,
000,
000,
000,
300,
D97,
B64,
400,
C53,
D74,
FF9,
FF8,
FC7,
C83,
FF8,
FE8,
D63,
E53,
E53,
D52,
C73,
FF9,
FF8,
FF8,
FC7,
D96,
210,
000,
000,
000,
000,
000,
000,
000,
300,
D97,
B75,
300,
D74,
D73,
FF9,
FF9,
FC7,
B72,
FD6,
FD7,
D52,
E53,
E53,
C52,
D84,
FF9,
FF8,
FF8,
FD7,
D95,
200,
000,
000,
000,
000,
000,
000,
000,
300,
E98,
A65,
300,
931,
D84,
FF9,
FF9,
FD7,
B71,
EA5,
FC7,
C52,
E53,
E74,
C51,
D94,
FF8,
FF8,
FF8,
FD8,
D95,
742,
100,
000,
000,
000,
000,
000,
000,
400,
D97,
B76,
300,
820,
D84,
FF9,
FF9,
FD8,
B71,
D93,
FC7,
C52,
E64,
F96,
B61,
EA5,
FF8,
FF8,
FF8,
FE8,
D95,
742,
100,
000,
000,
000,
000,
000,
100,
300,
E97,
B76,
200,
831,
D85,
FF9,
FF8,
FE8,
B72,
C72,
FB7,
C52,
F85,
FD8,
B72,
EB5,
FF8,
FF8,
FF8,
FE8,
D95,
B75,
200,
100,
000,
000,
000,
000,
100,
300,
D97,
744,
200,
731,
D95,
FF9,
FF8,
FE9,
B72,
C72,
FB7,
B51,
FA6,
FE9,
B82,
ED6,
FF8,
FF8,
FF8,
FE8,
D94,
E86,
400,
100,
000,
000,
000,
000,
100,
300,
D98,
532,
100,
731,
D96,
FF9,
FF8,
FE9,
C73,
B62,
FA6,
B51,
FB6,
FE8,
CB4,
FE7,
FF8,
FF8,
FF8,
FF8,
E95,
E85,
C75,
100,
000,
000,
000,
000,
100,
300,
EA8,
310,
100,
731,
EA6,
FF9,
FF8,
FF9,
D94,
B62,
FA6,
B51,
FB7,
FF8,
EE6,
FF8,
FF8,
FF8,
FF8,
FF8,
EA5,
E75,
E86,
733,
000,
000,
000,
000,
000,
400,
D98,
200,
100,
731,
EA7,
FE8,
FF8,
FF8,
DA4,
C62,
F95,
B51,
FC7,
FF8,
FF8,
FF8,
FF8,
FF8,
FF8,
FF8,
FB5,
E74,
F86,
733,
100,
000,
000,
000,
000,
510,
D98,
100,
100,
731,
FB7,
FE8,
FF8,
FF8,
EB5,
C62,
F74,
C51,
FC7,
FF8,
FF8,
FF8,
FF8,
FF8,
FF8,
FF8,
FC6,
E84,
E75,
E98,
100,
000,
000,
000,
000,
510,
D97,
000,
000,
731,
FC7,
FE8,
FF8,
FF8,
FC7,
C62,
D63,
C52,
FD8,
FF8,
FF7,
FF8,
FF8,
FF8,
FF8,
FF8,
FD7,
E84,
E85,
C76,
100,
000,
000,
000,
000,
510,
D98,
000,
000,
630,
FC8,
FF8,
FF8,
FF8,
FE8,
D63,
C52,
C62,
FD8,
FF8,
FF8,
FF8,
FF8,
FF8,
FF8,
FF8,
FE8,
E94,
E85,
C76,
200,
000,
000,
000,
000,
520,
C97,
000,
000,
741,
FD8,
FF8,
FF8,
FF8,
FF9,
D73,
C52,
C62,
FD8,
FF8,
FF8,
FF8,
FF8,
FF8,
FF8,
FF8,
FF8,
FA5,
D84,
C86,
200,
000,
000,
000,
000,
510,
C97,
000,
000,
852,
FD8,
FF8,
FF8,
FF8,
FF9,
E84,
C52,
B62,
FE9,
FF8,
FF8,
FF8,
FF8,
FF8,
FF8,
FF8,
FF8,
FC6,
D84,
D86,
200,
000,
000,
000,
000,
400,
C98,
000,
000,
CA6,
FD8,
FF8,
FF8,
FF8,
FF8,
F95,
C51,
C72,
FE9,
FF8,
FF8,
FF8,
FF8,
FF8,
FF8,
FF8,
FF8,
FD7,
D84,
D86,
300,
000,
000,
000,
100,
300,
C98,
000,
000,
B84,
FE8,
FF8,
FF8,
FF8,
FF8,
FA5,
B51,
C73,
FE9,
FF8,
FF8,
FF8,
FF8,
FF8,
FF8,
FF8,
FF8,
FE8,
D94,
D96,
410,
000,
000,
000,
000,
200,
D98,
000,
000,
A73,
FF9,
FF8,
FF8,
FF8,
FF8,
FA6,
B51,
C83,
FF9,
FF8,
FF8,
FF8,
FF8,
FF8,
FF8,
FF7,
FF8,
FF8,
D94,
D96,
410,
000,
000,
000,
000,
200,
C98,
000,
000,
B85,
FF9,
FF8,
FF7,
FF8,
FF8,
FB6,
B51,
D94,
FF9,
FF8,
FF8,
FF8,
FF8,
FF8,
FF8,
FF8,
FF8,
FF8,
DA5,
D96,
400,
000,
000,
000,
000,
200,
B87,
000,
100,
B95,
FF9,
FF8,
FF7,
FF8,
FF8,
FB6,
B51,
D94,
FF9,
FF8,
FF8,
FF8,
FF8,
FF8,
FF8,
FE7,
FF8,
FF8,
DA5,
D96,
300,
000,
000,
000,
000,
100,
CA9,
100,
000,
CA6,
FE8,
FF7,
FF7,
FF8,
FF8,
FB6,
B51,
D94,
FF9,
FF8,
FF8,
FF8,
FF8,
FF8,
FF8,
CA3,
FE8,
FE8,
EB5,
D96,
300,
000,
000,
000,
000,
100,
DA9,
211,
100,
CA6,
FF9,
FF7,
FF7,
FF8,
FF8,
FC7,
B51,
DA4,
FF9,
FF8,
FF8,
FF8,
FF8,
FF8,
FD6,
C93,
FC6,
FE8,
EB6,
D96,
400,
000,
000,
000,
000,
100,
B99,
210,
100,
DA6,
FF9,
FF8,
FF7,
FF8,
FF9,
FC6,
B61,
DA4,
FF9,
FF8,
FF8,
FF8,
FF8,
FF7,
EC5,
C83,
FB6,
FE8,
EB6,
D96,
400,
100,
000,
000,
000,
100,
755,
311,
100,
DB6,
FF8,
FF8,
FF8,
FF8,
FF8,
FC7,
A61,
EB5,
FF8,
FF8,
FF8,
FF8,
FF8,
FF8,
DA4,
D83,
FA5,
FE9,
EB6,
D96,
400,
100,
000,
000,
000,
100,
977,
311,
100,
DA6,
FF9,
FF8,
FF8,
FF8,
FF9,
FC6,
B61,
FE7,
FF8,
FF8,
FF8,
FF8,
FF8,
FE8,
D94,
C73,
E95,
FE9,
EB6,
D96,
400,
000,
000,
000,
000,
000,
321,
322,
100,
DA6,
FE9,
FF8,
FF8,
FF8,
FF9,
FB6,
B61,
FF9,
FF8,
FF8,
FF8,
FF8,
FF8,
FF9,
C83,
D74,
E85,
FE9,
EB6,
D96,
400,
000,
000,
000,
000,
000,
211,
432,
100,
DA6,
FE9,
FF8,
FF8,
FF8,
FF8,
FC7,
B61,
FF8,
FF8,
FF8,
FF8,
FF8,
FF8,
FE8,
C84,
500,
E96,
FE9,
EB6,
D96,
400,
000,
000,
000,
000,
000,
221,
433,
100,
C95,
FE8,
FF8,
FF7,
FF8,
FF8,
FB6,
B61,
FF8,
FF8,
FF8,
FF8,
FF8,
FF8,
FD9,
952,
300,
963,
FE9,
EB6,
D96,
400,
000,
000,
000,
000,
000,
221,
433,
100,
B84,
FE9,
FF8,
FE7,
FF8,
FF9,
FB6,
B61,
FF9,
FF8,
FF8,
FF8,
FF7,
FF8,
FD8,
741,
200,
742,
FE9,
EB6,
D96,
400,
000,
000,
000,
000,
000,
433,
332,
100,
B84,
FD8,
FE7,
FE7,
FF8,
FF8,
FA6,
B61,
FF8,
FF8,
FF8,
FF8,
FF7,
FF9,
FD8,
410,
100,
642,
FE9,
EB6,
D96,
400,
000,
000,
000,
000,
000,
433,
322,
100,
B84,
FD8,
FF8,
FF7,
FF8,
FF8,
E94,
B61,
FE8,
FF8,
FF8,
FF7,
EE6,
FF9,
EC8,
200,
100,
531,
FE9,
EB6,
D96,
400,
000,
000,
000,
000,
000,
433,
321,
200,
C85,
FC7,
FF8,
FF8,
FF8,
FF8,
D83,
B51,
FD7,
FF8,
FF8,
FE7,
EC5,
FE9,
DA7,
200,
100,
200,
FD9,
EB6,
D97,
410,
100,
000,
000,
000,
000,
444,
211,
100,
E97,
FB6,
FF9,
FF8,
FF8,
FF8,
D72,
C51,
FC7,
FF8,
FF9,
FE8,
CA4,
FE9,
B75,
200,
100,
200,
FD8,
FB6,
D96,
410,
000,
000,
000,
000,
000,
000,
211,
100,
952,
FA6,
FF8,
FF8,
FF8,
FF9,
D62,
C51,
FC6,
FF9,
FE8,
FF9,
C72,
FB7,
B75,
200,
100,
200,
FC8,
FA6,
C86,
632,
000,
000,
000,
000,
000,
000,
100,
100,
731,
E96,
FE9,
FF8,
FF8,
FF9,
E73,
C51,
FB6,
FF9,
A94,
CA5,
D73,
E75,
954,
200,
100,
200,
FB7,
FB7,
C85,
200,
000,
000,
000,
000,
000,
000,
322,
100,
942,
E96,
FD8,
FF8,
FF8,
FF9,
E73,
C51,
FC6,
FF9,
A84,
962,
D74,
E75,
732,
100,
000,
210,
FB7,
FB7,
B75,
200,
000,
000,
000,
000,
000,
000,
000,
100,
842,
D95,
DB5,
FE8,
FF9,
FF9,
D73,
C51,
FC6,
FF9,
974,
731,
D64,
D65,
632,
100,
000,
100,
EA7,
FB7,
C86,
100,
000,
000,
000,
000,
000,
000,
000,
100,
300,
EA6,
DB5,
FE8,
FF8,
FF9,
D73,
C52,
FC7,
ED8,
A85,
400,
E75,
D64,
410,
000,
000,
100,
DA6,
FB7,
C86,
200,
000,
000,
000,
000,
000,
000,
000,
100,
300,
DA7,
EC7,
FF7,
FF8,
FF8,
E84,
B52,
FC8,
762,
A86,
300,
E74,
E64,
300,
000,
000,
100,
C95,
FB7,
C86,
200,
000,
000,
000,
000,
000,
000,
000,
000,
521,
C96,
FD7,
FE7,
FF8,
FF8,
E94,
B62,
FC9,
310,
875,
200,
F75,
E75,
200,
000,
000,
000,
D95,
FB7,
D86,
200,
100,
000,
000,
000,
000,
000,
000,
000,
200,
C96,
FE8,
FE7,
FF8,
FF8,
FB6,
B62,
FD9,
200,
764,
200,
E65,
E65,
100,
000,
000,
100,
C84,
FB7,
C97,
100,
000,
000,
000,
000,
000,
000,
000,
000,
100,
DA7,
FD7,
FE7,
FF8,
FF8,
FD8,
B62,
FD9,
210,
100,
100,
C65,
C65,
100,
000,
000,
100,
C85,
FB7,
C86,
100,
000,
000,
000,
000,
000,
000,
000,
000,
100,
DA8,
FE8,
FE7,
FF8,
FF8,
FE8,
C83,
FC9,
310,
000,
100,
C77,
833,
100,
000,
000,
100,
C75,
FA7,
C86,
100,
000,
000,
000,
000,
000,
000,
000,
000,
100,
753,
FE8,
FE7,
FF8,
FF8,
FE8,
DA5,
EC8,
420,
000,
000,
522,
410,
000,
000,
000,
100,
D86,
F96,
C97,
100,
000,
000,
000,
000,
000,
000,
000,
000,
000,
541,
FE8,
FE7,
FF8,
FF8,
FE8,
EC6,
C96,
420,
000,
000,
100,
000,
000,
000,
000,
100,
D96,
E96,
C86,
100,
000,
000,
000,
000,
000,
000,
000,
000,
000,
100,
FF9,
FE7,
FF8,
FF8,
FE7,
FD7,
C95,
521,
000,
000,
000,
000,
000,
000,
000,
100,
942,
E96,
C86,
100,
000,
000,
000,
000,
000,
000,
000,
000,
000,
210,
FD8,
FE7,
FF8,
FF8,
FE7,
FD8,
C96,
631,
000,
000,
000,
000,
000,
000,
000,
100,
842,
E86,
C86,
100,
000,
000,
000,
000,
000,
000,
000,
000,
000,
100,
CB6,
FE8,
FE7,
FF8,
FE7,
FE8,
DA6,
631,
000,
000,
000,
000,
000,
000,
000,
100,
732,
E97,
B76,
100,
000,
000,
000,
000,
000,
000,
000,
000,
000,
000,
DC8,
FE8,
FE7,
FF8,
FE7,
FD7,
EB7,
520,
000,
000,
000,
000,
000,
000,
000,
100,
953,
D86,
C86,
200,
000,
000,
000,
000,
000,
000,
000,
000,
000,
000,
A85,
FE9,
FE7,
FF7,
FF7,
FD7,
FC8,
300,
000,
000,
000,
000,
000,
000,
000,
000,
510,
E98,
C87,
200,
000,
000,
000,
000,
000,
000,
000,
000,
000,
000,
874,
FE9,
FD7,
FF8,
FE7,
FD7,
FD8,
642,
000,
000,
000,
000,
000,
000,
000,
000,
400,
D87,
D87,
632,
000,
000,
000,
000,
000,
000,
000,
000,
000,
000,
320,
FE9,
FE7,
FF7,
FD6,
FD7,
FD8,
863,
000,
000,
000,
000,
000,
000,
000,
000,
200,
B76,
D97,
410,
000,
000,
000,
000,
000,
000,
000,
000,
000,
000,
430,
FD9,
FE7,
FF7,
FE6,
FD7,
FD8,
863,
000,
000,
000,
000,
000,
000,
000,
000,
200,
C87,
D98,
300,
000,
000,
000,
000,
000,
000,
000,
000,
000,
000,
000,
ED9,
FE7,
FE7,
FE6,
FD7,
FD8,
863,
000,
000,
000,
000,
000,
000,
000,
000,
100,
965,
EA8,
300,
000,
000,
000,
000,
000,
000,
000,
000,
000,
000,
000,
FEA,
FE7,
FE7,
FE7,
FD7,
FE8,
974,
000,
000,
000,
000,
000,
000,
000,
000,
100,
632,
D98,
621,
000,
000,
000,
000,
000,
000,
000,
000,
000,
000,
000,
ED9,
FD8,
FE7,
FE7,
FD7,
FE8,
984,
000,
000,
000,
000,
000,
000,
000,
000,
000,
864,
D97,
954,
100,
000,
000,
000,
000,
000,
000,
000,
000,
000,
000,
995,
FE8,
FE7,
FE7,
FE7,
FD8,
A95,
000,
000,
000,
000,
000,
000,
000,
000,
000,
310,
D98,
954,
100,
000,
000,
000,
000,
000,
000,
000,
000,
000,
000,
A95,
FE8,
FE7,
FE7,
FD7,
FD8,
A95,
000,
000,
000,
000,
000,
000,
000,
000,
000,
200,
E98,
943,
100,
000,
000,
000,
000,
000,
000,
000,
000,
000,
000,
996,
FE8,
FE7,
FE7,
FE7,
FE8,
A95,
000,
000,
000,
000,
000,
000,
000,
000,
000,
200,
E97,
842,
100,
000,
000,
000,
000,
000,
000,
000,
000,
000,
000,
A96,
FE8,
FE7,
FE7,
FD7,
FE8,
A85,
000,
000,
000,
000,
000,
000,
000,
000,
000,
210,
D97,
832,
100,
000,
000,
000,
000,
000,
000,
000,
211,
000,
000,
986,
FE8,
FE6,
FE6,
FD7,
FE9,
985,
000,
000,
000,
000,
000,
000,
000,
000,
000,
100,
C86,
B64,
100,
000,
000,
000,
000,
000,
000,
000,
654,
000,
000,
986,
FE8,
FE6,
FD6,
FE7,
BA5,
885,
000,
000,
000,
000,
000,
000,
000,
000,
000,
100,
C76,
FA8,
100,
000,
000,
000,
000,
000,
000,
000,
DCB,
000,
000,
986,
FD8,
FD6,
FE7,
FE8,
984,
100,
000,
000,
000,
000,
000,
000,
000,
000,
766,
100,
D86,
E97,
100,
000,
000,
000,
000,
000,
000,
000,
BA9,
100,
000,
986,
FE9,
FD6,
FE6,
FE8,
985,
000,
000,
000,
000,
000,
000,
000,
000,
000,
665,
100,
D86,
D87,
100,
000,
000,
000,
000,
000,
000,
000,
EDB,
100,
000,
A96,
DC7,
FE7,
FE7,
FE8,
985,
000,
000,
000,
000,
000,
000,
000,
000,
000,
655,
100,
FA8,
D86,
100,
000,
000,
000,
000,
000,
000,
000,
EDB,
100,
000,
875,
ED8,
FD7,
FE7,
FE8,
996,
000,
000,
000,
000,
000,
000,
000,
000,
000,
765,
200,
942,
D86,
100,
000,
000,
000,
000,
000,
000,
000,
ECA,
100,
000,
432,
320,
FE9,
FD7,
FE8,
996,
000,
000,
000,
000,
000,
000,
000,
000,
000,
866,
410,
932,
D87,
100,
000,
000,
000,
000,
000,
000,
100,
DBA,
100,
000,
554,
320,
FEA,
FE7,
FE8,
985,
000,
000,
000,
000,
000,
000,
000,
000,
000,
865,
410,
932,
D87,
100,
000,
000,
000,
000,
000,
000,
321,
C98,
100,
000,
000,
432,
DC8,
FE8,
FE8,
985,
000,
000,
000,
000,
000,
000,
000,
000,
000,
865,
400,
932,
D87,
100,
000,
000,
000,
000,
000,
000,
311,
DA9,
100,
000,
000,
000,
A96,
FF9,
FE9,
A96,
000,
000,
000,
000,
000,
000,
000,
000,
000,
CA9,
300,
942,
D97,
000,
000,
000,
000,
000,
000,
000,
311,
DA9,
200,
000,
000,
000,
996,
FFA,
FE9,
997,
000,
000,
000,
000,
000,
000,
000,
000,
000,
EDB,
310,
952,
D97,
000,
000,
000,
000,
000,
000,
000,
200,
C99,
410,
000,
000,
000,
995,
FFA,
FFA,
000,
000,
000,
000,
000,
000,
000,
000,
000,
000,
FFC,
210,
952,
DA8,
000,
000,
000,
000,
000,
000,
000,
211,
C98,
743,
000,
000,
000,
AA6,
FFA,
FFA,
000,
000,
000,
000,
000,
000,
000,
000,
000,
000,
FFD,
210,
963,
EB8,
000,
000,
000,
000,
000,
000,
000,
432,
B97,
521,
000,
000,
000,
996,
FFA,
FFA,
000,
000,
000,
000,
000,
000,
000,
000,
000,
000,
FFC,
210,
973,
FCA,
000,
000,
000,
000,
000,
000,
000,
000,
DA9,
410,
000,
000,
000,
AA7,
FFA,
FFA,
000,
000,
000,
000,
000,
000,
000,
000,
000,
000,
FFD,
100,
751,
FDA,
000,
000,
000,
000,
000,
000,
000,
000,
854,
421,
000,
000,
000,
996,
FFA,
FFA,
000,
000,
000,
000,
000,
000,
000,
000,
000,
000,
FFD,
000,
540,
FEB,
000,
000,
000,
000,
000,
000,
000,
000,
744,
421,
000,
000,
000,
AA7,
FFA,
FFB,
000,
000,
000,
000,
000,
000,
000,
000,
000,
000,
EEC,
000,
440,
FFB,
000,
000,
000,
000,
000,
000,
000,
000,
311,
422,
000,
000,
000,
996,
FFA,
FFA,
000,
000,
000,
000,
000,
000,
000,
000,
000,
000,
EEC,
000,
440,
FFC,
000,
000,
000,
000,
000,
000,
000,
000,
534,
322,
000,
000,
000,
A97,
FFA,
FFA,
000,
000,
000,
000,
000,
000,
000,
000,
000,
000,
EDC,
000,
330,
FFC,
000,
000,
000,
000,
000,
000,
000,
000,
333,
444,
000,
000,
000,
A97,
FFA,
FF9,
000,
000,
000,
000,
000,
000,
000,
000,
000,
000,
998,
000,
440,
FFC,
000,
000,
000,
000,
000,
000,
000,
000,
000,
222,
000,
000,
000,
A97,
FF9,
FFA,
000,
000,
000,
000,
000,
000,
000,
000,
000,
000,
BA9,
000,
340,
FFC,
000,
000,
000,
000,
000,
000,
000,
000,
000,
000,
000,
000,
000,
A97,
FFA,
FFA,
000,
000,
000,
000,
000,
000,
000,
000,
000,
000,
544,
000,
441,
FFC,
000,
000,
000,
000,
000,
000,
000,
000,
000,
000,
000,
000,
000,
A98,
FFB,
FFB,
000,
000,
000,
000,
000,
000,
000,
000,
000,
000,
444,
000,
441,
FFC,
000,
000,
000,
000,
000,
000,
000,
000,
000,
000,
000,
000,
000,
BA9,
BB8,
FFD,
000,
000,
000,
000,
000,
000,
000,
000,
000,
000,
000,
000,
441,
FFC,
000,
000,
000,
000,
000,
000,
000,
000,
000,
000,
000,
000,
000,
987,
000,
665,
000,
000,
000,
000,
000,
000,
000,
000,
000,
000,
000,
000,
441,
FFC,
000,
000,
000,
000,
000,
000,
000,
000,
000,
000,
000,
000,
000,
544,
000,
555,
000,
000,
000,
000,
000,
000,
000,
000,
000,
000,
000,
000,
331,
FFC,
000,
000,
000,
000,
000,
000,
000,
000,
000,
000,
000,
000,
000,
555,
000,
565,
000,
000,
000,
000,
000,
000,
000,
000,
000,
000,
000,
000,
330,
FFC,
000,
000,
000,
000,
000,
000,
000,
000,
000,
000,
000,
000,
000,
555,
000,
555,
000,
000,
000,
000,
000,
000,
000,
000,
000,
000,
000,
000,
441,
FFC,
000,
000,
000,
000,
000,
000,
000,
000,
000,
000,
000,
000,
000,
555,
000,
555,
000,
000,
000,
000,
000,
000,
000,
000,
000,
000,
000,
000,
331,
FFD,
000,
000,
000,
000,
000,
000,
000,
000,
000,
000,
000,
000,
000,
555,
000,
555,
000,
000,
000,
000,
000,
000,
000,
000,
000,
000,
000,
000,
341,
FFC,
000,
000,
000,
000,
000,
000,
000,
000,
000,
000,
000,
000,
000,
555,
000,
000,
000,
000,
000,
000,
000,
000,
000,
000,
000,
000,
000,
000,
441,
FFC,
332,
000,
000,
000,
000,
000,
000,
000,
000,
000,
000,
000,
000,
444,
000,
000,
000,
000,
000,
000,
000,
000,
000,
000,
000,
000,
000,
000,
331,
FFD,
332,
000,
000,
000,
000,
000,
000,
000,
000,
000,
000,
000,
000,
000,
000,
000,
000,
000,
000,
000,
000,
000,
000,
000,
000,
000,
000,
000,
552,
FFD,
332,
000,
000,
000,
000,
000,
000,
000,
000,
000,
000,
000,
000,
000,
000,
000,
000,
000,
000,
000,
000,
000,
000,
000,
000,
000,
000,
000,
000,
FFD,
432,
000,
000,
000,
000,
000,
000,
000,
000,
000,
000,
000,
000,
000,
000,
000,
000,
000,
000,
000,
000,
000,
000,
000,
000,
000,
000,
000,
000,
FFD,
443,
000,
000,
000,
000,
000,
000,
000,
000,
000,
000,
000,
000,
000,
000,
000,
000,
000,
000,
000,
000,
000,
000,
000,
000,
000,
000,
000,
000,
FFD,
332,
000,
000,
000,
000,
000,
000,
000,
000,
000,
000,
000,
000,
000,
000,
000,
000,
000,
000,
000,
000,
000,
000,
000,
000,
000,
000,
000,
000,
FFD,
433,
000,
000,
000,
000,
000,
000,
000,
000,
000,
000,
000,
000,
000,
000,
000,
000,
000,
000,
000,
000,
000,
000,
000,
000,
000,
000,
000,
000,
AA9,
443,
000,
000,
000,
000,
000,
000,
000,
000,
000,
000,
000,
000,
000,
000,
000,
000,
000,
000,
000,
000,
000,
000,
000,
000,
000,
000,
000,
000,
AA9,
443,
000,
000,
000,
000,
000,
000,
000,
000,
000,
000,
000,
000,
000,
000,
000,
000,
000,
000,
000,
000,
000,
000,
000,
000,
000,
000,
000,
000,
AA8,
544,
000,
000,
000,
000,
000,
000,
000,
000,
000,
000,
000,
000,
000,
000,
000,
000,
000,
000,
000,
000,
000,
000,
000,
000,
000,
000,
000,
000,
443,
554,
000,
000,
000,
000,
000,
000,
000,
000,
000,
000,
000,
000,
000,
000,
000,
000,
000,
000,
000,
000,
000,
000,
000,
000,
000,
000,
000,
000,
554,
544,
000,
000,
000,
000,
000,
000,
000,
000,
000,
000,
000,
000,
000,
000,
000,
000,
000,
000,
000,
000,
000,
000,
000,
000,
000,
000,
000,
000,
000,
544,
000,
000,
000,
000,
000,
000,
000,
000,
000,
000,
000,
000,
000,
000,
000,
000,
000,
000,
000,
000,
000,
000,
000,
000,
000,
000,
000,
000,
000,
555,
000,
000,
000,
000,
000,
000,
000,
000,
000,
000,
000,
000,
000,
000,
000,
000,
000,
000,
000,
000,
000,
000,
000,
000,
000,
000,
000,
000,
000,
444,
000,
000,
000,
000,
000,
000,
000,
000,
000,
000,
000,
000,
000,
000,
000,
000,
000,
000,
000,
000,
000,
000,
000,
000,
000,
000,
000,
000,
000,
444,
000,
000,
000,
000,
000,
000,
000,
000,
000,
000,
000,
000,
000,
000,
000,
000,
000,
000,
000,
000,
000,
000,
000,
000,
000,
000,
000,
000,
000,
444,
000,
000,
000,
000,
000,
000,
000,
000,
000,
000,
000,
000,
000,
000,
000,
000,
000,
000,
000,
000,
000,
000,
000,
000,
000,
000,
000,
000,
000,
554,
000,
000,
000,
000,
000,
000,
000,
000,
000,
000,
000,
000,
000,
000,
000,
000,
000,
000,
000,
000,
000,
000,
000,
000,
000,
000,
000,
000,
000,
555,
000,
000,
000,
000,
000,
000,
000,
000,
000,
000,
000,
000,
000,
000,
000,
000,
000,
000,
000,
000,
000,
000,
000,
000,
000,
000,
000,
000,
000,
000,
000,
000,
000,
000,
000,
000,
000,
000,
000,
000,
000,
000,
000,
000,
000,
000,
000,
000,
000,
000,
000,
000,
000,
000,
000,
000,
000,
000,
000,
000,
000,
000,
000,
000,
000,
000,
000,
000,
000,
000,
000,
000,
000,
000,
000,
000,
000,
000,
000,
000,
000,
000,
000,
000,
000,
000,
000,
000,
000,
000,
000,
000,
000,
000,
000,
000,
000,
000,
000,
000,
000,
000,
000,
000,
000,
000,
000,
000,
000,
000,
000,
000,
000,
000,
000,
000,
000,
000,
000,
000,
000,
000,
000,
000,
000,
000,
000,
000,
000,
000,
000,
000,
000,
000,
000,
000,
000,
000,
000,
000,
000,
000,
000,
000,
000,
000,
000,
000,
000,
000,
000,
000,
000,
000,
000,
000,
000,
000,
000,
000,
000,
000,
000,
000,
000,
000,
000,
000,
000,
000,
000,
000,
000,
000,
000,
000,
000,
000,
222,
443,
000,
000,
000,
000,
000,
000,
000,
000,
000,
000,
000,
000,
000,
000,
000,
000,
000,
000,
000,
000,
000,
000,
000,
000,
000,
000,
000,
000,
544,
432,
432,
000,
000,
000,
000,
000,
000,
000,
000,
000,
000,
000,
000,
000,
000,
000,
000,
000,
000,
000,
000,
000,
000,
000,
000,
000,
000,
000,
665,
665,
331,
000,
000,
000,
000,
000,
000,
000,
000,
000,
000,
000,
000,
000,
000,
000,
000,
000,
000,
000,
000,
000,
000,
000,
000,
000,
000,
000,
887,
BB9,
542,
000,
000,
000,
000,
000,
000,
000,
000,
000,
000,
000,
000,
000,
000,
000,
000,
000,
000,
000,
000,
000,
000,
000,
000,
000,
000,
000,
765,
EDA,
884,
000,
000,
000,
000,
000,
000,
000,
000,
000,
000,
000,
000,
000,
000,
000,
000,
000,
000,
000,
000,
000,
000,
000,
000,
000,
000,
000,
443,
FFB,
762,
000,
000,
000,
000,
000,
000,
000,
000,
000,
000,
000,
000,
000,
000,
000,
000,
000,
000,
000,
000,
000,
000,
000,
000,
000,
000,
000,
432,
FFB,
762,
000,
000,
000,
000,
000,
000,
000,
000,
000,
000,
000,
000,
000,
000,
000,
000,
000,
000,
000,
000,
000,
000,
000,
000,
000,
000,
000,
432,
FEB,
761,
000,
000,
000,
000,
000,
000,
000,
000,
000,
000,
000,
000,
000,
000,
000,
000,
000,
000,
000,
000,
000,
000,
000,
000,
000,
000,
000,
321,
FEB,
751,
000,
000,
000,
000,
000,
000,
000,
000,
000,
000,
000,
000,
000,
000,
000,
000,
000,
000,
000,
000,
000,
000,
000,
000,
000,
000,
000,
321,
FEB,
740,
000,
000,
000,
000,
000,
000,
000,
000,
000,
000,
000,
000,
000,
000,
000,
000,
000,
000,
000,
000,
000,
000,
000,
000,
000,
000,
000,
210,
FCA,
841,
000,
000,
000,
000,
000,
000,
000,
000,
000,
000,
000,
000,
000,
000,
000,
000,
000,
000,
000,
000,
000,
000,
000,
000,
000,
000,
000,
100,
EB9,
B74,
000,
000,
000,
000,
000,
000,
000,
000,
000,
000,
000,
000,
000,
000,
000,
000,
000,
000,
000,
000,
000,
000,
000,
000,
000,
000,
000,
000,
742,
D97,
000,
000,
000,
000,
000,
000,
000,
000,
000,
000,
000,
000,
000,
000,
000,
000,
000,
000,
000,
000,
000,
000,
000,
000,
000,
000,
000,
000,
300,
B75,
000,
000,
000,
000,
000,
000,
000,
000,
000,
000,
000,
000,
000,
000,
000,
000,
000,
000,
000,
000,
000,
000,
000,
000,
000,
000,
000,
000,
200,
B76,
000,
000,
000,
000,
000,
000,
000,
000,
000,
000,
000,
000,
000,
000,
000,
000,
000,
000,
000,
000,
000,
000,
000,
000,
000,
000,
000,
000,
100,
B87,
000,
000,
000,
000,
000,
000,
000,
000,
000,
000,
000,
000,
000,
000,
000,
000,
000,
000,
000,
000,
000,
000,
000,
000,
000,
000,
000,
000,
100,
954,
000,
000,
000,
000,
000,
000,
000,
000,
000,
000,
000,
000,
000,
000,
000,
000,
000,
000,
000,
000,
000,
000,
000,
000,
000,
000,
000,
000,
100,
743,
000,
000,
000,
000,
000,
000,
000,
000,
000,
000,
000,
000,
000,
000,
000,
000,
000,
000,
000,
000,
000,
000,
000,
000,
000,
000,
000,
000,
100,
744,
000,
000,
000,
000,
000,
000,
000,
000,
000,
000,
000,
000,
000,
000,
000,
000,
000,
000,
000,
000,
000,
000,
000,
000,
000,
000,
000,
000,
100,
865,
000,
000,
000,
000,
000,
000,
000,
000,
000,
000,
000,
000,
000,
000,
000,
000,
000,
000,
000,
000,
000,
000,
000,
000,
000,
000,
000,
000,
000,
432,
000,
000,
000,
000,
000,
000,
000,
000,
000,
000,
000,
000,
000,
000,
000,
000,
000,
000,
000,
000,
000,
000,
000,
000,
000,
000,
000,
000,
000,
322,
000,
000,
000,
000,
000,
000,
000,
000,
000,
000,
000,
000,
000,
000,
000,
000,
000,
000,
000,
000,
000,
000,
000,
000,
000,
000,
000,
000,
000,
311,
000,
000,
000,
000,
000,
000,
000,
000,
000,
000,
000,
000,
000,
000,
000,
000,
000,
000,
000,
000,
000,
000,
000,
000,
000,
000,
000,
000,
000,
322,
000,
000,
000,
000,
000,
000,
000,
000,
000,
000,
000,
000,
000,
000,
000,
000,
000,
000,
000,
000,
000,
000,
000,
000,
000,
000,
000,
000,
000,
322,
000,
000,
000,
000,
000,
000,
000,
000,
000,
000,
000,
000,
000,
000,
000,
000,
000,
000,
000,
000,
000,
000,
000,
000,
000,
000,
000,
000,
000,
211,
000,
000,
000,
000,
000,
000,
000,
000,
000,
000,
000,
000,
000,
000,
000,
000,
000,
000,
000,
000,
000,
000,
000,
000,
000,
000,
000,
000,
000,
000,
000,
000,
000,
000,
000,
000,
000,
000,
000,
000,
000,
000,
000,
000,
000,
000,
000,
000,
000,
000,
000,
000,
000,
000,
000,
000,
000,
000,
000,
000;
