memory_initialization_radix=16;
memory_initialization_vector=
000,
000,
000,
000,
000,
000,
000,
000,
000,
010,
000,
000,
000,
000,
000,
000,
000,
000,
100,
110,
110,
781,
BB5,
883,
000,
000,
000,
000,
001,
000,
000,
000,
000,
000,
000,
000,
000,
000,
000,
000,
000,
000,
000,
000,
000,
000,
000,
430,
994,
882,
883,
883,
994,
000,
000,
110,
AA7,
884,
CC8,
CC7,
CC6,
DD7,
EF9,
662,
220,
000,
000,
000,
000,
000,
000,
000,
000,
000,
000,
000,
000,
000,
000,
000,
000,
000,
000,
000,
000,
010,
DC6,
DD4,
FF5,
FF4,
FF4,
FF4,
FF5,
CC3,
DD6,
330,
110,
FFA,
EE9,
EE8,
EF8,
FF9,
884,
000,
000,
000,
000,
000,
000,
000,
000,
000,
000,
000,
000,
000,
000,
000,
000,
000,
000,
000,
000,
010,
663,
EE8,
EE5,
FF3,
FF2,
FF1,
FF1,
FE1,
FF1,
FF3,
EF4,
EE5,
EE6,
660,
650,
770,
AA2,
550,
100,
100,
330,
441,
000,
000,
000,
000,
000,
000,
000,
000,
000,
000,
000,
000,
000,
000,
000,
000,
000,
331,
EFA,
EF7,
EE3,
FF2,
FF1,
FF0,
FF0,
FF0,
FF0,
FF1,
EF1,
FF2,
EF2,
FF4,
FF5,
540,
650,
550,
660,
550,
BB5,
EE9,
330,
000,
000,
000,
000,
000,
000,
000,
000,
000,
000,
000,
000,
000,
000,
000,
000,
663,
FFA,
330,
FF4,
FF1,
FF0,
FF0,
FF0,
FF0,
FF0,
EF0,
FF0,
FF0,
EF0,
FF1,
FF2,
FF4,
FF4,
FF5,
FF5,
EF6,
EF7,
DE8,
220,
000,
000,
000,
000,
000,
000,
000,
000,
000,
000,
000,
000,
000,
000,
000,
330,
EE9,
000,
FFA,
CC2,
FF1,
FF0,
FF0,
FF0,
FF0,
FF0,
FF0,
FF0,
FF0,
FF0,
FE0,
FF1,
EE1,
FF2,
EE2,
EE3,
FF6,
CC7,
000,
000,
000,
000,
000,
000,
000,
000,
000,
000,
000,
000,
000,
000,
000,
000,
000,
CC6,
DD7,
000,
440,
EE4,
FF2,
FF0,
FF0,
FF0,
FF0,
FF0,
FF0,
FF0,
FF0,
FF0,
FF0,
FF0,
FF0,
FF1,
FF2,
FF4,
DD5,
110,
000,
000,
000,
000,
000,
000,
000,
000,
000,
000,
000,
000,
000,
000,
000,
771,
FF8,
FE5,
DC5,
100,
100,
EE5,
FF2,
FF0,
FF0,
FF0,
FF0,
FF0,
FF0,
FF0,
FF0,
FF0,
FF0,
FF0,
FF0,
FF0,
FF3,
FF6,
110,
100,
000,
000,
000,
000,
000,
001,
001,
000,
000,
000,
000,
110,
775,
442,
000,
770,
FE5,
FE4,
ED4,
320,
100,
FE6,
FE3,
FF0,
FF0,
FF0,
FF0,
FF0,
FF0,
FF0,
FF0,
FF0,
FF0,
FF0,
FF0,
FF1,
FF3,
FE6,
100,
000,
000,
000,
000,
000,
000,
001,
000,
000,
110,
000,
110,
672,
EEA,
331,
000,
770,
FF5,
FF3,
FE3,
FE6,
FD7,
FD5,
FE3,
FE1,
FF0,
FF0,
FF0,
FF0,
FF0,
FF0,
FF0,
FF0,
FF0,
FF0,
FF0,
EE0,
FF2,
FF4,
BB4,
000,
000,
000,
000,
000,
000,
000,
000,
000,
000,
EF8,
FF7,
EF7,
AB5,
000,
000,
781,
EF6,
EE3,
FE3,
EA3,
940,
940,
FB2,
FE2,
FF0,
FF0,
FF0,
FF0,
FF0,
FF0,
FF0,
FF0,
FF0,
FF0,
FF0,
FF0,
EF1,
FF5,
CC5,
000,
000,
000,
000,
000,
000,
000,
100,
330,
AA3,
EF6,
DE4,
EF6,
CC6,
000,
000,
000,
993,
FF5,
FC3,
920,
B20,
B20,
C60,
FE2,
FE1,
FF0,
FF0,
FF0,
FF0,
FF0,
FF0,
FF0,
FF0,
FF0,
FF0,
FF0,
FF3,
EE6,
110,
000,
000,
000,
000,
000,
110,
EE7,
DD4,
EF5,
EE4,
EF5,
FF7,
CC6,
110,
000,
000,
000,
100,
980,
FD4,
A30,
B20,
B20,
C60,
FE2,
FF1,
FF0,
FF0,
FF0,
FF0,
FF0,
FF0,
FF0,
FF0,
FF0,
FF0,
FF1,
EE3,
EE8,
110,
000,
000,
000,
000,
775,
EE9,
EF5,
FF4,
EF3,
FF4,
CC4,
550,
110,
110,
000,
000,
000,
100,
981,
FE5,
C70,
930,
930,
D90,
FE2,
FF0,
FF0,
FF0,
FF0,
FF0,
FF0,
FF0,
FF1,
FE0,
FF0,
FF1,
FF2,
FF5,
FF9,
000,
000,
000,
000,
000,
330,
BB6,
EF4,
FF3,
EF2,
FF5,
550,
000,
000,
000,
000,
000,
000,
000,
EE8,
FE6,
FD4,
FC3,
FD3,
FE3,
FF1,
FF0,
FF0,
FF0,
FF0,
FF0,
FF0,
FF0,
FE0,
FF1,
FE2,
FF3,
FE4,
DC4,
662,
000,
000,
000,
000,
000,
000,
661,
FF5,
EF3,
FF4,
CC5,
000,
000,
000,
000,
000,
000,
000,
000,
110,
DC6,
FE4,
FF2,
FE2,
FE1,
FF0,
FF0,
FF0,
FF0,
FF0,
FF0,
FF0,
FF0,
FE1,
FF4,
FE5,
B92,
B94,
310,
110,
000,
000,
000,
000,
000,
000,
550,
FF5,
FF4,
BC4,
330,
000,
000,
000,
000,
000,
000,
000,
000,
000,
220,
FF4,
FF1,
FF1,
FF1,
FF1,
EE0,
FF1,
EE0,
FF0,
FF0,
FF0,
FF1,
FF3,
860,
850,
520,
520,
310,
000,
000,
000,
000,
000,
000,
000,
220,
FF6,
FF5,
550,
000,
000,
000,
000,
000,
000,
000,
000,
000,
000,
320,
FF5,
FF1,
FF1,
FF1,
FF2,
FF2,
CC0,
FF2,
FF1,
FF0,
FF0,
FF1,
ED2,
530,
520,
740,
751,
320,
100,
000,
000,
000,
000,
000,
000,
440,
FF5,
FF5,
550,
000,
000,
000,
000,
000,
000,
000,
000,
000,
000,
AA4,
EF4,
FF2,
FF1,
FE2,
FF3,
AA0,
880,
FF3,
FF1,
FF0,
FF0,
FF1,
ED2,
980,
850,
DB5,
FE8,
761,
100,
000,
000,
000,
100,
210,
AA5,
FF7,
EE3,
EF4,
892,
110,
000,
000,
000,
000,
000,
000,
000,
000,
330,
FF7,
EE3,
EF1,
FF3,
EE3,
550,
DD2,
FF3,
EE2,
FF1,
EF0,
FF0,
FF1,
FF2,
FE3,
FE4,
FE4,
FF6,
650,
000,
000,
000,
432,
975,
FE9,
FE6,
EE4,
FF4,
EF4,
EF7,
DE9,
000,
000,
000,
000,
000,
000,
000,
000,
660,
EF6,
EF3,
FF3,
FF4,
880,
AA0,
FF5,
EE3,
EE3,
FF2,
FF2,
FF1,
FF1,
FF1,
FF1,
FF2,
FE2,
FF5,
870,
320,
000,
000,
432,
410,
861,
FE7,
FE5,
EE5,
EF6,
CC6,
440,
000,
000,
000,
000,
000,
000,
000,
000,
FF7,
FF4,
EE4,
FF5,
440,
AB1,
FF5,
EE5,
FF7,
FF7,
650,
980,
FF2,
FF0,
FF0,
FF1,
FF1,
FF2,
FE4,
FE7,
763,
654,
100,
532,
300,
620,
B95,
FE9,
210,
430,
000,
000,
000,
000,
000,
000,
000,
000,
000,
000,
FF7,
FF4,
FF5,
550,
FF7,
EE5,
FF5,
880,
220,
760,
FE5,
FF4,
FF1,
FF0,
FF0,
FF1,
FE1,
FE3,
B80,
A72,
530,
210,
100,
643,
400,
732,
410,
100,
200,
000,
000,
000,
000,
000,
000,
000,
000,
000,
000,
000,
EE7,
DD4,
320,
DD5,
EF6,
EF5,
770,
AA0,
DD2,
FF3,
FF2,
FF1,
FF0,
FF0,
FF1,
FE2,
FE4,
A80,
620,
510,
410,
310,
522,
300,
511,
511,
200,
100,
000,
000,
000,
000,
000,
000,
000,
000,
000,
000,
000,
000,
FF9,
EE6,
CC4,
550,
CC3,
990,
A90,
FF4,
FF2,
FE1,
FF1,
FF0,
FF0,
FF0,
FF1,
FE2,
970,
860,
620,
620,
521,
300,
400,
512,
522,
311,
100,
000,
000,
000,
000,
000,
000,
000,
000,
000,
000,
000,
000,
000,
FFC,
FF8,
EF5,
FF5,
330,
880,
FF4,
FE2,
FF1,
FF0,
FF0,
FF0,
FF0,
FF0,
FF0,
FF1,
FF3,
FE4,
A60,
730,
520,
300,
411,
522,
311,
100,
000,
000,
000,
000,
000,
000,
000,
000,
000,
000,
000,
000,
000,
000,
FFD,
FF9,
EE4,
FF4,
FF5,
FF4,
FF2,
FF1,
FF0,
FE0,
FF0,
FF0,
FF0,
FF0,
FF0,
FF0,
FF1,
FE2,
FE5,
FC7,
EB9,
200,
633,
300,
100,
100,
000,
000,
000,
000,
000,
000,
000,
000,
000,
000,
000,
000,
000,
000,
321,
FFB,
EE5,
EE3,
EE2,
FF2,
FF1,
FF0,
FF0,
FF0,
FF0,
FE0,
FF0,
FF0,
FF0,
FF0,
FF0,
FF1,
FF5,
750,
320,
311,
100,
100,
000,
000,
000,
000,
000,
000,
000,
000,
000,
000,
000,
000,
000,
000,
000,
000,
000,
9A6,
FF8,
EE4,
FF2,
FF0,
FF1,
FF0,
FF0,
FF0,
FF0,
FF0,
FF0,
FF0,
FF0,
FF0,
FF0,
FF1,
FF4,
650,
100,
100,
000,
000,
000,
000,
000,
000,
000,
000,
000,
000,
000,
000,
000,
000,
000,
000,
000,
000,
000,
663,
FFA,
EE5,
FF2,
FF0,
FF0,
FF0,
FF0,
FF0,
FF0,
FF0,
FF0,
FF0,
FF0,
FF0,
FF0,
FF1,
FF2,
FF5,
A94,
000,
000,
000,
000,
000,
000,
000,
000,
000,
000,
000,
000,
000,
000,
000,
000,
000,
000,
000,
000,
885,
FF9,
FF6,
FE2,
FF0,
FF0,
FF0,
FF0,
FF0,
FF0,
FF0,
FF0,
FF0,
FF0,
FF0,
FF0,
FF0,
FF1,
EE3,
FE7,
210,
000,
000,
000,
000,
000,
000,
000,
000,
000,
000,
000,
000,
000,
000,
000,
000,
000,
CCB,
230,
881,
EF5,
EE3,
FF2,
FF1,
FF0,
FF0,
FF0,
FF0,
FF0,
FF0,
FF0,
FF0,
FF0,
FF0,
FF0,
FF0,
FF1,
FF2,
FE4,
FF8,
874,
000,
000,
000,
000,
000,
000,
000,
000,
000,
000,
000,
000,
000,
000,
000,
000,
000,
FFA,
FF7,
EE3,
FF2,
FF2,
FF1,
FF0,
FF0,
FF0,
FF1,
FF1,
FF1,
EF1,
FF2,
FF2,
FE1,
FF0,
FF0,
FF0,
FF1,
FF3,
FE6,
662,
543,
000,
000,
000,
000,
000,
000,
000,
000,
000,
000,
000,
000,
000,
000,
000,
000,
550,
EF7,
EE3,
FF2,
FF2,
FF1,
FF0,
FF0,
FF0,
EF1,
EF2,
FF4,
FF5,
FE4,
FF5,
FF4,
FE2,
FF1,
FF1,
EF2,
FF4,
BB3,
884,
443,
000,
000,
000,
000,
000,
000,
000,
000,
000,
000,
000,
000,
000,
000,
000,
000,
110,
BB4,
FF6,
EF3,
EF2,
EF2,
EF2,
FF3,
FF3,
FF4,
990,
660,
770,
770,
770,
760,
FF4,
FF3,
FF3,
FF4,
AA2,
883,
A97,
665,
000,
000,
000,
000,
000,
000,
000,
000,
000,
000,
000,
000,
000,
000,
000,
000,
000,
440,
FF9,
FF7,
DE4,
FF5,
FF7,
FF8,
992,
992,
773,
220,
330,
100,
100,
100,
A92,
EF6,
EE6,
BB4,
772,
995,
665,
544,
000,
000,
332,
111,
000,
000,
000,
000,
000,
000,
000,
000,
000,
000,
000,
000,
000,
110,
220,
220,
FF8,
982,
110,
430,
773,
774,
553,
887,
877,
776,
988,
000,
430,
EE9,
BB6,
662,
775,
987,
776,
877,
776,
665,
887,
888,
000,
000,
000,
000,
000,
000,
000,
000,
000,
000,
000,
000,
000,
000,
000,
000,
996,
100,
000,
665,
886,
775,
775,
886,
886,
886,
776,
876,
A97,
110,
553,
775,
886,
776,
776,
887,
887,
887,
887,
777,
444,
000,
000,
000,
000,
000,
000,
000,
000,
000,
000,
000,
000,
000,
000,
000,
000,
000,
000,
AAA,
776,
775,
AA8,
553,
664,
886,
554,
443,
664,
331,
553,
554,
555,
544,
554,
554,
554,
554,
555,
444,
544,
000,
000,
000,
000,
000,
000,
000,
000,
000;
