# compile verilog/system verilog design source files
verilog xil_defaultlib  "../../../lab2_1.srcs/sources_1/new/lab2_1.v"
verilog xil_defaultlib  "../../../lab2_1.srcs/sim_1/new/Lab2_1_t.v"

# compile glbl module
verilog xil_defaultlib "glbl.v"

# Do not sort compile order
nosort
