000000000000
000000000000
000000000000
000000000000
000000000000
000000000000
000000000000
000000000000
000000000000
000000000000
000000000000
000000000000
000000000000
000000000000
000000000000
000000000000
000000000000
000000000000
000000000000
000000000000
000000000000
000000000000
000000000000
000000000000
000000000000
000000000000
000000000000
000000000000
000000000000
000000000000
001101010011
000100110001
000000010000
000000000000
000000000000
000000000000
000000000000
000000000000
000000000000
000000000000
000000000000
000000000000
000000000000
000000000000
000000000000
000000000000
000000000000
000000000000
000000000000
000000000000
000000000000
000000000000
000000000000
000000000000
000000000000
000000000000
000000000000
000000000000
000000000000
000000000000
000000000000
000000000000
000000000000
000000000000
000000000000
000000000000
000000000000
000000000000
000000010000
011010000101
100110111001
011010000101
100110111000
011010000110
000100110001
000000000000
000000000000
000000000000
000000000000
000000000000
000000000000
000000000000
000000000000
000000000000
000000000000
000000000000
000000000000
000000000000
000000000000
000000000000
000000000000
000000000000
000000000000
000000000000
000000000000
000000000000
000000000000
000000000000
000000000000
000000000000
000000000000
000000000000
000000010000
001101000010
010001100011
010101110100
011010000101
100010100111
100111001000
100010110110
010001110011
100010110110
011110100110
100010111000
011110010110
000000000000
000000000000
000000000000
000000000000
000000000000
000000000000
000000000000
000000000000
000000000000
000000000000
000000000000
000000000000
000000000000
000000000000
000000000000
000000000000
000000000000
000000000000
000000000000
000000000000
000000000000
000000000000
000000000000
000000000000
000000010000
011110010110
101011001001
101010111000
100110110111
011110100110
011110100110
100010110110
011110100101
010110000011
010110010011
011110110101
011110100101
011110100110
100010110111
011110010111
000000000000
000000000000
000000000000
000000000000
000000000000
000000000000
000000000000
000000000000
000000000000
000000000000
000000000000
000000000000
000000000000
000000000000
000000000000
000000000000
000000000000
000000000000
000000000000
000000000000
000000000000
000000000000
000000000000
000000010000
101011001001
100111001000
011110100110
011110100101
011110100101
011110110110
011110100110
010010000011
010010000011
011110100101
011110100101
011110110110
011110100101
011110110101
011110100101
011010010101
000000100000
000000000000
000000000000
000000000000
000000000000
000000000000
000000000000
000000000000
000000000000
000000000000
000000000000
000000000000
000000000000
000000000000
000000000000
000000000000
000000000000
000000000000
000000000000
000000000000
000000000000
000000000000
000000010000
101111001010
100110110111
011110100101
011110100101
011110100101
011110110110
001101110010
010110010100
011110110110
011110100101
011110100101
011110110101
011110100101
011110110101
011010110101
011110100101
011010010101
010001100011
000000000000
000000000000
000000000000
000000000000
000000000000
000000000000
000000000000
000000000000
000000000000
000000000000
000000000000
000000000000
000000000000
000000000000
000000000000
000000000000
000000000000
000000000000
000000000000
000000000000
000000000000
011010000110
100111001000
011110100101
011110110101
011110110101
011010100101
001001100001
011110100101
011110100101
011110100101
011110110101
011110100100
011110110101
011110100100
011110110101
011010110100
011110110110
010110000100
100010111000
000000000000
000000000000
000000000000
000000000000
000000000000
000000000000
000000000000
000000000000
000000000000
000000000000
000000000000
000000000000
000000010000
110011101101
100110111011
000000100001
000000000000
000000000000
000000000000
000000000000
000000010000
101111011010
011110010110
011110100110
011110100101
011010100101
001101110010
010010000100
011110110111
011110100110
011110110101
011110110101
011110110100
011110110100
011110110101
011110110101
011110110101
011010100101
011010100101
011110010110
010001010011
000000000000
000000000000
000000000000
000000000000
000000000000
000000000000
000000000000
000000000000
000000000000
000000000000
000000000000
011110011001
101011011100
100111011011
101111101101
000100110010
000000000000
000000010001
000000100001
000101000010
100111001001
010010000100
011110110110
011110100110
001101110011
001001100010
011010100110
010010000100
010110010101
011010100101
011110110101
011010110101
011110110101
011110110101
011110110101
011010110101
011110110101
011110110110
010110000100
100110111000
000000000000
000000000000
000000000000
000000000000
000000000000
000000000000
000000000000
000000000000
000000000000
000000000000
000000000000
101111101101
100011001011
011110111010
011010101001
100010111010
101111011101
110011101110
101111101101
101111101100
100111001010
011010100111
010110010101
010010000100
000101010001
011010010111
100111001010
101011101011
010110010110
011010110110
011010110101
011010110101
011110110101
011010100101
011110110101
011010110101
011110110101
011110110101
010110000100
100010100111
011001110101
000000000000
000000000000
000000000000
000000000000
000000000000
000000000000
000000000000
000000000000
000000000000
011010000111
101011011100
100011001011
100011011100
100111011100
100111001011
101011011100
101011011100
100111001011
100011001011
100011001010
100111011011
101011101011
011010101000
101111111101
100011011011
100111011011
100111011010
010110010110
011010100110
011110110101
011010110101
011010110101
011010110101
011010110101
011010110101
011110110101
011110110101
011110100110
010110000100
100110111000
000100100000
000000000000
000000000000
000000000000
000000000000
000000000000
000000000000
000000000000
000000000000
101011001011
011110111001
100011011011
100011011011
100011001011
100111011100
001101110110
000000110011
011110111010
100011011100
100011011100
100011011011
100011001010
100011011011
100011001011
100011011011
100011001011
100011011011
011110111000
010110010100
011110100101
011110110101
011110110101
011110110101
011010110101
011010110101
011110110101
011110110101
011010010100
010110000011
011110100110
100010100111
000000010000
000000000000
000000000000
000000000000
000000000000
000000000000
000000000000
000000010000
100010101010
100111011100
100011011011
100011001011
100111011100
010110011000
000101010100
001001100101
001001100101
100011011100
011111011011
100011011011
100011011011
100011011011
100011011011
100011011011
100011011011
100011011010
011111001001
010010000100
011110110110
011110100101
011110110101
011010110101
011010110101
011110110110
011010100101
001101110010
010010000011
001101100010
011110100110
100010111000
000000100000
000000000000
000000000000
000000000000
000000000000
000000000000
000000000000
000000010001
101111011100
100111001011
100011001011
100011011011
000001000011
000101010100
001001100101
001001010101
001110000111
100011011100
011111011011
100011011011
100011001011
100011011011
100011011100
011111011100
100011011011
100011011011
100011011010
010010000100
011110110110
011110110101
011110110101
011110110101
011010100101
010010000011
001101110010
010010000011
010010000011
010001110011
010110010100
011110110111
010001110100
000000000000
000000000000
000000000000
000000000000
000000000000
000000000000
100110101010
100010101001
100111001011
100111011100
100010111010
000001000011
001001100101
001001010101
000001000011
001101110110
100011011100
100011011011
100011011011
100011001011
100011001011
100011001011
011111001011
100011011100
100011011011
100011011011
010001110100
010110010101
010110010100
010010000011
010010000010
001101110010
010010000010
010001110010
010010000011
010001110010
010001110010
010010000011
100010110110
011010010100
000000000000
000000000000
000000000000
000000000000
000000000000
000100010001
110011001100
100110101010
010101110110
011110111010
101011011100
001001100101
001001100101
000001000011
001001100110
000001000011
100111011100
100111011100
011110111010
101011011100
100010111010
100111001100
100011001011
100011001011
100011011100
100011011011
010010000101
001101110100
010001110011
010010000011
001101110010
001110000011
010010000010
010001110010
010010000010
010010000011
010001110010
010110000011
011010100101
010110000011
000000000000
000000000000
000000000000
000000000000
000000000000
011101110110
110010111011
011101110110
001001000011
100010111010
100111011011
100111011100
000101010100
000101000100
001001010101
000101010100
100111011100
011010101001
100110111011
001000110011
001100110011
111111111111
011110011001
100011001011
100011011011
100011011011
011010101000
001001100011
010001110100
010001110011
010010000011
010010000010
001110000010
010010000011
010010000011
010001110011
010001110011
001101100001
010010000011
010001110010
000000000000
000000000000
000000000000
000000000000
000000000000
101010101010
110111001100
010001000100
001101000100
101011001100
100111001011
100111011011
100011001011
010010000110
001001100101
100111011100
100111001011
100010111010
100010011000
010101000100
011101010101
101110101011
101111001100
100111001011
100011011011
100011011011
011010101001
100111011011
010110000101
001101100011
001101110011
001101110010
010010000011
010001110011
010001110011
010001110011
010010000011
001101100010
010001110011
010001110010
000000000000
000000000000
000000000000
000000000000
000000000000
101110111011
110111001100
010101000100
001101000100
101011001011
100111001011
100011001011
100011011100
011111001011
010010011000
010010000111
101011011100
010101100110
110110111011
100001010110
011101000101
101110011010
111011111111
100010111010
100011011011
100011011011
011010101001
100011001011
100111011011
100011001001
001001100011
010010000101
010001110011
010001110011
010010000011
010010000011
001101100010
010001110011
010101110011
001001000001
000000000000
000000000000
000000000000
000000000000
000000010001
101010111010
111111111111
010001000100
001101000011
101011011100
100111001011
100011001011
100011011011
100011011100
001110000110
100011001011
101111011100
001000110010
101010001001
011100110100
100001000101
110010101010
111111111111
011010000111
100111011011
100011011100
011010101001
100011011011
100011011011
100011011011
100111011011
000001000001
010001110100
010001110100
010010000100
001101110010
001101100010
010001110011
011010000101
000000010000
000000000000
000000000000
000000000000
000000000000
010101100110
100010101001
111111111111
001000110011
001101010100
101011011100
100011001011
100011011011
100011011011
100011011011
100111011100
100111001011
100010011001
010101000100
011101010101
100101010110
011101000101
110110111100
111111111111
011010011000
100011011011
100011011011
010110101001
100011011100
100011011011
100111011100
010010000110
001001100100
000101000010
010010000101
000101010001
010001110011
010001110100
010110000100
001101000010
000000000000
000000000000
000000000000
000000000000
000000000000
011110001000
101011001100
100010011001
100110111010
100111001011
100011001011
100011011011
100011011011
100011001011
100011011011
100011001011
100111001011
100110111010
011110000111
010101000100
010100110100
010000110011
111111111111
111011111111
011010011000
100011011011
011111011011
011010111001
100011011011
100011001011
100011011100
010010000111
001001100100
001101100100
000101000010
010001110101
010001110100
011010000110
001101010011
000000000000
000000000000
000000000000
000000000000
000000000000
000000000000
011110011001
101011011100
101011011100
100111001011
100011001011
100011001011
100011001011
100011001010
100111011011
100011001011
100011001011
100011001011
100111001011
101011001011
101111001100
101111001100
100110101010
011110011000
011110101001
100011001011
100011011011
100011011011
011010101001
100011011011
100011011011
100011011100
010110011000
000101010100
001001010100
001101100100
001001000011
001001000011
000000010000
000000010000
000000000000
000000000000
000000000000
000000000000
000000000000
000000000000
100010101001
011010010111
011010011000
100010101001
101011011011
101011011011
101111011011
101111011011
101011001011
101011001010
101111011011
101011011011
101011011011
101011001011
101011001011
101011001011
101011001011
100111011100
100011001011
100011001011
100011011011
100011011011
011010101001
100011011011
011111011011
011111011011
100111011100
000101010100
000101010100
001001100101
001101010101
000100100010
000000000000
000000000000
000000000000
000000000000
000000000000
000000000000
000000000000
000000000000
010001100101
110011101101
001101000011
001000110010
010101000100
011101100110
011001000011
011001000011
011001000011
011001000011
010101000011
011001000011
011101100101
100001110110
100010000111
100110011000
011110011000
011110101001
100011011011
100011011011
100011011011
100011011011
100011011011
100011011011
011111011011
011111011100
100011001011
101011101101
010110011000
000001000011
001001010100
100010101010
000000000000
000000000000
000000000000
000000000000
000000000000
000000000000
000000000000
000000000000
001001000011
100010111010
101111011100
010101010100
100001110110
101001110111
110010001000
110110011000
110110011001
110110011000
110110011000
101101110111
101001100110
100001010100
011001010100
011001100101
010001100101
100111011100
100011011011
100011011011
100011011011
100011011011
100011011011
100011011011
011111011011
100011011100
100011001011
100011001011
100111011100
100111011100
010110011000
101111011101
011010001000
000000000000
000000000000
000000000000
000000000000
000000000000
000000000000
001001000100
001001010100
100010111010
100010111010
101111001011
100001110111
110010011001
110110011001
110110001000
110110000111
111010001000
110110000111
110110001000
110110001000
110010001000
100001100101
010101010100
100111001010
100011001011
100011011011
011111011011
100011011011
100011011011
100011001011
100011011011
011111011011
011111011011
100011011100
100011011011
100011011011
100011011011
100011001011
100111001100
101111011101
000000000000
000000000000
000000000000
000000000000
000000000000
000000010001
001001010100
100011001011
100111011100
011010101000
100010111001
101010111010
100001110110
110010011000
110010001000
110110001000
110110000111
111010000111
110110000111
110010001000
110010011001
100001110110
100110101001
100111001011
100011001011
011111001011
100011011011
011111001011
100011011011
100011011011
100011011100
100011011011
100011011011
100011011011
100011011011
100011011011
100011011011
100011011011
100011001100
101011011101
001001010101
000000000000
000000000000
000000000000
000000000000
101011001100
100010111011
100011011011
100011011011
100011011011
011110111001
100010101001
101010111010
100001110110
110010011000
110110011000
110110001000
110110001000
110110001000
110010011001
100001110110
100110101001
100111001011
100111001011
100011001011
100011011011
010110101001
100011011011
100011001011
100011011011
100011001011
100011011011
011111011011
100011011011
100011011011
100011011011
100011011011
011110111010
100011011100
100111001100
011010011000
000000000000
000000000000
000000000000
010001100110
101111101101
100011001011
100011011100
100011011011
011111001011
100011011011
011110101001
011110011000
101110111011
100001100110
101001110111
101110001000
110010011000
100101110110
011101110110
100110101001
101011001011
100111001011
100111011011
100111011011
010010000111
100011011011
100011011100
100011001011
100011001011
100011011100
100011011011
010010011000
100011011011
100011001011
100011011011
100111101100
000001000011
000101010100
101011101101
100111001011
000000000000
000000000000
000000000000
101011001100
100011001011
100011011011
100011011011
100011011011
100011011011
100011011011
101011011100
011110011000
010101100110
100010001000
100110101001
100010011000
100010011000
101111001011
101111011100
101011001011
101011011011
100111001011
011110011000
001101010100
001101110110
011110111010
100011001011
100011011011
100011011100
100011011011
100111011100
010010000110
011010011000
100011001011
100011011011
100111011100
000001000011
000101010100
010010000111
101111101101
000000000000
000000000000
000000010001
110011101101
100111001011
100011011011
100011011011
100011011011
100011011011
100011011011
011110101001
011010011000
100010101001
011010000111
011001110111
010101110110
010101110110
010001100101
010001110110
010001110110
010001110110
001001010100
000101000011
001001010100
001001100101
000101010100
100111011100
100011011011
100011001011
100011011100
100011001011
010001110110
011010011000
011010101001
100111011100
100011001011
000101010100
001001100101
000101000011
101111011101
000000000000
000000000000
010101110110
011010000111
100010111010
100111001011
100011001011
100011011011
100111011011
011110111001
011010011001
100010101001
010001010101
000000000000
000100100010
100010011001
011110101001
011110011001
011110011001
011110011001
010110011000
011010011000
001001010100
001101010101
001001010101
000101000011
100111101100
100011011011
100011001011
100111011100
010001110110
011110011001
011010011000
010110011000
100111001011
100111011100
000001000011
000101010100
001001010100
100010111010
000000000000
000000000000
000000000000
100010011000
100010101001
100110111010
101111101101
101011101100
011110101001
011010011000
001101010100
000000010001
000000000000
000000000000
000000000000
001101000100
010101110111
011010011000
011110011000
011010011001
011010101001
100111011100
000101010100
000101000100
001001010100
011010011000
100011011011
100011011011
100111011100
011110101001
010001110110
011110011001
011010011000
010110011000
100011001011
100011011011
100111011011
010010000111
000101000011
011110101001
000000000000
000000000000
000000000000
000000000000
010101010101
001000110011
000000100001
000000000000
000000010000
000000000000
000000000000
000000000000
000000000000
000000000000
000000000000
001000110011
101111101101
011010011000
010001110110
010001110110
101011101101
100011011011
100111011100
100111011100
100111001011
000000100001
010010000111
100111011100
011110101001
010001100110
100010101001
011110011001
011110011000
011010011000
011110111010
100011011011
100011011011
100111011100
100111011100
101011101101
000000000000
000000000000
000000000000
000000000000
000000000000
000000000000
000000000000
000000000000
000000000000
000000000000
000000000000
000000000000
000000000000
000000000000
000000000000
000000000000
101011001011
101011011100
011110101010
011010011000
100111011100
100011001011
100011001011
100011011011
100111011100
100111011100
100011001011
011110101001
010110000111
011010001000
010101110110
000000000000
011110011001
011010011000
011010101001
100011011011
100011011011
100011011011
100011001011
101011011100
000000010000
000000000000
000000000000
000000000000
000000000000
000000000000
000000000000
000000000000
000000000000
000000000000
000000000000
000000000000
000000000000
000000000000
000000000000
000000000000
001001000011
101111011101
011110101001
011110011001
100111011100
100111011100
100111011100
100111011100
100010111010
011010011001
011110101001
001101010100
000000000000
000000000000
000000000000
000000000000
000000010000
100010101010
011010011000
011110111010
100111011011
100011001011
100111011100
100010111010
000000000000
000000000000
000000000000
000000000000
000000000000
000000000000
000000000000
000000000000
000000000000
000000000000
000000000000
000000000000
000000000000
000000000000
000000000000
000000000000
000000000000
100110111010
011010000111
101011001100
011110101001
100010101010
011110101001
011110101001
011110011001
100010101001
001000110011
000000000000
000000000000
000000000000
000000000000
000000000000
000000000000
001101000100
100010101001
011010011000
100110111010
101011011100
101011011100
010001100110
000000000000
000000000000
000000000000
000000000000
000000000000
000000000000
000000000000
000000000000
000000000000
000000000000
000000000000
000000000000
000000000000
000000000000
000000000000
000000000000
000000010000
100110101001
010101100101
010101100110
101111011100
001101010101
101111011101
010101110110
010001010101
000000000000
000000000000
000000000000
000000000000
000000000000
000000000000
000000000000
000000000000
000000000000
000100100001
011010000111
011001110111
011110011000
010101100110
011110001000
000000000000
000000000000
000000000000
000000000000
000000000000
000000000000
000000000000
000000000000
000000000000
000000000000
000000000000
000000000000
000000000000
000000000000
000000000000
000000000000
000000000000
000000000000
001100110011
000000000000
000000000000
000000000000
000000010001
000000000000
000000000000
000000000000
000000000000
000000000000
000000000000
000000000000
000000000000
000000000000
000000000000
000000000000
000000000000
000000000000
011001110110
000100100010
000000000000
000000000000
000000000000
000000000000
