{
  "compilerOptions": {
    "baseUrl": ".",
    "paths": {
      "~/*": ["./*"],
      "@/*": ["./*"],
      "~~/*": ["./*"],
      "@@/*": ["./*"]
    }
  },
  "include": [
    "**/*.ts"
  ],
  "exclude": [
    ".nuxt",
    ".vscode",
    "dist",
    "node_modules"
  ]
}
