[
  {
    "tag": "thead",
    "foldableRows": true,
    "rows": [
      {
        "last_scan": {
          "id": "last_scan",
          "sortable": true,
          "hideable": true
        },
        "cluster_location": {
          "id": "cluster_location",
          "filterable": true
        },
        "quarter": {
          "id": "quarter",
          "filterable": true,
          "hideable": true
        },
        "area": {
          "id": "area",
          "filterable": true,
          "hideable": true
        },
        "district": {
          "id": "district",
          "filterable": true,
          "isHidden": true
        },
        "location_type": {
          "id": "location_type",
          "filterable": true,
          "hideable": true
        },
        "item_cardboard": {
          "id": "item_cardboard",
          "sortable": true
        },
        "item_bags": {
          "id": "item_bags",
          "sortable": true
        },
        "item_bulky": {
          "id": "item_bulky",
          "sortable": true
        },
        "urgency": {
          "id": "urgency",
          "sortable": true
        }
      }
    ]
  },
  {
    "tag": "tbody",
    "foldableRows": true
  }
]
