Comment,Designator,Footprint,LCSC
100 uF,C13,CP_EIA-2012-12_Kemet-R_Pad1.30x1.05mm_HandSolder,C141660
100nF,"C1,C2,C3,C4,C6,C7,C8",C_0603_1608Metric_Pad1.08x0.95mm_HandSolder,C14663
1uF,"C11,C12",CP_EIA-2012-12_Kemet-R_Pad1.30x1.05mm_HandSolder,C15849
"4,7uF",C5,CP_EIA-2012-12_Kemet-R_Pad1.30x1.05mm_HandSolder,C19666
0,R1,R_0603_1608Metric_Pad0.98x0.95mm_HandSolder,C21189
4k7,"R4,R5,R7,R8",R_0603_1608Metric_Pad0.98x0.95mm_HandSolder,C23162
10k,"R10,R2,R3,R6,R9",R_0603_1608Metric_Pad0.98x0.95mm_HandSolder,C25804
12pF,"C10,C9",C_0603_1608Metric_Pad1.08x0.95mm_HandSolder,C38523
BNO080,U2,IC_BNO080,C5264422
"32,768KHz",Y1,Crystal_SMD_3215-2Pin_3.2x1.5mm,C5280691
STM32L422CBTx,U1,LQFP-48_7x7mm_P0.5mm,C529442
PQ9ISH-Connector,J1,PinSocket_1x09_P2.00mm_Vertical,
ECS-TXO-2016,U4,Oscillator_SMD_ECS_TXO-2016-xx-xxx-4Pin_2x1.6mm,
FerriteBead,FB1,L_0603_1608Metric_Pad1.05x0.95mm_HandSolder,
BME280,U3,PSON65P250X250X100-8N,
150,R11,R_0603_1608Metric_Pad0.98x0.95mm_HandSolder,
SWD,J2,Molex_PicoBlade_53261-0671_1x06-1MP_P1.25mm_Horizontal,
FerriteBead,FB2,L_0603_1608Metric_Pad1.05x0.95mm_HandSolder,
