(footprint "BG51" (version 20221018) (generator pcbnew)
  (layer "F.Cu")
  (attr smd)
  (fp_text reference "REF**" (at 0 3.056 unlocked) (layer "F.SilkS")
      (effects (font (size 1 1) (thickness 0.1)))
    (tstamp d78b2f01-5823-41de-a639-dba86b6e0cf3)
  )
  (fp_text value "BG51" (at 5.715 4.445 unlocked) (layer "F.Fab")
      (effects (font (size 1 1) (thickness 0.15)))
    (tstamp b80e2945-d798-4161-8e57-886ab7ef114d)
  )
  (fp_text user "${REFERENCE}" (at 9.271 2.5 unlocked) (layer "F.Fab")
      (effects (font (size 1 1) (thickness 0.15)))
    (tstamp f3ac8320-b963-48b6-afa2-571d967ae33f)
  )
  (fp_rect (start -7.112 -26.289) (end 7.112 0)
    (stroke (width 0.15) (type default)) (fill none) (layer "F.SilkS") (tstamp b61525e6-f738-479c-803e-ad934327d4d3))
  (pad "1" smd roundrect (at -2.54 3.556) (size 1.27 7.2) (layers "F.Cu" "F.Paste" "F.Mask") (roundrect_rratio 0.25)
    (thermal_bridge_angle 45) (tstamp f3dc0baa-79d6-4f5f-9f94-281101428260))
  (pad "2" smd roundrect (at 0 3.556) (size 1.27 7.2) (layers "F.Cu" "F.Paste" "F.Mask") (roundrect_rratio 0.25)
    (thermal_bridge_angle 45) (tstamp e5669dcb-6bc1-4c9c-ad2c-f2b74b787baf))
  (pad "3" smd roundrect (at 2.54 3.556) (size 1.27 7.2) (layers "F.Cu" "F.Paste" "F.Mask") (roundrect_rratio 0.25)
    (thermal_bridge_angle 45) (tstamp 4d4b4f9d-0162-4361-95ad-dbcfe68e2100))
  (group "" (id b00a6a62-8888-4d23-9d30-47e7106249a0)
    (members
      4d4b4f9d-0162-4361-95ad-dbcfe68e2100
      b61525e6-f738-479c-803e-ad934327d4d3
      b80e2945-d798-4161-8e57-886ab7ef114d
      d78b2f01-5823-41de-a639-dba86b6e0cf3
      e5669dcb-6bc1-4c9c-ad2c-f2b74b787baf
      f3ac8320-b963-48b6-afa2-571d967ae33f
      f3dc0baa-79d6-4f5f-9f94-281101428260
    )
  )
)
