(kicad_sch (version 20211123) (generator eeschema)

  (uuid e63e39d7-6ac0-4ffd-8aa3-1841a4541b55)

  (paper "A4")

  (title_block
    (title "PQ9 Testing Board")
    (date "2017-12-08")
    (rev "1.0")
    (company "Libre Space Foundation")
  )

  (lib_symbols
    (symbol "Connector_Generic:Conn_01x02" (pin_names (offset 1.016) hide) (in_bom yes) (on_board yes)
      (property "Reference" "J" (id 0) (at 0 2.54 0)
        (effects (font (size 1.27 1.27)))
      )
      (property "Value" "Conn_01x02" (id 1) (at 0 -5.08 0)
        (effects (font (size 1.27 1.27)))
      )
      (property "Footprint" "" (id 2) (at 0 0 0)
        (effects (font (size 1.27 1.27)) hide)
      )
      (property "Datasheet" "~" (id 3) (at 0 0 0)
        (effects (font (size 1.27 1.27)) hide)
      )
      (property "ki_keywords" "connector" (id 4) (at 0 0 0)
        (effects (font (size 1.27 1.27)) hide)
      )
      (property "ki_description" "Generic connector, single row, 01x02, script generated (kicad-library-utils/schlib/autogen/connector/)" (id 5) (at 0 0 0)
        (effects (font (size 1.27 1.27)) hide)
      )
      (property "ki_fp_filters" "Connector*:*_1x??_*" (id 6) (at 0 0 0)
        (effects (font (size 1.27 1.27)) hide)
      )
      (symbol "Conn_01x02_1_1"
        (rectangle (start -1.27 -2.413) (end 0 -2.667)
          (stroke (width 0.1524) (type default) (color 0 0 0 0))
          (fill (type none))
        )
        (rectangle (start -1.27 0.127) (end 0 -0.127)
          (stroke (width 0.1524) (type default) (color 0 0 0 0))
          (fill (type none))
        )
        (rectangle (start -1.27 1.27) (end 1.27 -3.81)
          (stroke (width 0.254) (type default) (color 0 0 0 0))
          (fill (type background))
        )
        (pin passive line (at -5.08 0 0) (length 3.81)
          (name "Pin_1" (effects (font (size 1.27 1.27))))
          (number "1" (effects (font (size 1.27 1.27))))
        )
        (pin passive line (at -5.08 -2.54 0) (length 3.81)
          (name "Pin_2" (effects (font (size 1.27 1.27))))
          (number "2" (effects (font (size 1.27 1.27))))
        )
      )
    )
    (symbol "Connector_Generic:Conn_01x04" (pin_names (offset 1.016) hide) (in_bom yes) (on_board yes)
      (property "Reference" "J" (id 0) (at 0 5.08 0)
        (effects (font (size 1.27 1.27)))
      )
      (property "Value" "Conn_01x04" (id 1) (at 0 -7.62 0)
        (effects (font (size 1.27 1.27)))
      )
      (property "Footprint" "" (id 2) (at 0 0 0)
        (effects (font (size 1.27 1.27)) hide)
      )
      (property "Datasheet" "~" (id 3) (at 0 0 0)
        (effects (font (size 1.27 1.27)) hide)
      )
      (property "ki_keywords" "connector" (id 4) (at 0 0 0)
        (effects (font (size 1.27 1.27)) hide)
      )
      (property "ki_description" "Generic connector, single row, 01x04, script generated (kicad-library-utils/schlib/autogen/connector/)" (id 5) (at 0 0 0)
        (effects (font (size 1.27 1.27)) hide)
      )
      (property "ki_fp_filters" "Connector*:*_1x??_*" (id 6) (at 0 0 0)
        (effects (font (size 1.27 1.27)) hide)
      )
      (symbol "Conn_01x04_1_1"
        (rectangle (start -1.27 -4.953) (end 0 -5.207)
          (stroke (width 0.1524) (type default) (color 0 0 0 0))
          (fill (type none))
        )
        (rectangle (start -1.27 -2.413) (end 0 -2.667)
          (stroke (width 0.1524) (type default) (color 0 0 0 0))
          (fill (type none))
        )
        (rectangle (start -1.27 0.127) (end 0 -0.127)
          (stroke (width 0.1524) (type default) (color 0 0 0 0))
          (fill (type none))
        )
        (rectangle (start -1.27 2.667) (end 0 2.413)
          (stroke (width 0.1524) (type default) (color 0 0 0 0))
          (fill (type none))
        )
        (rectangle (start -1.27 3.81) (end 1.27 -6.35)
          (stroke (width 0.254) (type default) (color 0 0 0 0))
          (fill (type background))
        )
        (pin passive line (at -5.08 2.54 0) (length 3.81)
          (name "Pin_1" (effects (font (size 1.27 1.27))))
          (number "1" (effects (font (size 1.27 1.27))))
        )
        (pin passive line (at -5.08 0 0) (length 3.81)
          (name "Pin_2" (effects (font (size 1.27 1.27))))
          (number "2" (effects (font (size 1.27 1.27))))
        )
        (pin passive line (at -5.08 -2.54 0) (length 3.81)
          (name "Pin_3" (effects (font (size 1.27 1.27))))
          (number "3" (effects (font (size 1.27 1.27))))
        )
        (pin passive line (at -5.08 -5.08 0) (length 3.81)
          (name "Pin_4" (effects (font (size 1.27 1.27))))
          (number "4" (effects (font (size 1.27 1.27))))
        )
      )
    )
    (symbol "Connector_Generic:Conn_01x05" (pin_names (offset 1.016) hide) (in_bom yes) (on_board yes)
      (property "Reference" "J" (id 0) (at 0 7.62 0)
        (effects (font (size 1.27 1.27)))
      )
      (property "Value" "Conn_01x05" (id 1) (at 0 -7.62 0)
        (effects (font (size 1.27 1.27)))
      )
      (property "Footprint" "" (id 2) (at 0 0 0)
        (effects (font (size 1.27 1.27)) hide)
      )
      (property "Datasheet" "~" (id 3) (at 0 0 0)
        (effects (font (size 1.27 1.27)) hide)
      )
      (property "ki_keywords" "connector" (id 4) (at 0 0 0)
        (effects (font (size 1.27 1.27)) hide)
      )
      (property "ki_description" "Generic connector, single row, 01x05, script generated (kicad-library-utils/schlib/autogen/connector/)" (id 5) (at 0 0 0)
        (effects (font (size 1.27 1.27)) hide)
      )
      (property "ki_fp_filters" "Connector*:*_1x??_*" (id 6) (at 0 0 0)
        (effects (font (size 1.27 1.27)) hide)
      )
      (symbol "Conn_01x05_1_1"
        (rectangle (start -1.27 -4.953) (end 0 -5.207)
          (stroke (width 0.1524) (type default) (color 0 0 0 0))
          (fill (type none))
        )
        (rectangle (start -1.27 -2.413) (end 0 -2.667)
          (stroke (width 0.1524) (type default) (color 0 0 0 0))
          (fill (type none))
        )
        (rectangle (start -1.27 0.127) (end 0 -0.127)
          (stroke (width 0.1524) (type default) (color 0 0 0 0))
          (fill (type none))
        )
        (rectangle (start -1.27 2.667) (end 0 2.413)
          (stroke (width 0.1524) (type default) (color 0 0 0 0))
          (fill (type none))
        )
        (rectangle (start -1.27 5.207) (end 0 4.953)
          (stroke (width 0.1524) (type default) (color 0 0 0 0))
          (fill (type none))
        )
        (rectangle (start -1.27 6.35) (end 1.27 -6.35)
          (stroke (width 0.254) (type default) (color 0 0 0 0))
          (fill (type background))
        )
        (pin passive line (at -5.08 5.08 0) (length 3.81)
          (name "Pin_1" (effects (font (size 1.27 1.27))))
          (number "1" (effects (font (size 1.27 1.27))))
        )
        (pin passive line (at -5.08 2.54 0) (length 3.81)
          (name "Pin_2" (effects (font (size 1.27 1.27))))
          (number "2" (effects (font (size 1.27 1.27))))
        )
        (pin passive line (at -5.08 0 0) (length 3.81)
          (name "Pin_3" (effects (font (size 1.27 1.27))))
          (number "3" (effects (font (size 1.27 1.27))))
        )
        (pin passive line (at -5.08 -2.54 0) (length 3.81)
          (name "Pin_4" (effects (font (size 1.27 1.27))))
          (number "4" (effects (font (size 1.27 1.27))))
        )
        (pin passive line (at -5.08 -5.08 0) (length 3.81)
          (name "Pin_5" (effects (font (size 1.27 1.27))))
          (number "5" (effects (font (size 1.27 1.27))))
        )
      )
    )
    (symbol "Connector_Generic:Conn_01x09" (pin_names (offset 1.016) hide) (in_bom yes) (on_board yes)
      (property "Reference" "J" (id 0) (at 0 12.7 0)
        (effects (font (size 1.27 1.27)))
      )
      (property "Value" "Conn_01x09" (id 1) (at 0 -12.7 0)
        (effects (font (size 1.27 1.27)))
      )
      (property "Footprint" "" (id 2) (at 0 0 0)
        (effects (font (size 1.27 1.27)) hide)
      )
      (property "Datasheet" "~" (id 3) (at 0 0 0)
        (effects (font (size 1.27 1.27)) hide)
      )
      (property "ki_keywords" "connector" (id 4) (at 0 0 0)
        (effects (font (size 1.27 1.27)) hide)
      )
      (property "ki_description" "Generic connector, single row, 01x09, script generated (kicad-library-utils/schlib/autogen/connector/)" (id 5) (at 0 0 0)
        (effects (font (size 1.27 1.27)) hide)
      )
      (property "ki_fp_filters" "Connector*:*_1x??_*" (id 6) (at 0 0 0)
        (effects (font (size 1.27 1.27)) hide)
      )
      (symbol "Conn_01x09_1_1"
        (rectangle (start -1.27 -10.033) (end 0 -10.287)
          (stroke (width 0.1524) (type default) (color 0 0 0 0))
          (fill (type none))
        )
        (rectangle (start -1.27 -7.493) (end 0 -7.747)
          (stroke (width 0.1524) (type default) (color 0 0 0 0))
          (fill (type none))
        )
        (rectangle (start -1.27 -4.953) (end 0 -5.207)
          (stroke (width 0.1524) (type default) (color 0 0 0 0))
          (fill (type none))
        )
        (rectangle (start -1.27 -2.413) (end 0 -2.667)
          (stroke (width 0.1524) (type default) (color 0 0 0 0))
          (fill (type none))
        )
        (rectangle (start -1.27 0.127) (end 0 -0.127)
          (stroke (width 0.1524) (type default) (color 0 0 0 0))
          (fill (type none))
        )
        (rectangle (start -1.27 2.667) (end 0 2.413)
          (stroke (width 0.1524) (type default) (color 0 0 0 0))
          (fill (type none))
        )
        (rectangle (start -1.27 5.207) (end 0 4.953)
          (stroke (width 0.1524) (type default) (color 0 0 0 0))
          (fill (type none))
        )
        (rectangle (start -1.27 7.747) (end 0 7.493)
          (stroke (width 0.1524) (type default) (color 0 0 0 0))
          (fill (type none))
        )
        (rectangle (start -1.27 10.287) (end 0 10.033)
          (stroke (width 0.1524) (type default) (color 0 0 0 0))
          (fill (type none))
        )
        (rectangle (start -1.27 11.43) (end 1.27 -11.43)
          (stroke (width 0.254) (type default) (color 0 0 0 0))
          (fill (type background))
        )
        (pin passive line (at -5.08 10.16 0) (length 3.81)
          (name "Pin_1" (effects (font (size 1.27 1.27))))
          (number "1" (effects (font (size 1.27 1.27))))
        )
        (pin passive line (at -5.08 7.62 0) (length 3.81)
          (name "Pin_2" (effects (font (size 1.27 1.27))))
          (number "2" (effects (font (size 1.27 1.27))))
        )
        (pin passive line (at -5.08 5.08 0) (length 3.81)
          (name "Pin_3" (effects (font (size 1.27 1.27))))
          (number "3" (effects (font (size 1.27 1.27))))
        )
        (pin passive line (at -5.08 2.54 0) (length 3.81)
          (name "Pin_4" (effects (font (size 1.27 1.27))))
          (number "4" (effects (font (size 1.27 1.27))))
        )
        (pin passive line (at -5.08 0 0) (length 3.81)
          (name "Pin_5" (effects (font (size 1.27 1.27))))
          (number "5" (effects (font (size 1.27 1.27))))
        )
        (pin passive line (at -5.08 -2.54 0) (length 3.81)
          (name "Pin_6" (effects (font (size 1.27 1.27))))
          (number "6" (effects (font (size 1.27 1.27))))
        )
        (pin passive line (at -5.08 -5.08 0) (length 3.81)
          (name "Pin_7" (effects (font (size 1.27 1.27))))
          (number "7" (effects (font (size 1.27 1.27))))
        )
        (pin passive line (at -5.08 -7.62 0) (length 3.81)
          (name "Pin_8" (effects (font (size 1.27 1.27))))
          (number "8" (effects (font (size 1.27 1.27))))
        )
        (pin passive line (at -5.08 -10.16 0) (length 3.81)
          (name "Pin_9" (effects (font (size 1.27 1.27))))
          (number "9" (effects (font (size 1.27 1.27))))
        )
      )
    )
    (symbol "Connector_Generic:Conn_02x04_Odd_Even" (pin_names (offset 1.016) hide) (in_bom yes) (on_board yes)
      (property "Reference" "J" (id 0) (at 1.27 5.08 0)
        (effects (font (size 1.27 1.27)))
      )
      (property "Value" "Conn_02x04_Odd_Even" (id 1) (at 1.27 -7.62 0)
        (effects (font (size 1.27 1.27)))
      )
      (property "Footprint" "" (id 2) (at 0 0 0)
        (effects (font (size 1.27 1.27)) hide)
      )
      (property "Datasheet" "~" (id 3) (at 0 0 0)
        (effects (font (size 1.27 1.27)) hide)
      )
      (property "ki_keywords" "connector" (id 4) (at 0 0 0)
        (effects (font (size 1.27 1.27)) hide)
      )
      (property "ki_description" "Generic connector, double row, 02x04, odd/even pin numbering scheme (row 1 odd numbers, row 2 even numbers), script generated (kicad-library-utils/schlib/autogen/connector/)" (id 5) (at 0 0 0)
        (effects (font (size 1.27 1.27)) hide)
      )
      (property "ki_fp_filters" "Connector*:*_2x??_*" (id 6) (at 0 0 0)
        (effects (font (size 1.27 1.27)) hide)
      )
      (symbol "Conn_02x04_Odd_Even_1_1"
        (rectangle (start -1.27 -4.953) (end 0 -5.207)
          (stroke (width 0.1524) (type default) (color 0 0 0 0))
          (fill (type none))
        )
        (rectangle (start -1.27 -2.413) (end 0 -2.667)
          (stroke (width 0.1524) (type default) (color 0 0 0 0))
          (fill (type none))
        )
        (rectangle (start -1.27 0.127) (end 0 -0.127)
          (stroke (width 0.1524) (type default) (color 0 0 0 0))
          (fill (type none))
        )
        (rectangle (start -1.27 2.667) (end 0 2.413)
          (stroke (width 0.1524) (type default) (color 0 0 0 0))
          (fill (type none))
        )
        (rectangle (start -1.27 3.81) (end 3.81 -6.35)
          (stroke (width 0.254) (type default) (color 0 0 0 0))
          (fill (type background))
        )
        (rectangle (start 3.81 -4.953) (end 2.54 -5.207)
          (stroke (width 0.1524) (type default) (color 0 0 0 0))
          (fill (type none))
        )
        (rectangle (start 3.81 -2.413) (end 2.54 -2.667)
          (stroke (width 0.1524) (type default) (color 0 0 0 0))
          (fill (type none))
        )
        (rectangle (start 3.81 0.127) (end 2.54 -0.127)
          (stroke (width 0.1524) (type default) (color 0 0 0 0))
          (fill (type none))
        )
        (rectangle (start 3.81 2.667) (end 2.54 2.413)
          (stroke (width 0.1524) (type default) (color 0 0 0 0))
          (fill (type none))
        )
        (pin passive line (at -5.08 2.54 0) (length 3.81)
          (name "Pin_1" (effects (font (size 1.27 1.27))))
          (number "1" (effects (font (size 1.27 1.27))))
        )
        (pin passive line (at 7.62 2.54 180) (length 3.81)
          (name "Pin_2" (effects (font (size 1.27 1.27))))
          (number "2" (effects (font (size 1.27 1.27))))
        )
        (pin passive line (at -5.08 0 0) (length 3.81)
          (name "Pin_3" (effects (font (size 1.27 1.27))))
          (number "3" (effects (font (size 1.27 1.27))))
        )
        (pin passive line (at 7.62 0 180) (length 3.81)
          (name "Pin_4" (effects (font (size 1.27 1.27))))
          (number "4" (effects (font (size 1.27 1.27))))
        )
        (pin passive line (at -5.08 -2.54 0) (length 3.81)
          (name "Pin_5" (effects (font (size 1.27 1.27))))
          (number "5" (effects (font (size 1.27 1.27))))
        )
        (pin passive line (at 7.62 -2.54 180) (length 3.81)
          (name "Pin_6" (effects (font (size 1.27 1.27))))
          (number "6" (effects (font (size 1.27 1.27))))
        )
        (pin passive line (at -5.08 -5.08 0) (length 3.81)
          (name "Pin_7" (effects (font (size 1.27 1.27))))
          (number "7" (effects (font (size 1.27 1.27))))
        )
        (pin passive line (at 7.62 -5.08 180) (length 3.81)
          (name "Pin_8" (effects (font (size 1.27 1.27))))
          (number "8" (effects (font (size 1.27 1.27))))
        )
      )
    )
    (symbol "Connector_Generic:Conn_02x09_Odd_Even" (pin_names (offset 1.016) hide) (in_bom yes) (on_board yes)
      (property "Reference" "J" (id 0) (at 1.27 12.7 0)
        (effects (font (size 1.27 1.27)))
      )
      (property "Value" "Conn_02x09_Odd_Even" (id 1) (at 1.27 -12.7 0)
        (effects (font (size 1.27 1.27)))
      )
      (property "Footprint" "" (id 2) (at 0 0 0)
        (effects (font (size 1.27 1.27)) hide)
      )
      (property "Datasheet" "~" (id 3) (at 0 0 0)
        (effects (font (size 1.27 1.27)) hide)
      )
      (property "ki_keywords" "connector" (id 4) (at 0 0 0)
        (effects (font (size 1.27 1.27)) hide)
      )
      (property "ki_description" "Generic connector, double row, 02x09, odd/even pin numbering scheme (row 1 odd numbers, row 2 even numbers), script generated (kicad-library-utils/schlib/autogen/connector/)" (id 5) (at 0 0 0)
        (effects (font (size 1.27 1.27)) hide)
      )
      (property "ki_fp_filters" "Connector*:*_2x??_*" (id 6) (at 0 0 0)
        (effects (font (size 1.27 1.27)) hide)
      )
      (symbol "Conn_02x09_Odd_Even_1_1"
        (rectangle (start -1.27 -10.033) (end 0 -10.287)
          (stroke (width 0.1524) (type default) (color 0 0 0 0))
          (fill (type none))
        )
        (rectangle (start -1.27 -7.493) (end 0 -7.747)
          (stroke (width 0.1524) (type default) (color 0 0 0 0))
          (fill (type none))
        )
        (rectangle (start -1.27 -4.953) (end 0 -5.207)
          (stroke (width 0.1524) (type default) (color 0 0 0 0))
          (fill (type none))
        )
        (rectangle (start -1.27 -2.413) (end 0 -2.667)
          (stroke (width 0.1524) (type default) (color 0 0 0 0))
          (fill (type none))
        )
        (rectangle (start -1.27 0.127) (end 0 -0.127)
          (stroke (width 0.1524) (type default) (color 0 0 0 0))
          (fill (type none))
        )
        (rectangle (start -1.27 2.667) (end 0 2.413)
          (stroke (width 0.1524) (type default) (color 0 0 0 0))
          (fill (type none))
        )
        (rectangle (start -1.27 5.207) (end 0 4.953)
          (stroke (width 0.1524) (type default) (color 0 0 0 0))
          (fill (type none))
        )
        (rectangle (start -1.27 7.747) (end 0 7.493)
          (stroke (width 0.1524) (type default) (color 0 0 0 0))
          (fill (type none))
        )
        (rectangle (start -1.27 10.287) (end 0 10.033)
          (stroke (width 0.1524) (type default) (color 0 0 0 0))
          (fill (type none))
        )
        (rectangle (start -1.27 11.43) (end 3.81 -11.43)
          (stroke (width 0.254) (type default) (color 0 0 0 0))
          (fill (type background))
        )
        (rectangle (start 3.81 -10.033) (end 2.54 -10.287)
          (stroke (width 0.1524) (type default) (color 0 0 0 0))
          (fill (type none))
        )
        (rectangle (start 3.81 -7.493) (end 2.54 -7.747)
          (stroke (width 0.1524) (type default) (color 0 0 0 0))
          (fill (type none))
        )
        (rectangle (start 3.81 -4.953) (end 2.54 -5.207)
          (stroke (width 0.1524) (type default) (color 0 0 0 0))
          (fill (type none))
        )
        (rectangle (start 3.81 -2.413) (end 2.54 -2.667)
          (stroke (width 0.1524) (type default) (color 0 0 0 0))
          (fill (type none))
        )
        (rectangle (start 3.81 0.127) (end 2.54 -0.127)
          (stroke (width 0.1524) (type default) (color 0 0 0 0))
          (fill (type none))
        )
        (rectangle (start 3.81 2.667) (end 2.54 2.413)
          (stroke (width 0.1524) (type default) (color 0 0 0 0))
          (fill (type none))
        )
        (rectangle (start 3.81 5.207) (end 2.54 4.953)
          (stroke (width 0.1524) (type default) (color 0 0 0 0))
          (fill (type none))
        )
        (rectangle (start 3.81 7.747) (end 2.54 7.493)
          (stroke (width 0.1524) (type default) (color 0 0 0 0))
          (fill (type none))
        )
        (rectangle (start 3.81 10.287) (end 2.54 10.033)
          (stroke (width 0.1524) (type default) (color 0 0 0 0))
          (fill (type none))
        )
        (pin passive line (at -5.08 10.16 0) (length 3.81)
          (name "Pin_1" (effects (font (size 1.27 1.27))))
          (number "1" (effects (font (size 1.27 1.27))))
        )
        (pin passive line (at 7.62 0 180) (length 3.81)
          (name "Pin_10" (effects (font (size 1.27 1.27))))
          (number "10" (effects (font (size 1.27 1.27))))
        )
        (pin passive line (at -5.08 -2.54 0) (length 3.81)
          (name "Pin_11" (effects (font (size 1.27 1.27))))
          (number "11" (effects (font (size 1.27 1.27))))
        )
        (pin passive line (at 7.62 -2.54 180) (length 3.81)
          (name "Pin_12" (effects (font (size 1.27 1.27))))
          (number "12" (effects (font (size 1.27 1.27))))
        )
        (pin passive line (at -5.08 -5.08 0) (length 3.81)
          (name "Pin_13" (effects (font (size 1.27 1.27))))
          (number "13" (effects (font (size 1.27 1.27))))
        )
        (pin passive line (at 7.62 -5.08 180) (length 3.81)
          (name "Pin_14" (effects (font (size 1.27 1.27))))
          (number "14" (effects (font (size 1.27 1.27))))
        )
        (pin passive line (at -5.08 -7.62 0) (length 3.81)
          (name "Pin_15" (effects (font (size 1.27 1.27))))
          (number "15" (effects (font (size 1.27 1.27))))
        )
        (pin passive line (at 7.62 -7.62 180) (length 3.81)
          (name "Pin_16" (effects (font (size 1.27 1.27))))
          (number "16" (effects (font (size 1.27 1.27))))
        )
        (pin passive line (at -5.08 -10.16 0) (length 3.81)
          (name "Pin_17" (effects (font (size 1.27 1.27))))
          (number "17" (effects (font (size 1.27 1.27))))
        )
        (pin passive line (at 7.62 -10.16 180) (length 3.81)
          (name "Pin_18" (effects (font (size 1.27 1.27))))
          (number "18" (effects (font (size 1.27 1.27))))
        )
        (pin passive line (at 7.62 10.16 180) (length 3.81)
          (name "Pin_2" (effects (font (size 1.27 1.27))))
          (number "2" (effects (font (size 1.27 1.27))))
        )
        (pin passive line (at -5.08 7.62 0) (length 3.81)
          (name "Pin_3" (effects (font (size 1.27 1.27))))
          (number "3" (effects (font (size 1.27 1.27))))
        )
        (pin passive line (at 7.62 7.62 180) (length 3.81)
          (name "Pin_4" (effects (font (size 1.27 1.27))))
          (number "4" (effects (font (size 1.27 1.27))))
        )
        (pin passive line (at -5.08 5.08 0) (length 3.81)
          (name "Pin_5" (effects (font (size 1.27 1.27))))
          (number "5" (effects (font (size 1.27 1.27))))
        )
        (pin passive line (at 7.62 5.08 180) (length 3.81)
          (name "Pin_6" (effects (font (size 1.27 1.27))))
          (number "6" (effects (font (size 1.27 1.27))))
        )
        (pin passive line (at -5.08 2.54 0) (length 3.81)
          (name "Pin_7" (effects (font (size 1.27 1.27))))
          (number "7" (effects (font (size 1.27 1.27))))
        )
        (pin passive line (at 7.62 2.54 180) (length 3.81)
          (name "Pin_8" (effects (font (size 1.27 1.27))))
          (number "8" (effects (font (size 1.27 1.27))))
        )
        (pin passive line (at -5.08 0 0) (length 3.81)
          (name "Pin_9" (effects (font (size 1.27 1.27))))
          (number "9" (effects (font (size 1.27 1.27))))
        )
      )
    )
    (symbol "lsf-kicad:PQ9-Connector" (in_bom yes) (on_board yes)
      (property "Reference" "PQ" (id 0) (at -3.81 12.7 0)
        (effects (font (size 1.27 1.27)))
      )
      (property "Value" "PQ9-Connector" (id 1) (at 7.62 12.7 0)
        (effects (font (size 1.27 1.27)))
      )
      (property "Footprint" "lsf-kicad-lib:PQ9" (id 2) (at 10.16 -12.7 0)
        (effects (font (size 1.27 1.27)) hide)
      )
      (property "Datasheet" "https://libre.space/pq9ish" (id 3) (at 12.7 5.08 0)
        (effects (font (size 1.27 1.27)) hide)
      )
      (property "ki_keywords" "PQ9 pocketcube" (id 4) (at 0 0 0)
        (effects (font (size 1.27 1.27)) hide)
      )
      (property "ki_description" "Pocket Cube template for PQ9ISH format" (id 5) (at 0 0 0)
        (effects (font (size 1.27 1.27)) hide)
      )
      (property "ki_fp_filters" "PQ9*" (id 6) (at 0 0 0)
        (effects (font (size 1.27 1.27)) hide)
      )
      (symbol "PQ9-Connector_0_1"
        (rectangle (start -6.35 11.43) (end 7.62 -11.43)
          (stroke (width 0.254) (type default) (color 0 0 0 0))
          (fill (type background))
        )
      )
      (symbol "PQ9-Connector_1_1"
        (pin bidirectional line (at -10.16 10.16 0) (length 3.81)
          (name "1-Wire/Opt1" (effects (font (size 1.27 1.27))))
          (number "1" (effects (font (size 1.27 1.27))))
        )
        (pin bidirectional line (at -10.16 7.62 0) (length 3.81)
          (name "D-/Opt2" (effects (font (size 1.27 1.27))))
          (number "2" (effects (font (size 1.27 1.27))))
        )
        (pin bidirectional line (at -10.16 5.08 0) (length 3.81)
          (name "D+" (effects (font (size 1.27 1.27))))
          (number "3" (effects (font (size 1.27 1.27))))
        )
        (pin passive line (at 0 -15.24 90) (length 3.81) hide
          (name "GND" (effects (font (size 1.27 1.27))))
          (number "4" (effects (font (size 1.27 1.27))))
        )
        (pin power_out line (at -10.16 2.54 0) (length 3.81)
          (name "V1" (effects (font (size 1.27 1.27))))
          (number "5" (effects (font (size 1.27 1.27))))
        )
        (pin power_out line (at -10.16 0 0) (length 3.81)
          (name "V2" (effects (font (size 1.27 1.27))))
          (number "6" (effects (font (size 1.27 1.27))))
        )
        (pin power_out line (at -10.16 -2.54 0) (length 3.81)
          (name "V3" (effects (font (size 1.27 1.27))))
          (number "7" (effects (font (size 1.27 1.27))))
        )
        (pin power_out line (at -10.16 -5.08 0) (length 3.81)
          (name "V4" (effects (font (size 1.27 1.27))))
          (number "8" (effects (font (size 1.27 1.27))))
        )
        (pin power_in line (at 0 -15.24 90) (length 3.81)
          (name "GND" (effects (font (size 1.27 1.27))))
          (number "9" (effects (font (size 1.27 1.27))))
        )
      )
    )
    (symbol "power:PWR_FLAG" (power) (pin_numbers hide) (pin_names (offset 0) hide) (in_bom yes) (on_board yes)
      (property "Reference" "#FLG" (id 0) (at 0 1.905 0)
        (effects (font (size 1.27 1.27)) hide)
      )
      (property "Value" "PWR_FLAG" (id 1) (at 0 3.81 0)
        (effects (font (size 1.27 1.27)))
      )
      (property "Footprint" "" (id 2) (at 0 0 0)
        (effects (font (size 1.27 1.27)) hide)
      )
      (property "Datasheet" "~" (id 3) (at 0 0 0)
        (effects (font (size 1.27 1.27)) hide)
      )
      (property "ki_keywords" "power-flag" (id 4) (at 0 0 0)
        (effects (font (size 1.27 1.27)) hide)
      )
      (property "ki_description" "Special symbol for telling ERC where power comes from" (id 5) (at 0 0 0)
        (effects (font (size 1.27 1.27)) hide)
      )
      (symbol "PWR_FLAG_0_0"
        (pin power_out line (at 0 0 90) (length 0)
          (name "pwr" (effects (font (size 1.27 1.27))))
          (number "1" (effects (font (size 1.27 1.27))))
        )
      )
      (symbol "PWR_FLAG_0_1"
        (polyline
          (pts
            (xy 0 0)
            (xy 0 1.27)
            (xy -1.016 1.905)
            (xy 0 2.54)
            (xy 1.016 1.905)
            (xy 0 1.27)
          )
          (stroke (width 0) (type default) (color 0 0 0 0))
          (fill (type none))
        )
      )
    )
  )

  (junction (at 222.25 123.19) (diameter 0) (color 0 0 0 0)
    (uuid 0a3cc030-c9dd-4d74-9d50-715ed2b361a2)
  )
  (junction (at 95.25 64.77) (diameter 0) (color 0 0 0 0)
    (uuid 0b21a65d-d20b-411e-920a-75c343ac5136)
  )
  (junction (at 156.21 74.93) (diameter 0) (color 0 0 0 0)
    (uuid 0c30a4be-5679-499f-8c5b-5f3024f9d6cf)
  )
  (junction (at 222.25 120.65) (diameter 0) (color 0 0 0 0)
    (uuid 15875808-74d5-4210-b8ca-aa8fbc04ae21)
  )
  (junction (at 153.67 77.47) (diameter 0) (color 0 0 0 0)
    (uuid 1a1ab354-5f85-45f9-938c-9f6c4c8c3ea2)
  )
  (junction (at 102.87 69.85) (diameter 0) (color 0 0 0 0)
    (uuid 2bef89de-08c7-4a13-9d85-67948d429ca0)
  )
  (junction (at 161.29 69.85) (diameter 0) (color 0 0 0 0)
    (uuid 2f3deced-880d-4075-a81b-95c62da5b94d)
  )
  (junction (at 115.57 52.07) (diameter 0) (color 0 0 0 0)
    (uuid 327a37f4-3106-46a4-bcc5-c91beff31d2f)
  )
  (junction (at 105.41 67.31) (diameter 0) (color 0 0 0 0)
    (uuid 483f60da-14d7-4f88-8d01-3f9f30784c70)
  )
  (junction (at 107.95 64.77) (diameter 0) (color 0 0 0 0)
    (uuid 5528bcad-2950-4673-90eb-c37e6952c475)
  )
  (junction (at 92.71 80.01) (diameter 0) (color 0 0 0 0)
    (uuid 68b52f01-fa04-4908-bf88-60c62ace1cfa)
  )
  (junction (at 163.83 67.31) (diameter 0) (color 0 0 0 0)
    (uuid 786b6072-5772-4bc1-8eeb-6c4e19f2a91b)
  )
  (junction (at 166.37 64.77) (diameter 0) (color 0 0 0 0)
    (uuid 852dabbf-de45-4470-8176-59d37a754407)
  )
  (junction (at 173.99 52.07) (diameter 0) (color 0 0 0 0)
    (uuid 8cc0fa7e-b320-4a52-84c3-127f345edead)
  )
  (junction (at 153.67 64.77) (diameter 0) (color 0 0 0 0)
    (uuid 9157f4ae-0244-4ff1-9f73-3cb4cbb5f280)
  )
  (junction (at 151.13 80.01) (diameter 0) (color 0 0 0 0)
    (uuid 936e2ca6-11ae-4f42-9128-52bb329f3d21)
  )
  (junction (at 158.75 72.39) (diameter 0) (color 0 0 0 0)
    (uuid a501555e-bbc7-4b58-ad89-28a0cd3dd6d0)
  )
  (junction (at 222.25 118.11) (diameter 0) (color 0 0 0 0)
    (uuid b1169a2d-8998-4b50-a48d-c520bcc1b8e1)
  )
  (junction (at 90.17 82.55) (diameter 0) (color 0 0 0 0)
    (uuid bb4f0314-c44c-4dda-b85c-537120eaae9a)
  )
  (junction (at 100.33 72.39) (diameter 0) (color 0 0 0 0)
    (uuid cb868d2e-5efb-4bfb-8796-88435b326918)
  )
  (junction (at 148.59 82.55) (diameter 0) (color 0 0 0 0)
    (uuid cbc539d2-6a10-4052-9b7a-f10326dcac67)
  )
  (junction (at 146.05 85.09) (diameter 0) (color 0 0 0 0)
    (uuid d2de4093-1fc2-4bc1-94b6-4d0fe3426c6f)
  )
  (junction (at 95.25 77.47) (diameter 0) (color 0 0 0 0)
    (uuid d57dcfee-5058-4fc2-a68b-05f9a48f685b)
  )
  (junction (at 87.63 85.09) (diameter 0) (color 0 0 0 0)
    (uuid e83e0227-ac0f-4180-82bd-68d3a7b56476)
  )
  (junction (at 97.79 74.93) (diameter 0) (color 0 0 0 0)
    (uuid f1dd8642-b405-490b-a449-d1cc5797fda8)
  )

  (wire (pts (xy 115.57 44.45) (xy 113.03 44.45))
    (stroke (width 0) (type default) (color 0 0 0 0))
    (uuid 03c52831-5dc5-43c5-a442-8d23643b46fb)
  )
  (wire (pts (xy 102.87 111.76) (xy 102.87 101.6))
    (stroke (width 0) (type default) (color 0 0 0 0))
    (uuid 03d88a85-11fd-47aa-954c-c318bb15294a)
  )
  (wire (pts (xy 218.44 118.11) (xy 222.25 118.11))
    (stroke (width 0) (type default) (color 0 0 0 0))
    (uuid 0d0bb7b2-a6e5-46d2-9492-a1aa6e5a7b2f)
  )
  (wire (pts (xy 97.79 62.23) (xy 97.79 74.93))
    (stroke (width 0) (type default) (color 0 0 0 0))
    (uuid 0eaa98f0-9565-4637-ace3-42a5231b07f7)
  )
  (wire (pts (xy 102.87 57.15) (xy 102.87 69.85))
    (stroke (width 0) (type default) (color 0 0 0 0))
    (uuid 0f22151c-f260-4674-b486-4710a2c42a55)
  )
  (wire (pts (xy 80.01 85.09) (xy 87.63 85.09))
    (stroke (width 0) (type default) (color 0 0 0 0))
    (uuid 0f3c9e3a-9c59-4881-b27a-d0e982b3ea8e)
  )
  (wire (pts (xy 166.37 101.6) (xy 166.37 111.76))
    (stroke (width 0) (type default) (color 0 0 0 0))
    (uuid 0f41a909-27c4-4be2-9d5e-9ae2108c8ff5)
  )
  (wire (pts (xy 161.29 57.15) (xy 161.29 69.85))
    (stroke (width 0) (type default) (color 0 0 0 0))
    (uuid 0f54db53-a272-4955-88fb-d7ab00657bb0)
  )
  (wire (pts (xy 95.25 77.47) (xy 95.25 88.9))
    (stroke (width 0) (type default) (color 0 0 0 0))
    (uuid 10109f84-4940-47f8-8640-91f185ac9bc1)
  )
  (wire (pts (xy 161.29 111.76) (xy 161.29 101.6))
    (stroke (width 0) (type default) (color 0 0 0 0))
    (uuid 128e34ce-eee7-477d-b905-a493e98db783)
  )
  (wire (pts (xy 250.19 67.31) (xy 240.03 67.31))
    (stroke (width 0) (type default) (color 0 0 0 0))
    (uuid 13abf99d-5265-4779-8973-e94370fd18ff)
  )
  (wire (pts (xy 100.33 59.69) (xy 97.79 59.69))
    (stroke (width 0) (type default) (color 0 0 0 0))
    (uuid 181abe7a-f941-42b6-bd46-aaa3131f90fb)
  )
  (wire (pts (xy 100.33 57.15) (xy 100.33 54.61))
    (stroke (width 0) (type default) (color 0 0 0 0))
    (uuid 1831fb37-1c5d-42c4-b898-151be6fca9dc)
  )
  (wire (pts (xy 105.41 111.76) (xy 105.41 101.6))
    (stroke (width 0) (type default) (color 0 0 0 0))
    (uuid 1a2f72d1-0b36-4610-afc4-4ad1660d5d3b)
  )
  (wire (pts (xy 158.75 59.69) (xy 156.21 59.69))
    (stroke (width 0) (type default) (color 0 0 0 0))
    (uuid 1bf544e3-5940-4576-9291-2464e95c0ee2)
  )
  (wire (pts (xy 222.25 118.11) (xy 226.06 118.11))
    (stroke (width 0) (type default) (color 0 0 0 0))
    (uuid 1e1b062d-fad0-427c-a622-c5b8a80b5268)
  )
  (wire (pts (xy 138.43 85.09) (xy 146.05 85.09))
    (stroke (width 0) (type default) (color 0 0 0 0))
    (uuid 213a2af1-412b-47f4-ab3b-c5f43b6be7a6)
  )
  (wire (pts (xy 105.41 54.61) (xy 102.87 54.61))
    (stroke (width 0) (type default) (color 0 0 0 0))
    (uuid 29e78086-2175-405e-9ba3-c48766d2f50c)
  )
  (wire (pts (xy 107.95 54.61) (xy 107.95 64.77))
    (stroke (width 0) (type default) (color 0 0 0 0))
    (uuid 2d6db888-4e40-41c8-b701-07170fc894bc)
  )
  (wire (pts (xy 222.25 123.19) (xy 222.25 120.65))
    (stroke (width 0) (type default) (color 0 0 0 0))
    (uuid 30f15357-ce1d-48b9-93dc-7d9b1b2aa048)
  )
  (wire (pts (xy 173.99 54.61) (xy 173.99 52.07))
    (stroke (width 0) (type default) (color 0 0 0 0))
    (uuid 31e08896-1992-4725-96d9-9d2728bca7a3)
  )
  (wire (pts (xy 250.19 64.77) (xy 240.03 64.77))
    (stroke (width 0) (type default) (color 0 0 0 0))
    (uuid 32667662-ae86-4904-b198-3e95f11851bf)
  )
  (wire (pts (xy 90.17 101.6) (xy 90.17 111.76))
    (stroke (width 0) (type default) (color 0 0 0 0))
    (uuid 34871042-9d5c-4e29-abdd-a168368c3c22)
  )
  (wire (pts (xy 213.36 82.55) (xy 203.2 82.55))
    (stroke (width 0) (type default) (color 0 0 0 0))
    (uuid 35354519-a28c-40c4-befd-0943e98dea53)
  )
  (wire (pts (xy 213.36 85.09) (xy 203.2 85.09))
    (stroke (width 0) (type default) (color 0 0 0 0))
    (uuid 38f2d955-ea7a-4a21-aba6-02ae23f1bd4a)
  )
  (wire (pts (xy 156.21 59.69) (xy 156.21 54.61))
    (stroke (width 0) (type default) (color 0 0 0 0))
    (uuid 3aaee4c4-dbf7-49a5-a620-9465d8cc3ae7)
  )
  (wire (pts (xy 163.83 67.31) (xy 163.83 88.9))
    (stroke (width 0) (type default) (color 0 0 0 0))
    (uuid 3b838d52-596d-4e4d-a6ac-e4c8e7621137)
  )
  (wire (pts (xy 95.25 64.77) (xy 107.95 64.77))
    (stroke (width 0) (type default) (color 0 0 0 0))
    (uuid 3cd1bda0-18db-417d-b581-a0c50623df68)
  )
  (wire (pts (xy 138.43 69.85) (xy 161.29 69.85))
    (stroke (width 0) (type default) (color 0 0 0 0))
    (uuid 3cfcbcc7-4f45-46ab-82a8-c414c7972161)
  )
  (wire (pts (xy 156.21 62.23) (xy 153.67 62.23))
    (stroke (width 0) (type default) (color 0 0 0 0))
    (uuid 42713045-fffd-4b2d-ae1e-7232d705fb12)
  )
  (wire (pts (xy 138.43 82.55) (xy 148.59 82.55))
    (stroke (width 0) (type default) (color 0 0 0 0))
    (uuid 43891a3c-749f-498d-ba99-685a27689b0d)
  )
  (wire (pts (xy 153.67 77.47) (xy 153.67 88.9))
    (stroke (width 0) (type default) (color 0 0 0 0))
    (uuid 44d8279a-9cd1-4db6-856f-0363131605fc)
  )
  (wire (pts (xy 80.01 82.55) (xy 90.17 82.55))
    (stroke (width 0) (type default) (color 0 0 0 0))
    (uuid 46cfd089-6873-4d8b-89af-02ff30e49472)
  )
  (wire (pts (xy 105.41 67.31) (xy 105.41 88.9))
    (stroke (width 0) (type default) (color 0 0 0 0))
    (uuid 47baf4b1-0938-497d-88f9-671136aa8be7)
  )
  (wire (pts (xy 87.63 54.61) (xy 87.63 85.09))
    (stroke (width 0) (type default) (color 0 0 0 0))
    (uuid 48ab88d7-7084-4d02-b109-3ad55a30bb11)
  )
  (wire (pts (xy 213.36 105.41) (xy 203.2 105.41))
    (stroke (width 0) (type default) (color 0 0 0 0))
    (uuid 48f827a8-6e22-4a2e-abdc-c2a03098d883)
  )
  (wire (pts (xy 138.43 67.31) (xy 163.83 67.31))
    (stroke (width 0) (type default) (color 0 0 0 0))
    (uuid 4d609e7c-74c9-4ae9-a26d-946ff00c167d)
  )
  (wire (pts (xy 138.43 74.93) (xy 156.21 74.93))
    (stroke (width 0) (type default) (color 0 0 0 0))
    (uuid 4dc6088c-89a5-4db7-b3ae-db4b6396ad49)
  )
  (wire (pts (xy 148.59 82.55) (xy 148.59 88.9))
    (stroke (width 0) (type default) (color 0 0 0 0))
    (uuid 4fb02e58-160a-4a39-9f22-d0c75e82ee72)
  )
  (wire (pts (xy 100.33 101.6) (xy 100.33 111.76))
    (stroke (width 0) (type default) (color 0 0 0 0))
    (uuid 51c4dc0a-5b9f-4edf-a83f-4a12881e42ef)
  )
  (wire (pts (xy 97.79 74.93) (xy 97.79 88.9))
    (stroke (width 0) (type default) (color 0 0 0 0))
    (uuid 55e740a3-0735-4744-896e-2bf5437093b9)
  )
  (wire (pts (xy 151.13 101.6) (xy 151.13 111.76))
    (stroke (width 0) (type default) (color 0 0 0 0))
    (uuid 587a157d-dedf-4558-a037-1a94bbba1848)
  )
  (wire (pts (xy 195.58 123.19) (xy 205.74 123.19))
    (stroke (width 0) (type default) (color 0 0 0 0))
    (uuid 5b2b5c7d-f943-4634-9f0a-e9561705c49d)
  )
  (wire (pts (xy 240.03 92.71) (xy 250.19 92.71))
    (stroke (width 0) (type default) (color 0 0 0 0))
    (uuid 5cbb5968-dbb5-4b84-864a-ead1cacf75b9)
  )
  (wire (pts (xy 250.19 85.09) (xy 240.03 85.09))
    (stroke (width 0) (type default) (color 0 0 0 0))
    (uuid 62c076a3-d618-44a2-9042-9a08b3576787)
  )
  (wire (pts (xy 166.37 54.61) (xy 173.99 54.61))
    (stroke (width 0) (type default) (color 0 0 0 0))
    (uuid 6441b183-b8f2-458f-a23d-60e2b1f66dd6)
  )
  (wire (pts (xy 115.57 54.61) (xy 107.95 54.61))
    (stroke (width 0) (type default) (color 0 0 0 0))
    (uuid 66043bca-a260-4915-9fce-8a51d324c687)
  )
  (wire (pts (xy 158.75 72.39) (xy 158.75 88.9))
    (stroke (width 0) (type default) (color 0 0 0 0))
    (uuid 66116376-6967-4178-9f23-a26cdeafc400)
  )
  (wire (pts (xy 151.13 54.61) (xy 151.13 80.01))
    (stroke (width 0) (type default) (color 0 0 0 0))
    (uuid 666713b0-70f4-42df-8761-f65bc212d03b)
  )
  (wire (pts (xy 158.75 101.6) (xy 158.75 111.76))
    (stroke (width 0) (type default) (color 0 0 0 0))
    (uuid 67621f9e-0a6a-4778-ad69-04dcf300659c)
  )
  (wire (pts (xy 156.21 101.6) (xy 156.21 111.76))
    (stroke (width 0) (type default) (color 0 0 0 0))
    (uuid 68e09be7-3bbc-4443-a838-209ce20b2bef)
  )
  (wire (pts (xy 203.2 87.63) (xy 213.36 87.63))
    (stroke (width 0) (type default) (color 0 0 0 0))
    (uuid 6b25f522-8e2d-4cd8-9d5d-a2b80f60133b)
  )
  (wire (pts (xy 148.59 54.61) (xy 148.59 82.55))
    (stroke (width 0) (type default) (color 0 0 0 0))
    (uuid 6c2e273e-743c-4f1e-a647-4171f8122550)
  )
  (wire (pts (xy 80.01 67.31) (xy 105.41 67.31))
    (stroke (width 0) (type default) (color 0 0 0 0))
    (uuid 6ca3c38c-4e71-4202-b6c1-1b25f04a27ae)
  )
  (wire (pts (xy 95.25 62.23) (xy 95.25 54.61))
    (stroke (width 0) (type default) (color 0 0 0 0))
    (uuid 704d6d51-bb34-4cbf-83d8-841e208048d8)
  )
  (wire (pts (xy 92.71 80.01) (xy 92.71 88.9))
    (stroke (width 0) (type default) (color 0 0 0 0))
    (uuid 71c31975-2c45-4d18-a25a-18e07a55d11e)
  )
  (wire (pts (xy 87.63 101.6) (xy 87.63 111.76))
    (stroke (width 0) (type default) (color 0 0 0 0))
    (uuid 7447a6e7-8205-46ba-afca-d0fa8f90c95a)
  )
  (wire (pts (xy 90.17 82.55) (xy 90.17 88.9))
    (stroke (width 0) (type default) (color 0 0 0 0))
    (uuid 746ba970-8279-4e7b-aed3-f28687777c21)
  )
  (wire (pts (xy 161.29 69.85) (xy 161.29 88.9))
    (stroke (width 0) (type default) (color 0 0 0 0))
    (uuid 749dfe75-c0d6-4872-9330-29c5bbcb8ff8)
  )
  (wire (pts (xy 107.95 64.77) (xy 107.95 88.9))
    (stroke (width 0) (type default) (color 0 0 0 0))
    (uuid 77ed3941-d133-4aef-a9af-5a39322d14eb)
  )
  (wire (pts (xy 153.67 64.77) (xy 166.37 64.77))
    (stroke (width 0) (type default) (color 0 0 0 0))
    (uuid 7aed3a71-054b-4aaa-9c0a-030523c32827)
  )
  (wire (pts (xy 115.57 44.45) (xy 115.57 52.07))
    (stroke (width 0) (type default) (color 0 0 0 0))
    (uuid 7bbf981c-a063-4e30-8911-e4228e1c0743)
  )
  (wire (pts (xy 153.67 64.77) (xy 153.67 77.47))
    (stroke (width 0) (type default) (color 0 0 0 0))
    (uuid 7dc880bc-e7eb-4cce-8d8c-0b65a9dd788e)
  )
  (wire (pts (xy 80.01 74.93) (xy 97.79 74.93))
    (stroke (width 0) (type default) (color 0 0 0 0))
    (uuid 7e969d15-6cc0-4258-8b27-586608a21adb)
  )
  (wire (pts (xy 156.21 62.23) (xy 156.21 74.93))
    (stroke (width 0) (type default) (color 0 0 0 0))
    (uuid 7f3eb118-a20c-4239-b800-c9211c66847d)
  )
  (wire (pts (xy 163.83 54.61) (xy 161.29 54.61))
    (stroke (width 0) (type default) (color 0 0 0 0))
    (uuid 80094b70-85ab-4ff6-934b-60d5ee65023a)
  )
  (wire (pts (xy 97.79 62.23) (xy 95.25 62.23))
    (stroke (width 0) (type default) (color 0 0 0 0))
    (uuid 8174b4de-74b1-48db-ab8e-c8432251095b)
  )
  (wire (pts (xy 218.44 120.65) (xy 222.25 120.65))
    (stroke (width 0) (type default) (color 0 0 0 0))
    (uuid 81bbc3ff-3938-49ac-8297-ce2bcc9a42bd)
  )
  (wire (pts (xy 115.57 52.07) (xy 115.57 54.61))
    (stroke (width 0) (type default) (color 0 0 0 0))
    (uuid 82e6882f-9f6c-48bd-96e1-f3db8861b5cd)
  )
  (wire (pts (xy 97.79 101.6) (xy 97.79 111.76))
    (stroke (width 0) (type default) (color 0 0 0 0))
    (uuid 842e430f-0c35-45f3-a0b5-95ae7b7ae388)
  )
  (wire (pts (xy 213.36 102.87) (xy 203.2 102.87))
    (stroke (width 0) (type default) (color 0 0 0 0))
    (uuid 8d55e186-3e11-40e8-a65e-b36a8a00069e)
  )
  (wire (pts (xy 138.43 80.01) (xy 151.13 80.01))
    (stroke (width 0) (type default) (color 0 0 0 0))
    (uuid 909b030b-fa1a-4fe8-b1ee-422b4d9e23cf)
  )
  (wire (pts (xy 158.75 57.15) (xy 158.75 54.61))
    (stroke (width 0) (type default) (color 0 0 0 0))
    (uuid 922058ca-d09a-45fd-8394-05f3e2c1e03a)
  )
  (wire (pts (xy 102.87 57.15) (xy 100.33 57.15))
    (stroke (width 0) (type default) (color 0 0 0 0))
    (uuid 9340c285-5767-42d5-8b6d-63fe2a40ddf3)
  )
  (wire (pts (xy 213.36 72.39) (xy 203.2 72.39))
    (stroke (width 0) (type default) (color 0 0 0 0))
    (uuid 9702d639-3b1f-4825-8985-b32b9008503d)
  )
  (wire (pts (xy 148.59 101.6) (xy 148.59 111.76))
    (stroke (width 0) (type default) (color 0 0 0 0))
    (uuid 9762c9ed-64d8-4f3e-baf6-f6ba6effc919)
  )
  (wire (pts (xy 161.29 57.15) (xy 158.75 57.15))
    (stroke (width 0) (type default) (color 0 0 0 0))
    (uuid 97fe9c60-586f-4895-8504-4d3729f5f81a)
  )
  (wire (pts (xy 138.43 64.77) (xy 153.67 64.77))
    (stroke (width 0) (type default) (color 0 0 0 0))
    (uuid 9a9f2d82-f64d-4264-8bec-c182528fc4de)
  )
  (wire (pts (xy 205.74 118.11) (xy 195.58 118.11))
    (stroke (width 0) (type default) (color 0 0 0 0))
    (uuid 9c8ccb2a-b1e9-4f2c-94fe-301b5975277e)
  )
  (wire (pts (xy 80.01 80.01) (xy 92.71 80.01))
    (stroke (width 0) (type default) (color 0 0 0 0))
    (uuid 9d984d1b-8097-407f-92f3-3ef68867dcfa)
  )
  (wire (pts (xy 205.74 120.65) (xy 195.58 120.65))
    (stroke (width 0) (type default) (color 0 0 0 0))
    (uuid a03e565f-d8cd-4032-aae3-b7327d4143dd)
  )
  (wire (pts (xy 213.36 67.31) (xy 203.2 67.31))
    (stroke (width 0) (type default) (color 0 0 0 0))
    (uuid a06e8e78-f567-42e6-b645-013b1073ca31)
  )
  (wire (pts (xy 105.41 54.61) (xy 105.41 67.31))
    (stroke (width 0) (type default) (color 0 0 0 0))
    (uuid a1823eb2-fb0d-4ed8-8b96-04184ac3a9d5)
  )
  (wire (pts (xy 250.19 69.85) (xy 240.03 69.85))
    (stroke (width 0) (type default) (color 0 0 0 0))
    (uuid a7520ad3-0f8b-4788-92d4-8ffb277041e6)
  )
  (wire (pts (xy 250.19 72.39) (xy 240.03 72.39))
    (stroke (width 0) (type default) (color 0 0 0 0))
    (uuid a795f1ba-cdd5-4cc5-9a52-08586e982934)
  )
  (wire (pts (xy 95.25 101.6) (xy 95.25 111.76))
    (stroke (width 0) (type default) (color 0 0 0 0))
    (uuid a9ec539a-d80d-40cc-803c-12b6adefe42a)
  )
  (wire (pts (xy 240.03 90.17) (xy 250.19 90.17))
    (stroke (width 0) (type default) (color 0 0 0 0))
    (uuid afb8e687-4a13-41a1-b8c0-89a749e897fe)
  )
  (wire (pts (xy 107.95 101.6) (xy 107.95 111.76))
    (stroke (width 0) (type default) (color 0 0 0 0))
    (uuid afd3dbad-e7a8-4e4c-b77c-4065a69aefa2)
  )
  (wire (pts (xy 173.99 44.45) (xy 171.45 44.45))
    (stroke (width 0) (type default) (color 0 0 0 0))
    (uuid b5352a33-563a-4ffe-a231-2e68fb54afa3)
  )
  (wire (pts (xy 80.01 77.47) (xy 95.25 77.47))
    (stroke (width 0) (type default) (color 0 0 0 0))
    (uuid b8c83ad1-b3c9-495c-bdc6-62dead00f5ad)
  )
  (wire (pts (xy 158.75 59.69) (xy 158.75 72.39))
    (stroke (width 0) (type default) (color 0 0 0 0))
    (uuid bdc7face-9f7c-4701-80bb-4cc144448db1)
  )
  (wire (pts (xy 166.37 64.77) (xy 166.37 54.61))
    (stroke (width 0) (type default) (color 0 0 0 0))
    (uuid bfc0aadc-38cf-466e-a642-68fdc3138c78)
  )
  (wire (pts (xy 102.87 69.85) (xy 102.87 88.9))
    (stroke (width 0) (type default) (color 0 0 0 0))
    (uuid c022004a-c968-410e-b59e-fbab0e561e9d)
  )
  (wire (pts (xy 153.67 62.23) (xy 153.67 54.61))
    (stroke (width 0) (type default) (color 0 0 0 0))
    (uuid c0515cd2-cdaa-467e-8354-0f6eadfa35c9)
  )
  (wire (pts (xy 153.67 101.6) (xy 153.67 111.76))
    (stroke (width 0) (type default) (color 0 0 0 0))
    (uuid c19dbe3c-ced0-48f7-a91d-777569cfb936)
  )
  (wire (pts (xy 100.33 59.69) (xy 100.33 72.39))
    (stroke (width 0) (type default) (color 0 0 0 0))
    (uuid c41b3c8b-634e-435a-b582-96b83bbd4032)
  )
  (wire (pts (xy 195.58 125.73) (xy 205.74 125.73))
    (stroke (width 0) (type default) (color 0 0 0 0))
    (uuid c70d9ef3-bfeb-47e0-a1e1-9aeba3da7864)
  )
  (wire (pts (xy 163.83 111.76) (xy 163.83 101.6))
    (stroke (width 0) (type default) (color 0 0 0 0))
    (uuid c801d42e-dd94-493e-bd2f-6c3ddad43f55)
  )
  (wire (pts (xy 166.37 64.77) (xy 166.37 88.9))
    (stroke (width 0) (type default) (color 0 0 0 0))
    (uuid cbdcaa78-3bbc-413f-91bf-2709119373ce)
  )
  (wire (pts (xy 97.79 59.69) (xy 97.79 54.61))
    (stroke (width 0) (type default) (color 0 0 0 0))
    (uuid ce83728b-bebd-48c2-8734-b6a50d837931)
  )
  (wire (pts (xy 218.44 125.73) (xy 222.25 125.73))
    (stroke (width 0) (type default) (color 0 0 0 0))
    (uuid d1262c4d-2245-4c4f-8f35-7bb32cd9e21e)
  )
  (wire (pts (xy 222.25 125.73) (xy 222.25 123.19))
    (stroke (width 0) (type default) (color 0 0 0 0))
    (uuid d22e95aa-f3db-4fbc-a331-048a2523233e)
  )
  (wire (pts (xy 173.99 52.07) (xy 173.99 44.45))
    (stroke (width 0) (type default) (color 0 0 0 0))
    (uuid d2406cdc-c8d0-4ec8-8a43-198e798a754d)
  )
  (wire (pts (xy 163.83 54.61) (xy 163.83 67.31))
    (stroke (width 0) (type default) (color 0 0 0 0))
    (uuid d4a1d3c4-b315-4bec-9220-d12a9eab51e0)
  )
  (wire (pts (xy 222.25 120.65) (xy 222.25 118.11))
    (stroke (width 0) (type default) (color 0 0 0 0))
    (uuid d8603679-3e7b-4337-8dbc-1827f5f54d8a)
  )
  (wire (pts (xy 240.03 87.63) (xy 250.19 87.63))
    (stroke (width 0) (type default) (color 0 0 0 0))
    (uuid da469d11-a8a4-414b-9449-d151eeaf4853)
  )
  (wire (pts (xy 203.2 90.17) (xy 213.36 90.17))
    (stroke (width 0) (type default) (color 0 0 0 0))
    (uuid dabe541b-b164-4180-97a4-5ca761b86800)
  )
  (wire (pts (xy 138.43 72.39) (xy 158.75 72.39))
    (stroke (width 0) (type default) (color 0 0 0 0))
    (uuid db83d0af-e085-4050-8496-fa2ebdecbd62)
  )
  (wire (pts (xy 218.44 123.19) (xy 222.25 123.19))
    (stroke (width 0) (type default) (color 0 0 0 0))
    (uuid dd00c2e1-6027-4717-b312-4fab3ee52002)
  )
  (wire (pts (xy 87.63 85.09) (xy 87.63 88.9))
    (stroke (width 0) (type default) (color 0 0 0 0))
    (uuid e10b5627-3247-4c86-b9f6-ef474ca11543)
  )
  (wire (pts (xy 203.2 92.71) (xy 213.36 92.71))
    (stroke (width 0) (type default) (color 0 0 0 0))
    (uuid e12e827e-36be-4503-8eef-6fc7e8bc5d49)
  )
  (wire (pts (xy 146.05 101.6) (xy 146.05 111.76))
    (stroke (width 0) (type default) (color 0 0 0 0))
    (uuid e25ce415-914a-48fe-bf09-324317917b2e)
  )
  (wire (pts (xy 146.05 85.09) (xy 146.05 88.9))
    (stroke (width 0) (type default) (color 0 0 0 0))
    (uuid e615f7aa-337e-474d-9615-2ad82b1c44ca)
  )
  (wire (pts (xy 146.05 54.61) (xy 146.05 85.09))
    (stroke (width 0) (type default) (color 0 0 0 0))
    (uuid e857610b-4434-4144-b04e-43c1ebdc5ceb)
  )
  (wire (pts (xy 250.19 82.55) (xy 240.03 82.55))
    (stroke (width 0) (type default) (color 0 0 0 0))
    (uuid e9bb29b2-2bb9-4ea2-acd9-2bb3ca677a12)
  )
  (wire (pts (xy 156.21 74.93) (xy 156.21 88.9))
    (stroke (width 0) (type default) (color 0 0 0 0))
    (uuid eb667eea-300e-4ca7-8a6f-4b00de80cd45)
  )
  (wire (pts (xy 138.43 77.47) (xy 153.67 77.47))
    (stroke (width 0) (type default) (color 0 0 0 0))
    (uuid ebadd2a5-21ab-4a7e-b5bc-6f737367e560)
  )
  (wire (pts (xy 213.36 69.85) (xy 203.2 69.85))
    (stroke (width 0) (type default) (color 0 0 0 0))
    (uuid ec9e24d8-d1c5-40e2-9812-dc315d05f470)
  )
  (wire (pts (xy 92.71 101.6) (xy 92.71 111.76))
    (stroke (width 0) (type default) (color 0 0 0 0))
    (uuid ef1b4b98-541b-4673-a04f-2043250fc40a)
  )
  (wire (pts (xy 151.13 80.01) (xy 151.13 88.9))
    (stroke (width 0) (type default) (color 0 0 0 0))
    (uuid ef8fe2ac-6a7f-4682-9418-b801a1b10a3b)
  )
  (wire (pts (xy 80.01 72.39) (xy 100.33 72.39))
    (stroke (width 0) (type default) (color 0 0 0 0))
    (uuid f022716e-b121-4cbf-a833-20e924070c22)
  )
  (wire (pts (xy 100.33 72.39) (xy 100.33 88.9))
    (stroke (width 0) (type default) (color 0 0 0 0))
    (uuid f4f99e3d-7269-4f6a-a759-16ad2a258779)
  )
  (wire (pts (xy 90.17 54.61) (xy 90.17 82.55))
    (stroke (width 0) (type default) (color 0 0 0 0))
    (uuid f71da641-16e6-4257-80c3-0b9d804fee4f)
  )
  (wire (pts (xy 213.36 64.77) (xy 203.2 64.77))
    (stroke (width 0) (type default) (color 0 0 0 0))
    (uuid f9865a9f-edb8-49c7-828f-4896e1f3047a)
  )
  (wire (pts (xy 80.01 64.77) (xy 95.25 64.77))
    (stroke (width 0) (type default) (color 0 0 0 0))
    (uuid fb03d859-dcc9-4533-b352-64830e0e5423)
  )
  (wire (pts (xy 80.01 69.85) (xy 102.87 69.85))
    (stroke (width 0) (type default) (color 0 0 0 0))
    (uuid fc0a4225-db46-4d48-8163-d522602d57cd)
  )
  (wire (pts (xy 92.71 54.61) (xy 92.71 80.01))
    (stroke (width 0) (type default) (color 0 0 0 0))
    (uuid fd470e95-4861-44fe-b1e4-6d8a7c66e144)
  )
  (wire (pts (xy 95.25 64.77) (xy 95.25 77.47))
    (stroke (width 0) (type default) (color 0 0 0 0))
    (uuid fe8d9267-7834-48d6-a191-c8724b2ee78d)
  )

  (label "V3" (at 203.2 87.63 0)
    (effects (font (size 1.524 1.524)) (justify left bottom))
    (uuid 0088d107-13d8-496c-8da6-7bbeb9d096b0)
  )
  (label "V4" (at 195.58 125.73 0)
    (effects (font (size 1.524 1.524)) (justify left bottom))
    (uuid 0147f16a-c952-4891-8f53-a9fb8cddeb8d)
  )
  (label "GND" (at 153.67 111.76 90)
    (effects (font (size 1.524 1.524)) (justify left bottom))
    (uuid 0867287d-2e6a-4d69-a366-c29f88198f2b)
  )
  (label "D-" (at 203.2 67.31 0)
    (effects (font (size 1.524 1.524)) (justify left bottom))
    (uuid 0d35483a-0b12-46cc-b9f2-896fd6831779)
  )
  (label "V1" (at 97.79 111.76 90)
    (effects (font (size 1.524 1.524)) (justify left bottom))
    (uuid 0dcdf1b8-13c6-48b4-bd94-5d26038ff231)
  )
  (label "GND" (at 107.95 111.76 90)
    (effects (font (size 1.524 1.524)) (justify left bottom))
    (uuid 1b54105e-6590-4d26-a763-ecfcf81eedc4)
  )
  (label "1W" (at 146.05 111.76 90)
    (effects (font (size 1.524 1.524)) (justify left bottom))
    (uuid 25e86a19-da0a-4a9e-8a32-c095bf59368e)
  )
  (label "D+" (at 92.71 111.76 90)
    (effects (font (size 1.524 1.524)) (justify left bottom))
    (uuid 2bf3f24b-fd30-41a7-a274-9b519491916b)
  )
  (label "V1" (at 156.21 111.76 90)
    (effects (font (size 1.524 1.524)) (justify left bottom))
    (uuid 3172f2e2-18d2-4a80-ae30-5707b3409798)
  )
  (label "GND" (at 240.03 82.55 0)
    (effects (font (size 1.524 1.524)) (justify left bottom))
    (uuid 3f5fe6b7-98fc-4d3e-9567-f9f7202d1455)
  )
  (label "V1" (at 203.2 82.55 0)
    (effects (font (size 1.524 1.524)) (justify left bottom))
    (uuid 417f13e4-c121-485a-a6b5-8b55e70350b8)
  )
  (label "GND" (at 203.2 72.39 0)
    (effects (font (size 1.524 1.524)) (justify left bottom))
    (uuid 4412226e-d975-40a2-921f-502ff4129a95)
  )
  (label "D-" (at 240.03 69.85 0)
    (effects (font (size 1.524 1.524)) (justify left bottom))
    (uuid 46918595-4a45-48e8-84c0-961b4db7f35f)
  )
  (label "GND" (at 95.25 111.76 90)
    (effects (font (size 1.524 1.524)) (justify left bottom))
    (uuid 4831966c-bb32-4bc8-a400-0382a02ffa1c)
  )
  (label "V1" (at 195.58 118.11 0)
    (effects (font (size 1.524 1.524)) (justify left bottom))
    (uuid 4e3d7c0d-12e3-42f2-b944-e4bcdbbcac2a)
  )
  (label "D+" (at 203.2 69.85 0)
    (effects (font (size 1.524 1.524)) (justify left bottom))
    (uuid 4e66a44f-7fa6-4e16-bf9b-62ec864301a5)
  )
  (label "1W" (at 87.63 111.76 90)
    (effects (font (size 1.524 1.524)) (justify left bottom))
    (uuid 53c85970-3e21-4fae-a84f-721cfc0513b5)
  )
  (label "V3" (at 102.87 111.76 90)
    (effects (font (size 1.524 1.524)) (justify left bottom))
    (uuid 58dc14f9-c158-4824-a84e-24a6a482a7a4)
  )
  (label "GND" (at 166.37 111.76 90)
    (effects (font (size 1.524 1.524)) (justify left bottom))
    (uuid 632acde9-b7fd-4f04-8cb4-d2cbb06b3595)
  )
  (label "V3" (at 195.58 123.19 0)
    (effects (font (size 1.524 1.524)) (justify left bottom))
    (uuid 6a44418c-7bb4-4e99-8836-57f153c19721)
  )
  (label "V4" (at 203.2 90.17 0)
    (effects (font (size 1.524 1.524)) (justify left bottom))
    (uuid 6a780180-586a-4241-a52d-dc7a5ffcc966)
  )
  (label "V3" (at 240.03 87.63 0)
    (effects (font (size 1.524 1.524)) (justify left bottom))
    (uuid 6a955fc7-39d9-4c75-9a69-676ca8c0b9b2)
  )
  (label "1W" (at 203.2 64.77 0)
    (effects (font (size 1.524 1.524)) (justify left bottom))
    (uuid 6f85a2c4-6a6d-46d7-8878-ebbe384fa171)
  )
  (label "V2" (at 158.75 111.76 90)
    (effects (font (size 1.524 1.524)) (justify left bottom))
    (uuid 712d6a7d-2b62-464f-b745-fd2a6b0187f6)
  )
  (label "D+" (at 151.13 111.76 90)
    (effects (font (size 1.524 1.524)) (justify left bottom))
    (uuid 75286985-9fa5-4d30-89c5-493b6e63cd66)
  )
  (label "D-" (at 148.59 111.76 90)
    (effects (font (size 1.524 1.524)) (justify left bottom))
    (uuid 78f88cf6-751c-4e9b-ae75-fb8b6d44ff39)
  )
  (label "V" (at 226.06 118.11 180)
    (effects (font (size 1.524 1.524)) (justify right bottom))
    (uuid 8322f275-268c-4e87-a69f-4cfbf05e747f)
  )
  (label "GND" (at 240.03 64.77 0)
    (effects (font (size 1.524 1.524)) (justify left bottom))
    (uuid 94c158d1-8503-4553-b511-bf42f506c2a8)
  )
  (label "1W" (at 240.03 72.39 0)
    (effects (font (size 1.524 1.524)) (justify left bottom))
    (uuid 9844371c-876d-44c9-bacb-3674100dd4fd)
  )
  (label "V4" (at 163.83 111.76 90)
    (effects (font (size 1.524 1.524)) (justify left bottom))
    (uuid 98e81e80-1f85-4152-be3f-99785ea97751)
  )
  (label "D+" (at 240.03 67.31 0)
    (effects (font (size 1.524 1.524)) (justify left bottom))
    (uuid 9ccf03e8-755a-4cd9-96fc-30e1d08fa253)
  )
  (label "GND" (at 203.2 92.71 0)
    (effects (font (size 1.524 1.524)) (justify left bottom))
    (uuid 9dab0cb7-2557-4419-963b-5ae736517f62)
  )
  (label "V2" (at 195.58 120.65 0)
    (effects (font (size 1.524 1.524)) (justify left bottom))
    (uuid aa02e544-13f5-4cf8-a5f4-3e6cda006090)
  )
  (label "V3" (at 161.29 111.76 90)
    (effects (font (size 1.524 1.524)) (justify left bottom))
    (uuid b3d08afa-f296-4e3b-8825-73b6331d35bf)
  )
  (label "V1" (at 240.03 92.71 0)
    (effects (font (size 1.524 1.524)) (justify left bottom))
    (uuid bb7f0588-d4d8-44bf-9ebf-3c533fe4d6ae)
  )
  (label "V2" (at 203.2 85.09 0)
    (effects (font (size 1.524 1.524)) (justify left bottom))
    (uuid c201e1b2-fc01-4110-bdaa-a33290468c83)
  )
  (label "D-" (at 90.17 111.76 90)
    (effects (font (size 1.524 1.524)) (justify left bottom))
    (uuid c264c438-a475-4ad4-9915-0f1e6ecf3053)
  )
  (label "V" (at 203.2 102.87 0)
    (effects (font (size 1.524 1.524)) (justify left bottom))
    (uuid cef6f603-8a0b-4dd0-af99-ebfbef7d1b4b)
  )
  (label "V2" (at 100.33 111.76 90)
    (effects (font (size 1.524 1.524)) (justify left bottom))
    (uuid dde3dba8-1b81-466c-93a3-c284ff4da1ef)
  )
  (label "V4" (at 240.03 85.09 0)
    (effects (font (size 1.524 1.524)) (justify left bottom))
    (uuid e8314017-7be6-4011-9179-37449a29b311)
  )
  (label "GND" (at 203.2 105.41 0)
    (effects (font (size 1.524 1.524)) (justify left bottom))
    (uuid e877bf4a-4210-4bd3-b7b0-806eb4affc5b)
  )
  (label "V2" (at 240.03 90.17 0)
    (effects (font (size 1.524 1.524)) (justify left bottom))
    (uuid f1830a1b-f0cc-47ae-a2c9-679c82032f14)
  )
  (label "V4" (at 105.41 111.76 90)
    (effects (font (size 1.524 1.524)) (justify left bottom))
    (uuid f976e2cc-36f9-4479-a816-2c74d1d5da6f)
  )

  (symbol (lib_id "lsf-kicad:PQ9-Connector") (at 97.79 44.45 90) (unit 1)
    (in_bom yes) (on_board yes)
    (uuid 00000000-0000-0000-0000-00005a2ae350)
    (property "Reference" "PQ1" (id 0) (at 110.49 38.1 90)
      (effects (font (size 1.27 1.27)) (justify right))
    )
    (property "Value" "PQ9-Connector" (id 1) (at 110.49 40.64 90)
      (effects (font (size 1.27 1.27)) (justify right))
    )
    (property "Footprint" "lsf-kicad-lib:PQ9" (id 2) (at 97.79 44.45 0)
      (effects (font (size 1.27 1.27)) hide)
    )
    (property "Datasheet" "" (id 3) (at 97.79 44.45 0)
      (effects (font (size 1.27 1.27)) hide)
    )
    (pin "1" (uuid 8e061d6b-f4fa-4c56-b49e-b178c1912f21))
    (pin "2" (uuid 30abfde3-8899-462f-9f7f-36d43682c0c4))
    (pin "3" (uuid 9f71d08d-6015-45cd-b535-14bc18bc9e5f))
    (pin "4" (uuid 265f33cd-d975-4da0-9a01-2f53aff7dbb0))
    (pin "5" (uuid bbb5ffe3-7294-40ec-b05b-22e2331f20af))
    (pin "6" (uuid 0e49aa81-d18a-4b07-a30e-e332fa277fd6))
    (pin "7" (uuid 7eacce9b-6a99-449c-b1c0-6664aab3af99))
    (pin "8" (uuid 006df5c9-df96-435c-9528-42795332007b))
    (pin "9" (uuid a1689a74-97ee-4a38-99d9-b81083f6c9ca))
  )

  (symbol (lib_id "Connector_Generic:Conn_01x09") (at 74.93 74.93 180) (unit 1)
    (in_bom yes) (on_board yes)
    (uuid 00000000-0000-0000-0000-00005a2ae50a)
    (property "Reference" "P1" (id 0) (at 76.9874 59.055 0))
    (property "Value" "CONN_01X09" (id 1) (at 76.9874 61.3664 0))
    (property "Footprint" "Pin_Headers:Pin_Header_Straight_1x09" (id 2) (at 74.93 74.93 0)
      (effects (font (size 1.27 1.27)) hide)
    )
    (property "Datasheet" "" (id 3) (at 74.93 74.93 0))
    (pin "1" (uuid 1112b7d9-fa55-49d2-a6fe-e666f391852c))
    (pin "2" (uuid ad910868-43a9-4fe8-93b1-4c254bd7f5b8))
    (pin "3" (uuid 84f4a80d-ac01-4c0e-a15b-9186acd006b1))
    (pin "4" (uuid 0bfc7916-d2b0-41aa-abaf-fcd59afa0688))
    (pin "5" (uuid e0baf026-1c37-4629-b35d-a55cc0930042))
    (pin "6" (uuid cf533c45-c632-483f-ae69-36538f7b8a37))
    (pin "7" (uuid 01a19697-1787-44f1-b107-b6569570ef96))
    (pin "8" (uuid 57d94033-126d-420d-8b3a-9b7fbf7eeca1))
    (pin "9" (uuid ca139955-ae4a-4f12-baae-1edc1b1ba6cf))
  )

  (symbol (lib_id "Connector_Generic:Conn_02x09_Odd_Even") (at 97.79 96.52 270) (mirror x) (unit 1)
    (in_bom yes) (on_board yes)
    (uuid 00000000-0000-0000-0000-00005a2ae6ae)
    (property "Reference" "P2" (id 0) (at 109.9312 97.6884 90)
      (effects (font (size 1.27 1.27)) (justify left))
    )
    (property "Value" "CONN_02X09" (id 1) (at 109.9312 95.377 90)
      (effects (font (size 1.27 1.27)) (justify left))
    )
    (property "Footprint" "Pin_Headers:Pin_Header_Straight_2x09" (id 2) (at 67.31 96.52 0)
      (effects (font (size 1.27 1.27)) hide)
    )
    (property "Datasheet" "" (id 3) (at 67.31 96.52 0))
    (pin "1" (uuid bfad70dc-5721-4839-82a0-2802710cc839))
    (pin "10" (uuid d34cc54b-27f2-48ec-8321-de92a59c0319))
    (pin "11" (uuid 33bd04f3-9a8e-4dbf-b6ed-9b91448781b6))
    (pin "12" (uuid 4957628a-0487-4b2e-9e46-2b76a5391512))
    (pin "13" (uuid 0b5ec94a-26df-467c-a489-3c8bcd3fe13d))
    (pin "14" (uuid 0d7b6121-7f90-44b2-bdc3-d3f8e3779c1e))
    (pin "15" (uuid eebda813-c0ff-4750-af93-f7ebc01bf0ac))
    (pin "16" (uuid 8405edac-9de7-4481-af71-7960a3faa202))
    (pin "17" (uuid a82e494b-5509-4de2-b2b6-cdfa76ec8710))
    (pin "18" (uuid f3517870-3b27-421a-a161-e82745a8c4b6))
    (pin "2" (uuid 20d25cef-ebb6-4a11-9c91-dc241224cf11))
    (pin "3" (uuid e8530dea-0420-47e6-8fcf-1fefae5679ea))
    (pin "4" (uuid 463a00df-9337-43a7-8023-0c4d9fba780e))
    (pin "5" (uuid fab6aafd-62f0-4c54-8d42-c94ad0e837c8))
    (pin "6" (uuid 80298442-b7af-407f-8822-aa8223e7a3c9))
    (pin "7" (uuid 2ce15560-87e2-4227-ac08-0adeae2f86f4))
    (pin "8" (uuid 3e3a6d12-2d26-4cac-b4d5-aabf78002216))
    (pin "9" (uuid 889a510c-3737-42aa-a732-dc3c30027ec5))
  )

  (symbol (lib_id "Connector_Generic:Conn_01x09") (at 133.35 74.93 180) (unit 1)
    (in_bom yes) (on_board yes)
    (uuid 00000000-0000-0000-0000-00005a2aec36)
    (property "Reference" "P3" (id 0) (at 135.4074 59.055 0))
    (property "Value" "CONN_01X09" (id 1) (at 135.4074 61.3664 0))
    (property "Footprint" "Pin_Headers:Pin_Header_Straight_1x09" (id 2) (at 133.35 74.93 0)
      (effects (font (size 1.27 1.27)) hide)
    )
    (property "Datasheet" "" (id 3) (at 133.35 74.93 0))
    (pin "1" (uuid d2a5c7fa-a638-42df-b408-a5c6cc7814fa))
    (pin "2" (uuid 4af07634-b07f-4b29-9457-1c5104aca8af))
    (pin "3" (uuid 3f63a435-d6c2-4adb-81cf-02dd962312f4))
    (pin "4" (uuid dff213c9-5d5d-455f-9b97-de37474c14fb))
    (pin "5" (uuid 985ba94a-d15e-4f0c-b099-98e000cd2789))
    (pin "6" (uuid 157f825a-1e00-4887-8c58-60ef9269fb2d))
    (pin "7" (uuid fee4a5ce-935e-426d-9e73-a8dba3233459))
    (pin "8" (uuid 275c3e87-6b92-4445-ae44-835199568f46))
    (pin "9" (uuid 102e44d6-9086-4c43-bf41-0a02d894bf05))
  )

  (symbol (lib_id "Connector_Generic:Conn_02x09_Odd_Even") (at 156.21 96.52 270) (mirror x) (unit 1)
    (in_bom yes) (on_board yes)
    (uuid 00000000-0000-0000-0000-00005a2aec3c)
    (property "Reference" "P4" (id 0) (at 168.3512 97.6884 90)
      (effects (font (size 1.27 1.27)) (justify left))
    )
    (property "Value" "CONN_02X09" (id 1) (at 168.3512 95.377 90)
      (effects (font (size 1.27 1.27)) (justify left))
    )
    (property "Footprint" "Pin_Headers:Pin_Header_Straight_2x09" (id 2) (at 125.73 96.52 0)
      (effects (font (size 1.27 1.27)) hide)
    )
    (property "Datasheet" "" (id 3) (at 125.73 96.52 0))
    (pin "1" (uuid 29a1b362-06a3-42e9-a1e1-a3b8ef03e810))
    (pin "10" (uuid 7ddb5057-4bdd-4fd5-8037-7e1e981d1855))
    (pin "11" (uuid b9cf334a-4975-4133-9f18-324d40fb7d09))
    (pin "12" (uuid 0a8d4dd3-7105-4b30-a701-b67f075af297))
    (pin "13" (uuid c9e9b289-1696-472f-9dcb-0b8454f399d4))
    (pin "14" (uuid f737082e-9fc4-457b-ba13-81acb9605960))
    (pin "15" (uuid 9419e78b-9e61-4ca5-9279-602aa547626b))
    (pin "16" (uuid 60e7850f-d81d-4b57-a82d-002416a7a2a2))
    (pin "17" (uuid b5f0b2f7-9d7a-4cfe-95f6-7f8d8f0ea924))
    (pin "18" (uuid 56356899-a9e3-41fd-8c4c-0c80e109cfb5))
    (pin "2" (uuid 4283e454-fb39-4511-ae32-f6f8586c185f))
    (pin "3" (uuid d3ee6eac-d3bf-4f23-b360-491cc573114b))
    (pin "4" (uuid 7ae22fb7-ff4b-4829-9c6e-5be5a40c61c9))
    (pin "5" (uuid f37159fc-72e9-43ee-8500-3ad58de797db))
    (pin "6" (uuid cde024c4-a721-4c4e-b010-812640b4dd04))
    (pin "7" (uuid eaaeb60d-ab0b-4c7b-98d2-5a8912701709))
    (pin "8" (uuid add7d8c1-b8be-48d6-ac0f-eb1dc71172de))
    (pin "9" (uuid 11144e59-10a0-41f7-a9d6-bbbd2d208879))
  )

  (symbol (lib_id "Connector_Generic:Conn_01x04") (at 218.44 67.31 0) (unit 1)
    (in_bom yes) (on_board yes)
    (uuid 00000000-0000-0000-0000-00005a2aef89)
    (property "Reference" "P6" (id 0) (at 220.4212 66.2686 0)
      (effects (font (size 1.27 1.27)) (justify left))
    )
    (property "Value" "CONN_01X04" (id 1) (at 220.4212 68.58 0)
      (effects (font (size 1.27 1.27)) (justify left))
    )
    (property "Footprint" "Pin_Headers:Pin_Header_Straight_1x04" (id 2) (at 218.44 67.31 0)
      (effects (font (size 1.27 1.27)) hide)
    )
    (property "Datasheet" "" (id 3) (at 218.44 67.31 0))
    (pin "1" (uuid 1400b28e-0ae9-49ae-b232-acc149de5fa7))
    (pin "2" (uuid 41dfcb4b-4be6-46cc-bd52-5a4ae84f1893))
    (pin "3" (uuid 42ff67e1-2f56-4a19-81d1-e5f22a2b9110))
    (pin "4" (uuid fb61a683-83da-47d7-a930-042655a2d475))
  )

  (symbol (lib_id "Connector_Generic:Conn_01x05") (at 218.44 87.63 0) (unit 1)
    (in_bom yes) (on_board yes)
    (uuid 00000000-0000-0000-0000-00005a2af845)
    (property "Reference" "P7" (id 0) (at 220.4212 86.5886 0)
      (effects (font (size 1.27 1.27)) (justify left))
    )
    (property "Value" "CONN_01X05" (id 1) (at 220.4212 88.9 0)
      (effects (font (size 1.27 1.27)) (justify left))
    )
    (property "Footprint" "Pin_Headers:Pin_Header_Straight_1x05" (id 2) (at 218.44 87.63 0)
      (effects (font (size 1.27 1.27)) hide)
    )
    (property "Datasheet" "" (id 3) (at 218.44 87.63 0))
    (pin "1" (uuid e8bbd270-d7de-48a7-8761-9faf7032a12f))
    (pin "2" (uuid 8a4524ad-8c8d-412a-b355-fd4795b692d3))
    (pin "3" (uuid 6798fa25-2964-4341-bb01-c409d4da9cf7))
    (pin "4" (uuid 01eecbde-a293-4e72-9ab7-4a5a43218203))
    (pin "5" (uuid 360ca8ec-0b3c-49cc-b043-c78dd2637480))
  )

  (symbol (lib_id "Connector_Generic:Conn_01x02") (at 218.44 102.87 0) (unit 1)
    (in_bom yes) (on_board yes)
    (uuid 00000000-0000-0000-0000-00005a2afdb4)
    (property "Reference" "P8" (id 0) (at 220.4212 101.8286 0)
      (effects (font (size 1.27 1.27)) (justify left))
    )
    (property "Value" "CONN_01X02" (id 1) (at 220.4212 104.14 0)
      (effects (font (size 1.27 1.27)) (justify left))
    )
    (property "Footprint" "lsf-kicad-lib:mkds_1,5-2" (id 2) (at 218.44 102.87 0)
      (effects (font (size 1.27 1.27)) hide)
    )
    (property "Datasheet" "" (id 3) (at 218.44 102.87 0))
    (pin "1" (uuid e0b786a3-bcaf-41c0-99ce-8c7f040aa44d))
    (pin "2" (uuid a0d60062-2053-43e0-93e8-dc89fb17b24a))
  )

  (symbol (lib_id "Connector_Generic:Conn_02x04_Odd_Even") (at 210.82 120.65 0) (unit 1)
    (in_bom yes) (on_board yes)
    (uuid 00000000-0000-0000-0000-00005a2b00e6)
    (property "Reference" "P5" (id 0) (at 210.82 111.379 0))
    (property "Value" "CONN_02X04" (id 1) (at 210.82 113.6904 0))
    (property "Footprint" "Pin_Headers:Pin_Header_Straight_2x04" (id 2) (at 210.82 151.13 0)
      (effects (font (size 1.27 1.27)) hide)
    )
    (property "Datasheet" "" (id 3) (at 210.82 151.13 0))
    (pin "1" (uuid e6964a64-2f3d-40aa-86b8-a22bb6a9b241))
    (pin "2" (uuid b0a56ec1-5a34-4ab9-8fbd-7223052d0bea))
    (pin "3" (uuid ada8c3f4-0b24-4795-b091-159adfdeb182))
    (pin "4" (uuid 5bbb6be7-0183-45ed-90a3-1110d8f5232a))
    (pin "5" (uuid 8322f30f-e230-4943-a8cd-805f30d6ec94))
    (pin "6" (uuid ab13f160-2631-48c1-b55b-94a9d58e906e))
    (pin "7" (uuid 85867d98-d4f5-4329-bcdb-b7956ab72d8c))
    (pin "8" (uuid 453fcf5f-27bb-4624-ba6f-da8a7dd34579))
  )

  (symbol (lib_id "Connector_Generic:Conn_01x04") (at 255.27 67.31 0) (unit 1)
    (in_bom yes) (on_board yes)
    (uuid 00000000-0000-0000-0000-00005a2b06f5)
    (property "Reference" "P9" (id 0) (at 257.2512 66.2686 0)
      (effects (font (size 1.27 1.27)) (justify left))
    )
    (property "Value" "CONN_01X04" (id 1) (at 257.2512 68.58 0)
      (effects (font (size 1.27 1.27)) (justify left))
    )
    (property "Footprint" "lsf-kicad-lib:mkds_1,5-4" (id 2) (at 255.27 67.31 0)
      (effects (font (size 1.27 1.27)) hide)
    )
    (property "Datasheet" "" (id 3) (at 255.27 67.31 0))
    (pin "1" (uuid 8963f422-92ba-41b9-9759-e9fbd682fb7d))
    (pin "2" (uuid a8b3b657-f17c-4d53-b566-5d63b19eed12))
    (pin "3" (uuid c47ba4b0-9eba-463f-b07d-247a81019fe9))
    (pin "4" (uuid 46fc3b87-8ec2-40fc-9d8a-d70de43a78ca))
  )

  (symbol (lib_id "Connector_Generic:Conn_01x05") (at 255.27 87.63 0) (unit 1)
    (in_bom yes) (on_board yes)
    (uuid 00000000-0000-0000-0000-00005a2b07ff)
    (property "Reference" "P10" (id 0) (at 257.2512 86.5886 0)
      (effects (font (size 1.27 1.27)) (justify left))
    )
    (property "Value" "CONN_01X05" (id 1) (at 257.2512 88.9 0)
      (effects (font (size 1.27 1.27)) (justify left))
    )
    (property "Footprint" "lsf-kicad-lib:mkds_1,5-5" (id 2) (at 255.27 87.63 0)
      (effects (font (size 1.27 1.27)) hide)
    )
    (property "Datasheet" "" (id 3) (at 255.27 87.63 0))
    (pin "1" (uuid 96e81bca-7b61-45b0-a84b-5f3b3b51f0d1))
    (pin "2" (uuid b6d90455-bd2c-4ecb-9aad-3c2380c05fd9))
    (pin "3" (uuid cdbc84b8-5e0a-42c8-989d-41c382e13f9e))
    (pin "4" (uuid 1651b684-e3e9-4a15-acf6-2aa546db287e))
    (pin "5" (uuid ccd521ea-738b-4be1-8341-0db4eb7f99d7))
  )

  (symbol (lib_id "lsf-kicad:PQ9-Connector") (at 156.21 44.45 90) (unit 1)
    (in_bom yes) (on_board yes)
    (uuid 00000000-0000-0000-0000-000061833ba5)
    (property "Reference" "PQ2" (id 0) (at 168.91 38.1 90)
      (effects (font (size 1.27 1.27)) (justify right))
    )
    (property "Value" "PQ9-Connector" (id 1) (at 168.91 40.64 90)
      (effects (font (size 1.27 1.27)) (justify right))
    )
    (property "Footprint" "lsf-kicad-lib:PQ9" (id 2) (at 156.21 44.45 0)
      (effects (font (size 1.27 1.27)) hide)
    )
    (property "Datasheet" "" (id 3) (at 156.21 44.45 0)
      (effects (font (size 1.27 1.27)) hide)
    )
    (pin "1" (uuid 47f09598-cb3b-429d-b927-4e6983db009e))
    (pin "2" (uuid 32517ffe-8ffc-40d3-acef-ccd86e2f0adb))
    (pin "3" (uuid 582d0ba9-a9dc-48c9-8e76-4cd43421e0c4))
    (pin "4" (uuid 7d663747-be0a-44a3-95d5-3d1f42f6eece))
    (pin "5" (uuid d06e7250-7798-4036-aa3d-e65bad0ae03e))
    (pin "6" (uuid 47e8882d-c08c-4e0c-91d2-c6f139ad5d34))
    (pin "7" (uuid 5bce3e75-0b42-4965-ad6f-64f599a7e31e))
    (pin "8" (uuid 68a060e7-76bd-4aed-bbca-f3ec1f8bc786))
    (pin "9" (uuid f88c10aa-4c40-4b13-ab2f-88dfa010169d))
  )

  (symbol (lib_id "power:PWR_FLAG") (at 115.57 52.07 270) (unit 1)
    (in_bom yes) (on_board yes) (fields_autoplaced)
    (uuid 5de096bd-a678-499d-a267-588431cea570)
    (property "Reference" "#FLG0101" (id 0) (at 117.475 52.07 0)
      (effects (font (size 1.27 1.27)) hide)
    )
    (property "Value" "PWR_FLAG" (id 1) (at 118.745 52.5038 90)
      (effects (font (size 1.27 1.27)) (justify left))
    )
    (property "Footprint" "" (id 2) (at 115.57 52.07 0)
      (effects (font (size 1.27 1.27)) hide)
    )
    (property "Datasheet" "~" (id 3) (at 115.57 52.07 0)
      (effects (font (size 1.27 1.27)) hide)
    )
    (pin "1" (uuid 7524e0ca-0c29-49e7-a273-81bb3a4eaa1c))
  )

  (symbol (lib_id "power:PWR_FLAG") (at 173.99 52.07 270) (unit 1)
    (in_bom yes) (on_board yes) (fields_autoplaced)
    (uuid a83d9f08-9873-438a-95b8-f067f1ed5cc5)
    (property "Reference" "#FLG0102" (id 0) (at 175.895 52.07 0)
      (effects (font (size 1.27 1.27)) hide)
    )
    (property "Value" "PWR_FLAG" (id 1) (at 177.165 52.5038 90)
      (effects (font (size 1.27 1.27)) (justify left))
    )
    (property "Footprint" "" (id 2) (at 173.99 52.07 0)
      (effects (font (size 1.27 1.27)) hide)
    )
    (property "Datasheet" "~" (id 3) (at 173.99 52.07 0)
      (effects (font (size 1.27 1.27)) hide)
    )
    (pin "1" (uuid 17b8cb88-1e4e-4935-92d4-be462518332f))
  )

  (sheet_instances
    (path "/" (page "1"))
  )

  (symbol_instances
    (path "/5de096bd-a678-499d-a267-588431cea570"
      (reference "#FLG0101") (unit 1) (value "PWR_FLAG") (footprint "")
    )
    (path "/a83d9f08-9873-438a-95b8-f067f1ed5cc5"
      (reference "#FLG0102") (unit 1) (value "PWR_FLAG") (footprint "")
    )
    (path "/00000000-0000-0000-0000-00005a2ae50a"
      (reference "P1") (unit 1) (value "CONN_01X09") (footprint "Pin_Headers:Pin_Header_Straight_1x09")
    )
    (path "/00000000-0000-0000-0000-00005a2ae6ae"
      (reference "P2") (unit 1) (value "CONN_02X09") (footprint "Pin_Headers:Pin_Header_Straight_2x09")
    )
    (path "/00000000-0000-0000-0000-00005a2aec36"
      (reference "P3") (unit 1) (value "CONN_01X09") (footprint "Pin_Headers:Pin_Header_Straight_1x09")
    )
    (path "/00000000-0000-0000-0000-00005a2aec3c"
      (reference "P4") (unit 1) (value "CONN_02X09") (footprint "Pin_Headers:Pin_Header_Straight_2x09")
    )
    (path "/00000000-0000-0000-0000-00005a2b00e6"
      (reference "P5") (unit 1) (value "CONN_02X04") (footprint "Pin_Headers:Pin_Header_Straight_2x04")
    )
    (path "/00000000-0000-0000-0000-00005a2aef89"
      (reference "P6") (unit 1) (value "CONN_01X04") (footprint "Pin_Headers:Pin_Header_Straight_1x04")
    )
    (path "/00000000-0000-0000-0000-00005a2af845"
      (reference "P7") (unit 1) (value "CONN_01X05") (footprint "Pin_Headers:Pin_Header_Straight_1x05")
    )
    (path "/00000000-0000-0000-0000-00005a2afdb4"
      (reference "P8") (unit 1) (value "CONN_01X02") (footprint "lsf-kicad-lib:mkds_1,5-2")
    )
    (path "/00000000-0000-0000-0000-00005a2b06f5"
      (reference "P9") (unit 1) (value "CONN_01X04") (footprint "lsf-kicad-lib:mkds_1,5-4")
    )
    (path "/00000000-0000-0000-0000-00005a2b07ff"
      (reference "P10") (unit 1) (value "CONN_01X05") (footprint "lsf-kicad-lib:mkds_1,5-5")
    )
    (path "/00000000-0000-0000-0000-00005a2ae350"
      (reference "PQ1") (unit 1) (value "PQ9-Connector") (footprint "lsf-kicad-lib:PQ9")
    )
    (path "/00000000-0000-0000-0000-000061833ba5"
      (reference "PQ2") (unit 1) (value "PQ9-Connector") (footprint "lsf-kicad-lib:PQ9")
    )
  )
)
