^D:\PROJECTS\MINI_TRANSPORTATION\PROJECT5\MYFORM.RESX
D:\Projects\mini_transportation\Project5\Project5.vcxproj
^D:\PROJECTS\MINI_TRANSPORTATION\PROJECT5\MYFORM.RESX
D:\Projects\mini_transportation\Project5\Project5.vcxproj
