7242 95288 351
28198 33465 285
23010 58506 340
6443 84817 351
28244 6623 308
10314 536 262
27931 21707 308
12622 66104 340
28524 24478 308
18511 13720 279
17331 69399 340
707 71790 340
9086 29619 308
20825 80856 351
2677 36508 324
18654 51825 324
19400 18993 212
26525 43718 324
18703 50334 324
6006 29617 308
9389 92877 351
20061 17759 274
12667 65101 340
1169 61840 340
23422 21712 269
7336 87447 351
13669 15818 271
1024 46722 324
28033 45488 324
28346 96541 351
9746 71606 340
26918 94765 351
23872 32136 308
28773 14522 308
21446 68078 340
19457 35810 324
14777 6581 276
25341 23001 282
28489 84478 351
16254 2412 276
17814 96436 351
11068 27090 308
1541 25108 282
6916 16049 276
2968 52430 324
22784 32645 308
678 60373 340
7754 71374 340
14345 12327 276
931 7858 262
6191 7825 257
19910 81566 351
21468 88673 351
22769 30095 308
21668 10725 279
19673 88277 351
28399 20700 308
3987 99684 351
13533 21253 279
24675 20087 282
4111 14205 276
7980 39392 324
8142 32593 308
25748 36861 324
4005 55991 340
10880 8638 260
7865 48910 324
9042 83852 351
1539 27870 308
196 35220 311
21486 78858 351
8082 14821 276
14892 50515 324
21975 25595 282
23622 58043 340
23337 69683 340
15946 46069 324
21233 83865 351
17873 30757 308
6466 98609 351
26662 84482 351
9740 86110 351
16460 32474 308
8844 24451 282
16450 96244 351
11798 69068 340
22329 38201 324
13699 31871 308
11495 40908 324
21448 97318 351
1062 3317 217
4630 55941 340
18726 40589 324
19693 32969 308
14271 80431 351
11205 72400 340
5792 14593 276
16679 41330 324
7541 98201 351
13315 92474 351
24661 83301 351
23432 17160 279
16082 46634 324
158 71328 340
6797 73150 340
19696 50727 324
9609 67946 340
8290 39683 324
17979 11233 279
23094 38526 324
21862 7281 279
19641 44247 324
13932 66023 340
21377 12465 279
29045 24160 308
12055 14542 276
13608 48664 324
28721 93258 351
17605 44792 324
28174 3034 308
25726 84208 351
9813 66132 340
24329 67995 340
24488 97343 351
1851 21583 279
24358 91316 351
172 25364 282
10398 87852 351
2826 84604 351
18698 79960 351
10533 7002 260
13207 78028 351
27947 4707 308
14275 67235 340
5078 51052 324
9451 76668 340
25280 12264 282
5843 45239 324
1263 31690 308
748 89928 351
21814 16315 279
22999 76128 340
28602 27665 259
20614 92995 351
25137 37701 324
8482 56986 340
7204 34046 308
14951 9656 276
14043 37486 324
10925 19593 279
23623 49975 324
16594 6867 276
5223 23999 282
25277 95701 351
11661 58436 340
18263 78273 351
15854 32967 308
26701 84925 351
10618 70466 340
6160 72591 340
3521 83769 351
21960 84794 351
175 84115 351
19441 61147 340
11081 84925 351
11928 79101 351
24320 97505 351
19506 35505 311
26892 19340 308
23720 22463 282
11946 32870 308
8991 48439 324
14657 3505 276
4831 24476 282
23518 95692 351
11367 65039 340
13008 85620 351
24960 52604 340
23480 45641 324
25817 6134 282
26063 24957 264
28270 41452 324
19616 27307 308
7018 86889 351
8535 54839 340
14899 78857 351
802 21860 279
12350 22169 279
27109 22800 308
4884 21320 279
842 15351 276
4427 1644 238
18599 98395 351
17147 10860 276
7921 41158 324
16152 79230 351
5614 2878 238
10176 23465 279
9640 65742 340
456 38176 324
21104 69381 340
29035 97337 351
11318 26562 282
21235 15156 279
21914 20528 256
21258 17169 279
25509 64273 340
8006 75608 340
9491 30726 308
6081 15789 276
27574 72921 340
685 91600 351
23691 65827 340
10496 49314 324
21623 50970 324
29108 32369 285
1599 87578 351
16055 92575 351
16976 10195 276
9387 83659 351
