281621 818389
493023 169920
742650 95824
960739 147815
560820 759436
95710 698168
328680 124473
129625 298121
940032 803644
613638 89727
542876 39602
606526 965117
159683 370577
407271 232891
218552 479589
224177 852604
302192 580630
693965 234041
50191 149006
552026 329832
718213 757480
647801 375523
62868 124166
522664 868318
457577 85539
426224 358545
540968 713881
863500 28006
575914 580897
985293 303739
790173 34184
909316 211247
717531 823728
631405 105069
778740 120702
681076 673042
102954 873990
511469 720182
45763 20863
274384 668034
38829 350247
90925 209028
137408 14485
27806 870988
650796 971827
800925 37739
637677 750289
523609 813468
252291 941836
375867 457110
610562 946118
352771 958712
757240 49803
438541 563521
490904 610100
966963 9888
881422 859192
299007 855414
357986 946597
663260 361825
782947 313538
132567 813910
611882 722829
981301 668762
22813 794422
217847 580378
401375 136313
964592 259740
12054 317114
490034 346903
381561 406463
81503 716886
662098 922698
370052 407901
667834 179054
860808 992776
211890 976864
493768 365919
884874 566702
246653 780181
180200 351614
230884 902022
782372 389147
569399 409629
171669 443936
642746 847832
874345 267934
883657 759629
238354 641091
687006 946867
495139 475452
620012 121676
660147 460153
762167 710090
205330 978894
924575 397857
184361 602688
26022 725531
87699 568659
452232 137493
925959 590843
452423 499491
151612 793643
333418 942279
77213 685598
760748 839730
841007 339536
195660 636003
607973 472258
594855 34668
578835 21651
401004 264604
75329 144036
956557 935210
103815 561928
432730 702905
391054 353622
838074 564613
401618 515398
263262 60570
276268 485840
462736 366818
483753 924269
279755 248758
337084 434713
582528 955831
912873 282928
541185 304467
165152 514236
123918 812413
899806 918739
85440 209226
906921 839683
905511 696636
835887 163227
900156 946127
210287 720652
229752 939491
545006 342657
581688 586313
726020 934664
317803 718301
469751 688416
644267 247221
586714 270502
384554 114605
819077 725641
995913 690759
862883 792651
797282 447243
682285 544040
777492 625769
483138 386387
774132 77342
898722 623331
378389 42364
87376 464836
949784 810520
701648 816266
471393 372018
858197 142095
858379 704623
144403 856888
429047 40946
653071 807069
757550 233197
598143 629724
635788 736801
97573 660671
908330 363054
97707 872984
130713 116973
848678 932594
126156 141160
817454 439179
745842 298505
119036 588190
865152 125037
970064 333534
939574 273556
900674 978040
729249 177266
197379 705789
71053 128982
166017 783144
920818 102534
741741 713780
312110 832386
141759 359396
288090 5369
7846 447448
275512 906117
624637 438733
574977 395860
858779 887919
599063 701182
14337 288397
185037 853249
121710 462160
76327 6831
662591 942436
163913 26692
321241 542986
532132 740272
58438 944637
464184 950259
116878 344138
385777 330303
557132 714739
489484 363747
306640 462156
432063 906819
