50115 946505 525
853362 826310 525
740466 92755 509
580707 739254 509
642667 304529 509
127677 324208 443
144664 144182 326
281387 75495 443
1823 475426 449
837735 694228 504
118086 705009 509
660043 688031 442
609646 277730 470
984540 482018 525
37187 36025 262
91836 667864 509
556466 60226 470
603173 571121 434
453375 543127 470
333678 305521 384
436874 852280 525
563136 146971 470
473812 620025 470
755558 88120 509
505446 926651 525
179381 781965 509
133705 771497 509
479294 214163 449
958296 427927 525
628384 216368 509
758626 846813 525
701430 67330 509
223816 826676 509
924919 692687 525
462493 662398 509
22988 953050 525
729720 233773 509
220432 178664 386
182511 594444 470
943147 832157 525
661863 465723 509
467819 618328 470
641786 464278 509
153840 643451 509
162077 276035 443
674945 528498 509
225265 437074 449
971338 307099 525
253650 520590 470
170819 304411 443
809888 161267 509
411033 731681 509
174523 379340 443
667099 22969 509
759920 916988 525
632534 19868 509
348868 68848 443
860520 518052 525
366748 8462 443
899002 9420 525
760963 852298 525
270507 874831 525
79755 651071 509
699450 97519 509
359572 991072 525
814217 930790 525
424375 870210 525
977645 548677 525
716916 677805 504
948662 993865 458
63572 237023 443
986734 98279 525
202599 558716 470
232329 265050 407
236004 156051 443
427447 425940 356
619711 662390 509
661748 46434 509
511880 750352 509
376311 910472 525
131555 845712 525
110924 331421 443
464351 719122 509
424686 338695 449
89223 118232 354
176904 439237 449
660535 62152 509
917136 508987 525
21127 436674 449
355614 950608 525
979107 160535 525
925132 672864 525
270551 465207 449
475276 61158 449
925859 537283 525
481187 454755 444
199761 473945 449
374993 19862 443
865937 530537 525
601594 398204 470
946092 63732 525
310894 727736 509
9088 9619 260
851118 476484 525
437311 89664 449
913495 374864 525
433126 689716 509
76842 497735 449
267937 984066 525
415746 119784 449
984999 283022 525
293405 156388 443
547545 876508 525
384194 726054 509
666878 637892 442
152267 550489 470
996168 952882 458
811706 574267 509
195612 906228 525
486812 928745 525
623017 449368 470
177630 998113 525
362366 396757 436
83593 199863 383
50325 73016 340
222843 762830 509
915331 949293 507
67060 788160 509
153959 490770 449
974458 580251 525
633044 92813 509
440937 688012 509
742104 510636 509
114701 313905 443
758723 774791 468
841729 246371 525
284655 224293 443
898464 3943 525
219736 461512 449
236556 775946 509
144535 477636 449
829483 195400 509
581364 277621 470
842391 302840 525
663934 385053 509
670064 986306 525
662595 632369 429
197619 407791 443
806236 512762 509
106793 825885 509
721425 4558 509
23392 485172 449
741477 120469 509
29213 484909 449
292422 388045 441
534790 686133 509
351140 114888 443
195932 102987 383
890838 263276 525
146715 831030 509
247980 828872 509
251154 190207 443
265820 722662 509
394736 642865 509
562358 742322 509
69100 26514 340
837899 807569 525
268426 176602 443
72851 296790 443
422109 241759 449
760461 695736 504
724401 361857 509
926209 760823 525
801087 727451 468
187815 475118 449
917390 86287 525
595875 393421 470
554775 931634 525
160366 876741 525
502716 939925 525
706203 957324 525
835815 143650 509
476126 761631 509
625318 232942 470
337812 655257 509
329996 340626 366
343374 334184 366
283518 877035 525
352568 24390 443
593169 772930 509
379372 670656 509
980053 607142 525
190689 393602 443
810823 714231 468
357174 958161 525
650134 953318 525
715010 439219 509
37325 15354 324
566634 103029 470
404257 728733 509
422705 518895 470
663202 376840 509
497882 539670 470
872106 24527 525
409541 996529 525
162513 740240 509
901949 147888 525
841224 447030 525
51454 209221 383
284425 928782 525
294667 501799 449
23522 282749 443
481662 304393 449
741842 607114 509
677778 515540 509
289255 164388 443
156734 419489 449
985018 643047 525
932492 276390 525
803174 939304 525
37315 364080 443
778804 449839 509
841605 501067 525
67111 745643 509
828512 531502 509
225604 403253 443
931952 29204 525
834638 302783 509
950528 382777 525
554842 810810 509
914450 162208 525
611280 24685 470
760877 751169 424
720279 763141 424
877799 392009 525
528942 860314 525
986583 231849 525
16459 789562 509
782486 705738 468
561717 32360 470
143454 917653 525
357290 437812 449
207 614787 470
362964 657860 509
151008 390239 443
853807 680499 525
417565 570712 470
966223 115573 525
694078 686847 442
26540 981337 525
832043 968927 525
558743 982092 525
685512 671885 385
197691 711399 509
214299 617439 470
682946 298561 509
268029 108052 443
26336 143143 375
297279 93 443
681539 547337 509
943925 357785 525
737451 547191 509
81121 675258 509
672691 40815 509
