*** Life<FredkinCell> 45x11 ***

Generation = 0, Population = 18.
-----------
-----------
-----------
-------0---
-----------
-----------
--------0--
-----------
---------0-
-----------
-----------
-----------
----0------
-----------
-----------
-----------
-----------
--0-------0
-----------
-----------
------0----
-----------
------0----
------0----
------0----
-----------
-----------
---0------0
----0-----0
-----------
-0---------
-----------
-----------
-----------
-----------
-----------
-----0-----
-----------
-------0---
-----------
-----------
-----------
-----------
-----------
-0---------

Generation = 86, Population = 230.
+-+---++--+
---6--27+--
-++-++--++-
-9+-+-+-++-
+++-+--+--+
+--87--+--+
-++4+++9+--
+-+-+-----+
+++---+-++8
---+--+9---
++---9+3+--
+9------+9-
-++---+-+--
+---+-+9---
+-+++---+++
-9+-+8+---+
++----8-+9-
--+-+-+9--+
++---+-+--+
+9+-+----5+
-++-++-+++-
+---+-9----
+-+-+--+-+-
-6+---+-+8+
-+---+-8-+-
---+7------
+-----+--8-
--+--+--++-
+++--++9+--
+--9--97---
-+--+++---+
+7--++-----
+-+-+++----
+-----+5+-+
--+6++++--+
-6+---+--9-
+-++-----++
5-+-8-+++-+
++++---++-+
-++--+8----
8+--++++++-
--9-6-+4--+
-+-6-+--+--
9++------+-
+-+--+-++--

*** Life<FredkinCell> 28x11 ***

Generation = 0, Population = 4.
-----------
-----------
-----------
----0------
-----------
-----------
-----------
-----------
-----------
-----------
-----------
0-----0----
-----------
-----------
-----------
-----------
-----------
-----------
-----------
-----------
-----------
-----------
-----------
-----------
-----------
0----------
-----------
-----------

Generation = 33, Population = 40.
-----------
-----------
--0-------0
-0-0-----0-
0-0-------0
-0---------
0----------
-----------
-----------
-----------
0-----0----
-0---0-0---
-----------
-0---0-0---
0-----0----
-----------
-----------
-----------
0-----0----
-0---0-0---
0---0-0----
---0-0-----
----0------
-----------
------0-0--
-----0---0-
----0-0-0--
---0-0-----

Generation = 66, Population = 39.
-----------
------0---0
-----------
------0-0-0
-----------
0---0---0-0
-----------
0---0-0----
-----------
0-0--------
-----------
0-0-----0--
-----------
0-----0----
-----------
0-----0----
-----------
--0-0---0--
-----------
--0---0----
-----------
0----------
-----------
0-----0-0--
-----------
0-0-0-0-0-0
-----------
0-----0-0--

Generation = 99, Population = 66.
0-0-0---0--
-----0-0-0-
0-------0--
-0---0-----
--0-0------
-----------
----0-----0
---0-0---0-
--------0--
---0-0-0---
--0--------
-0---0-0---
--0---0-0-0
---0---0---
0-0-0-0----
---0-------
------0----
---0-0-0---
------0-0--
---0---0-0-
--------0-0
---0-----0-
--0-0------
-0-0-0---0-
--------0--
-0-0-0-0---
0---0-----0
-------0-0-

Generation = 132, Population = 28.
-----------
-----------
-----------
0---0---0--
-----------
-----------
-----------
--0---0-0-0
-----------
0----------
-----------
----0-----0
-----------
--0-0------
-----------
0-----0-0--
-----------
0----------
-----------
0-0---0----
-----------
------0-0--
-----------
0---0-----0
-----------
--0-0------
-----------
0-------0--

Generation = 165, Population = 75.
----0---0-0
---0-0-0---
--0-0-0----
-0-0-0-----
0-0-0---0-0
-0-0---0---
0-0-----0--
-0-------0-
0-0-0------
-0---0---0-
--------0-0
-0---0-0-0-
--0---0----
---0-----0-
0-0---0-0-0
-----0---0-
----0-0-0-0
---0-0---0-
0---0-0---0
-0---0-0---
0---0------
---0---0---
--0---0----
-0---0-----
-----------
-0---0-----
--0--------
---0-0-----

Generation = 198, Population = 41.
-----------
--0---0-0--
-----------
--0-0---0--
-----------
----0---0-0
-----------
--0-0---0-0
-----------
0-0---0-0-0
-----------
--0---0-0--
-----------
------0---0
-----------
0-------0--
-----------
0-0---0----
-----------
----0-----0
-----------
0-----0---0
-----------
0---0---0-0
-----------
--0-----0--
-----------
0-----0----

Generation = 231, Population = 76.
-----------
-----------
0-0-0-0---0
-------0-0-
----0---0-0
---0-0---0-
----0-0---0
-----0-0---
0---0-0---0
-0-0-0---0-
--0---0---0
-------0---
--0-0---0-0
-0---0-----
0---0-0-0-0
---0-0-----
------0----
---0---0---
0-----0-0-0
-0-0-0-0---
------0---0
-0-0-----0-
0-0---0-0-0
-0---0---0-
-----------
-0---0---0-
----0-0-0--
-0-0-0-----

Generation = 264, Population = 29.
-----------
------0-0--
-----------
-----------
-----------
0----------
-----------
------0-0--
-----------
0----------
-----------
--0-0-----0
-----------
0-----0----
-----------
0----------
-----------
------0-0--
-----------
--0-0-----0
-----------
0---0-0----
-----------
------0-0--
-----------
------0-0--
-----------
0-0-0-0---0

Generation = 297, Population = 80.
0-0-0-0---0
-------0-0-
0---0-0----
-0-0-----0-
----0------
-0---0---0-
--0-0-0-0-0
-----0---0-
----0-0----
---0-0-0-0-
0-0---0-0-0
-------0-0-
------0-0--
-----0-0---
0-0-0-0---0
-----0---0-
0-------0--
-0---0-0---
--0-0-0---0
-----0---0-
0---0-0----
-0-0-0-0-0-
--0-----0-0
-----0---0-
0----------
-0---0---0-
------0----
-0-----0-0-

*** Life<FredkinCell> 37x35 ***

Generation = 0, Population = 5.
-----------------------------------
0----------------------------------
-----------------------------------
-----------------------------------
-----------------------------------
-----------------------------------
-----------------------------------
-----------------------------------
-----------------------------------
-----------------------------------
-----------------------------------
-----------------------------------
-----------------------------------
-----------------------------------
-----------------------------------
-----------------------------------
-----------------0-----------------
-----------------------------------
-----------------------------------
-----------------------------------
-----------------------------------
-----------------------------------
-----------------------------------
-----------------------------------
-------------------0---------------
-----------------------------------
------0----------------------------
-----------------------------------
-----------------------------------
-----------------------------------
-----------------------------------
-----------------------------------
-----------------------------------
-----------------------------------
-----------------------------------
-------------------------------0---
-----------------------------------

Generation = 28, Population = 246.
-----11------0-0-----0-0-----0-----
0-0-2-4-2-0-0-0-0-0-0-0-0-0-0------
--0------20------0-0-----0---------
-----------------------------------
-0-------0-0-----0-0-----0-0-----0-
0-0-0-1-0-0-0-0-0-0-0-0-0----------
0-----0------00------0-------------
-------------------------------1---
-2---0-0-----2-2-----0-0-----0-2-0-
4-4-0-0-0-0-2-4-2-0-0--------------
--0-1-----1------20----------------
---------------------------1---1---
-1-1-0---0-0-----0-0-----0-0-1---1-
1-0-1-3-1-0-0-1-0------------------
0-----0-1-----0-------0------------
-----------------------1---0-------
-1---4-3-1---0-0-----2-0-0---2---1-
1-0-2-4-2-2-0----------------------
--1-3-----1-0-----1-------1--------
-------------------1---0-----------
-0---13--2-1-----0-0-----1---1---2-
0-0-0-0-1--------------------------
0-----1-0-----0-1--0--0-------0----
---------------1---0---------------
-21--4----1--5-5-----1-------1---3-
2-2-1------------------------------
--3-2-----2-3--2--2-1--0--0-------1
-----------1---1-------------------
21----0--1-0--0--1-1-----2-------1-
0----------------------------------
0-----0-1--1--0-02-0--0----1--0----
-------1---0-----------------------
--3-12-2--0--1-2--0--1-5-----1-----
-----------------------------------
--1-2--1--1-10-5--0--1-4--0----0---
---1---0---------------------------
0--0--0-00-0--0--4-2--0--1-0-------

Generation = 56, Population = 228.
0--1-4---1-1-22------2---2---0-----
------6-3-----3-6-----7-6-----5-5--
------4-3--2-----1----4-1--1----0--
-------1---------------------------
0-------------3-1--5----------0----
1-------------3-2-----1-3-----2-2--
-0-0--5----4-6---2---3-----------1-
-------0-------2-------------------
-4-2-01-2----4---2-1-30------2---3-
6-------------4-2-----1-0-----1-2--
7--5-----3----2-3--3----21----2-3--
-------0-------1-------------------
------5-2-------------1------------
------5-3-------------1-3-----2-4--
---1-9---5---------4-----1---5-----
-------1-------1-------3-----------
03---7---5-7-61-3----3---4-3-40--3-
1-----7-2-------------1-0-----3-2--
-0-4--4-8--5----13----4-2-----1-25-
---------------1-------1-----------
6-------------1--------------------
--------------1-1-------------4-2--
-0---------2-----7---------3-----3-
---------------3-------0-------4---
-4---76-3----6---2-4-22-3----3--04-
3-----4-1-----1-1-------------1-0--
3--3-4--52-7--4-7-----6-62---31-4--
-----------------------0-------2---
------2----------------------------
----------------------3-1----------
---------2---------3-----3---------
-----------------------3-------1---
2----5---6-3-33-4----7--04-2-21-2--
2-----3-2-----0-2-----0-1----------
-0-3--3-1----4--13-4-52-3-----0-00-
-------------------------------0---
-----------------7-----------------

*** Life<FredkinCell> 43x48 ***

Generation = 0, Population = 2.
-------------0-----0----------------------------
------------------------------------------------
------------------------------------------------
------------------------------------------------
------------------------------------------------
------------------------------------------------
------------------------------------------------
------------------------------------------------
------------------------------------------------
------------------------------------------------
------------------------------------------------
------------------------------------------------
------------------------------------------------
------------------------------------------------
------------------------------------------------
------------------------------------------------
------------------------------------------------
------------------------------------------------
------------------------------------------------
------------------------------------------------
------------------------------------------------
------------------------------------------------
------------------------------------------------
------------------------------------------------
------------------------------------------------
------------------------------------------------
------------------------------------------------
------------------------------------------------
------------------------------------------------
------------------------------------------------
------------------------------------------------
------------------------------------------------
------------------------------------------------
------------------------------------------------
------------------------------------------------
------------------------------------------------
------------------------------------------------
------------------------------------------------
------------------------------------------------
------------------------------------------------
------------------------------------------------
------------------------------------------------
------------------------------------------------

Generation = 63, Population = 190.
--------------0-----0---------------------0-----
---------------0-----0-------------------0-----0
----------------0-----0-----------------0-----0-
-----------------0-----0---------------0-----0--
------------------0-----0-------------0-----0---
-------------------0-----0-----------0-----0----
--------------------0-----0---------0-----0-----
---------------------0-----0-------0-----0------
----------------------0-----0-----0-----0-------
-----------------------0-----0---0-----0--------
------------------------0-----0-0-----0---------
-------------------------0-----------0----------
--------------------------0---0-0---0-----------
---------------------------0-0---0-0------------
------------------------------------------------
---------------------------0-0---0-0------------
--------------------------0---0-0---0-----------
-------------------------0-----------0----------
------------------------0-----0-0-----0---------
-----------------------0-----0---0-----0--------
----------------------0-----0-----0-----0-------
---------------------0-----0-------0-----0------
--------------------0-----0---------0-----0-----
-------------0-----------0-----------0-----0----
------------0-0-----0---0-------------0-----0---
-----------0---0-----0-0---------------0-----0--
----------0-----0-----------------------0-----0-
---------0-------0---0-0-----------------0-----0
--------0---------0-0---0-----------------0-----
-------0-----------------0-----------------0---0
------0-----------0-0-----0-----------------0-0-
-----0-----------0---0-----0--------------------
----0-----------0-----0-----0---------------0-0-
---0-----------0-------0-----0-------------0---0
--0-----------0---------0-----0-----------0-----
-0-----------0-----------0-----0---------0-----0
0-----------0-------------0-----0-------0-----0-
-----------0---------------0-----0-----0-----0--
0---------0-----------------0-----0---0-----0---
-0-------0-------------------0-----0-0-----0----
--0-----0---------------------0-----------0-----
---0---0-----------------------0---0-0---0------
----0-0-------------------------0-0---0-0-------

Generation = 126, Population = 249.
---------0-0-0-----0-----0-----------0-------0-0
------------------------------------------------
-------0-0-0-----0-0-0-0-0-0-------0-0-0--------
------------------------------------------------
-----0-0-0-----0-0-0-----0-0-0---0-0-0-0-0---0-0
------------------------------------------------
---0-0-0-----0-0-0---------0-0---0-0-0-0-0---0--
------------------------------------------------
-0-0-0-----0-0-0-------------------0-0-0-----0--
------------------------------------------------
-0-0-----0-0-0-------------0-0-------0-----0-0-0
------------------------------------------------
-------0-0-0-------------0-0-0-0-----0---0-0-0--
------------------------------------------------
-0-0-0-0-0-------------0-0-0-0-0-0-0-0---0-0----
------------------------------------------------
-0-----0-------------0-0-0-0-0-0----------------
------------------------------------------------
-0-----0-----------0-0-0-0-0-0-----0-0---0-0----
------------------------------------------------
-0-0-0-0-0-------0-0-0-0-0-0-----0-0-0---0-0-0--
------------------------------------------------
-------0-0-0---0-0-0-0-0-0-----0-0-0-------0-0-0
------------------------------------------------
-0-0-----0-0---0-0-0-0-0-----0-0-0-----------0--
------------------------------------------------
-0-0-0-----------0-0-0-----0-0-0-------------0--
------------------------------------------------
---0-0-0-0-0-------0-----0-0-0-------------0-0-0
------------------------------------------------
-----0-----0-0-----0---0-0-0-------------0-0-0--
------------------------------------------------
-----0-------0-0-0-0---0-0-------------0-0-0----
------------------------------------------------
---0-0-0-----------------------------0-0-0------
------------------------------------------------
-0-0-0-0-0---0-0-0-0---0-0---------0-0-0--------
------------------------------------------------
-0-0-0-0-0---0-----0---0-0-0-----0-0-0----------
------------------------------------------------
---0-0-0-----------------0-0-0-0-0-0------------
------------------------------------------------
-----0---------------------0-----0--------------

*** Life<FredkinCell> 18x22 ***

Generation = 0, Population = 5.
----0-----------------
----------------------
----------------------
----------------------
----------------------
---------------------0
----------------------
----------------------
------------------0---
-----0----------------
----------------------
----------------------
----------------------
-----------0----------
----------------------
----------------------
----------------------
----------------------

Generation = 99, Population = 104.
---0-0-0---0-0-0-0-0--
0---0-----0---0---0-0-
-0-0-0---0-------0---0
--0---0-0---------0---
-0-------0-0---0-0---0
0---0-0---------0---0-
---0-0-----0-0--------
0-0-------0-0-0---0-0-
-0-0-0-0-0---0---0----
0-0-0---0-0-0-0-----0-
-------0-------0---0-0
--0-0-0-0-0-0---0---0-
-0-----0-0---0---0-0--
0---0---0---0-0---0---
-------------0-0-0-0-0
0-0-0-------0-----0---
-----0-----0-----0----
0-0---0---0-0-----0---

Generation = 198, Population = 94.
0-0---0-0-0-------0---
---0---0-0-0-----0-0-0
--0-0-----------0-0-0-
-0-0-0---0-------0-0-0
--0-0---0---0-----0---
-------0-0-0---0------
----0-0-----0---------
-0-0-----0-----0---0--
0-0-0-0-0-----0-------
-0-0-----0-----0-----0
0-------0-------0-0---
---0-0-----0---0-0-0-0
------0-----------0-0-
-0-0-0-0-0---0-0------
------0---------0-0---
---0-0-0-0-0-0-0-0---0
--------0---0-0---0-0-
-0-------0-------0----

Generation = 297, Population = 93.
-0-----0---0---0-0----
------------0---------
-0-------0---0-0-0----
0-----0-0-0-----0-----
-0-----------0---0----
0---------0-0---0-0---
-------0---0-0-0-0---0
0-0-0-0---0-0-0-----0-
-------0-------0------
--0---0-0-----0-------
-0---0-----0-0-0-----0
--0-0-0-0-0-0---0-0---
---0-----------0-0-0--
--0---------0-0-----0-
-0---0-0-0-0-0-----0--
------0-0---0-0-0---0-
---0-0-0-0-0-0-0------
0---0---0-0-0-0-----0-

Generation = 396, Population = 100.
----0-------0-0-0---0-
---0-------0-0--------
0-0---0-------0-0-0-0-
---0---0-0-0---0-0---0
0-0-0-0-0-----0-0-----
-0---0-0-0---------0-0
0---0-0---0---0-----0-
-0-0---0---0-0---0---0
------0---0-0-0---0-0-
-0---------0---0---0--
0---0-0---0-----0-0-0-
-----------0-0---0-0-0
0---0-0---0---0-0-----
-0---0---0-0---0-----0
------0-0-0-0-0-0-----
-----0-0-----0-0-0----
--------0-------0---0-
-------0-----0-0-0----

Generation = 495, Population = 92.
-0-0-0-0---0-0-0-0---0
------0-0-----------0-
-----0-0---0---0---0-0
0---0-0---0---0-0-0---
-0-----0---0-------0-0
0---0-0---0---0---0-0-
-0-0---0-----0--------
0---0-------------0---
---0-0---0---0-----0--
0-0-0---0---0-----0---
-0---0-------0-0-0----
----0---0-0-----0-0---
-0---0-0---0-0-----0--
0---0---0-------0---0-
-0---------0-0-0------
----0-----0-----------
-0-0-0-----0---0---0-0
------0-----0-------0-

Generation = 594, Population = 90.
0---0-0---0-----0-0-0-
---0---------0-0-0---0
0---------0---0-----0-
-0-0-0---0---0-0-----0
--0-0-----0---0---0-0-
-----0-0-0-----0---0-0
--0-----0-------0-----
-0---0---0-0-0-0-----0
0-0-0-0---0-0-0-0-----
-0---0-----0----------
0-0---0-----0---0---0-
-0-----0-0---------0-0
--0---------------0-0-
-0-0---0---------0---0
----0-----0-----0---0-
-0---0-0-----0--------
0-0---------0---------
-0-----0-0-----------0

Generation = 693, Population = 93.
-0-0-0-0-0-----0-0----
0---0---0---0---0-0-0-
---0---0-0-----0------
--0-0---------0---0---
---0-----0------------
--0-0-0-------0-0---0-
---0-----0---0-0-0----
0---0-0-0-----0-0-----
---0---------0-------0
0-----0-0-0-0-0---0-0-
---0-0---0-------0-0-0
0-----------0-0---0-0-
-----0-0---0---0-----0
----0---0-----0---0---
-----------0-0-0-0---0
0-0-0---0-0-0-0---0-0-
-0---0-----------0----
------0---------0-0-0-

*** Life<FredkinCell> 6x11 ***

Generation = 0, Population = 26.
-0---00----
--00--00000
--00---0-0-
-0000---0-0
0--0-00----
------00---

Generation = 16, Population = 34.
3-36--5243-
----+654---
3---40-9--7
2-2--45-2-7
134---54---
351+4-6---7

Generation = 32, Population = 29.
-+4---9+87-
-5---+9+-9-
---67-8+--+
6--2-5-+-+-
------+--4-
69--+-+-8+-

Generation = 48, Population = 37.
--++--++---
---+-+--++-
++5++-----+
+--++-6--+-
+8-++++++-+
--+++6+++++

Generation = 64, Population = 30.
-+-+--+-+--
----++-----
++8++-+--++
++-+++-+---
+-+--+-+---
+-++--+--++

Generation = 80, Population = 36.
+-+++++---+
+-++++-+-++
--8--+-+++-
++--+--+++-
+-++---++--
+--++--+-+-

Generation = 96, Population = 32.
-+--+--++-+
++-++++----
+-------++-
++---+-+++-
+-++++---++
--+--+++--+

Generation = 112, Population = 26.
-+---++----
--++--+++++
--++---+-+-
-++++---+-+
+--+-++----
------++---

Generation = 128, Population = 34.
+-++--++++-
----++++---
+---++-+--+
+-+--++-+-+
+++---++---
+++++-+---+

Generation = 144, Population = 29.
-++---++++-
-+---+++-+-
---++-++--+
+--+-+-+-+-
------+--+-
++--+-+-++-

Generation = 160, Population = 37.
--++--++---
---+-+--++-
+++++-----+
+--++-+--+-
++-++++++-+
--+++++++++

Generation = 176, Population = 30.
-+-+--+-+--
----++-----
+++++-+--++
++-+++-+---
+-+--+-+---
+-++--+--++

Generation = 192, Population = 36.
+-+++++---+
+-++++-+-++
--+--+-+++-
++--+--+++-
+-++---++--
+--++--+-+-

Generation = 208, Population = 32.
-+--+--++-+
++-++++----
+-------++-
++---+-+++-
+-++++---++
--+--+++--+

*** Life<FredkinCell> 33x30 ***

Generation = 0, Population = 2.
------------------------------
------------------------------
------------------------------
------------------------------
------------------------------
------------------------------
------------------------------
------------------------------
------------------------------
------------------------------
------------------------------
------------------------------
-----0------------------------
------------------------------
------------------------------
------------------------------
------------------------------
-------------------------0----
------------------------------
------------------------------
------------------------------
------------------------------
------------------------------
------------------------------
------------------------------
------------------------------
------------------------------
------------------------------
------------------------------
------------------------------
------------------------------
------------------------------
------------------------------

Generation = 6, Population = 31.
------------------------------
------------------------------
------------------------------
------------------------------
------------------------------
------------------------------
-----0------------------------
------------------------------
---0---0----------------------
------------------------------
-0---0---0--------------------
-------------------------0----
---0---0---0------------------
-----------------------0---0--
-0---0---0--------------------
---------------------0---0---0
---0---0----------------------
-------------------0---0---0-0
-----0------------------------
---------------------0---0---0
------------------------------
-----------------------0---0--
------------------------------
-------------------------0----
------------------------------
------------------------------
------------------------------
------------------------------
------------------------------
------------------------------
------------------------------
------------------------------
------------------------------

Generation = 12, Population = 32.
-----0------------------------
------------------------------
------------------------------
------------------------------
-0-------0--------------------
-------------------------0----
------------------------------
------------------------------
-0---0-------0----------------
---------------------0-------0
------------------------------
------------------------------
-0---0---0-------0------------
-----------------0-------0-0--
------------------------------
------------------------------
-0---0-------0----------------
-------------0-------0-0-----0
------------------------------
------------------------------
-0-------0--------------------
-----------------0-------0-0--
------------------------------
------------------------------
-----0------------------------
---------------------0-------0
------------------------------
------------------------------
------------------------------
-------------------------0----
------------------------------
------------------------------
------------------------------

Generation = 18, Population = 27.
-----0------------------------
-----------------------0---0--
---0---0----------------------
-------------------------0----
-----0------------------------
------------------------------
------------------------------
------------------------------
------------------------------
------------------------------
---------0-----------0--------
------------------------------
-------0---0-------1---0------
------------------------------
---------0-----------0--------
---------0---------0----------
------------------------------
-------0---1-----0---0--------
------------------------------
---------0---------0----------
------------------------------
------------------------------
------------------------------
------------------------------
------------------------------
------------------------------
-----0------------------------
------------------------------
---0---0----------------------
------------------------------
-----0------------------------
------------------------------
------------------------------

Generation = 24, Population = 28.
------------------------------
-----------------0---------0--
-0-----------0----------------
------------------------------
-----0---0-----------1--------
-------------------------0----
------------------------------
------------------------------
------------------------------
---------1---------1-----1----
-----0------------------------
------------------------------
-0-----------0---2-----------0
------------------------------
------------------------------
------------------------------
------------------------------
-0---------3-----0---------0--
------------------------------
------------------------------
-----1---1-----------1--------
------------------------------
------------------------------
------------------------------
------------------------------
---------1---------0----------
------------------------------
------------------------------
-0-----------0----------------
------------------------------
-----0------------------------
------------------------------
------------------------------

Generation = 30, Population = 221.
-------------2-0-1-0-2-1------
-----------0---------3--------
-----------0---1-3-0-1---1----
---------0---1-----0---0------
---------2---0---3-1---1---1--
-------0---0---0-2---1---2----
-------0---0---0-----1---1---1
-----0---2---0-0-1-0---0---0--
-----2---1---2---------1---0-2
---0---1---0-3-0-2-1-2---1---3
---0---1---0-------------1-0-1
-0---1---1-0-1-0-3-2-1-0---1-0
-2---0---3---------------3-2-0
---0---1-3-2-1-1-6-3-2-0-2-3-0
---0---0-----------------1-1-0
-----1-0-4-0-4-0-3-1-1-1-0-0-1
-----2-----------------3---0-3
-----3-1-3-3-3-1-1-0-5-0-0-0-2
---------------------2---0---1
-----1-0-2-1-2-0-1-0-0-0---0-0
-------------------1---0---1--
---0---0-3-1-1-0-2-1-0---1---0
-----------------1---0---0----
-1---1---2-0-1-0-0-0---0---0--
-----2---------1---0---1------
---0---0---0-3-0-0---1---0----
---0---0-----1---0---0--------
-----0---1---0-0---0---0------
-0---0---3-0---0---1----------
-------0---0-----1---0--------
---0---0-2-0-0---0------------
---------1---------0----------
-----0-0-0-0-0-0--------------

Generation = 36, Population = 31.
------------------------------
------------------------------
------------------------------
------------------------------
------------------------------
------------------------------
------------------------------
------------------------------
-----------------------2-0----
-------------------------3----
------------------------------
------------------------------
-------------------4-1-----4-0
---1-0---------------3---3---0
-----2------------------------
------------------------------
-----------------------4-0----
-1-----3-3-----------6---2---2
-1---1---2--------------------
------------------------------
------------------------------
---1-0-------------------2----
-0---1---1--------------------
------------------------------
------------------------------
------------------------------
-----1------------------------
------------------------------
------------------------------
------------------------------
------------------------------
------------------------------
------------------------------

Generation = 42, Population = 105.
------------------------------
------------------------------
-----------------------0-1----
-------------------------1----
---------------------1-2-4-1--
-----------------------2---0--
-----------------------0-4----
---0-1------------------------
-----4------------------------
-0-1-4-2---------------1---0--
---2---2-------0-2---------2-2
---0-4-----------4-------1-2--
-------------0-1-5-5-----9-6--
---------------2---4-----3---4
---2---0-------0-5---------2-2
-2-1-------0-4----------------
-5---3-------4----------------
-5-1-9---6-5-5-----0-----3---2
---2-------2---0-------0-2----
-2-1-------1-3---1-------1-1--
---------------------1-2-2-2--
-----------------------1---0--
---0-------0---0-------0-2----
---0-3------------------------
-0---4-------1----------------
-0-2-2-1---------------0---0--
---2---1----------------------
---0-2-------------------0----
------------------------------
------------------------------
---0---1----------------------
------------------------------
-----0------------------------

Generation = 48, Population = 23.
------------------------------
---0-0------------------------
-----1-----------------2-3----
------------------------------
------------------------------
------------------------------
-----2------------------------
------------------------------
------------------------------
------------------------------
------------------------------
------------------------------
-------1-3---------7-6--------
---------7---------5----------
------------------------------
------------------------------
------------------------------
-----------6---------6--------
---------6-----------5--------
------------------------------
------------------------------
------------------------------
---------1-----------2--------
------------------------------
------------------------------
------------------------------
------------------------------
------------------------------
-----1-----------------1-0----
-------------------------0----
------------------------------
------------------------------
-----1------------------------

Generation = 54, Population = 198.
-1-1---1-1---------0---------0
-2-------2-1------------------
-----4-----1-----3-1-3-----1--
-1-----0-2--------------------
-------------------3-4-3-6-3-1
-1-2-5-2----------------------
-------1-1-1-------1---1-5-0--
---1-4---4---------1----------
-2---4-0---0-----4-2-3---4----
-------5---1-----4---3--------
-----2---5-0-0-1-4-2-2-1-4----
-----5---5-4-2-1---3-2-2------
-4-0---2---8-----9-+---4-+-9--
---3---4-9-7---5-+-6-+-5-7----
---3-5---6---4-2-7---6---3----
-----4-3-6-1-6---5-3-1-2-1----
-------3-5-2-5-----4-8-6-5----
-----+-6-+-6-+-4---5-7-4---3--
---2---2-9---------2-7-----0--
-------0-5-3---1-3-1-3---2----
------------------------------
---------5---4-----2---1------
---1-2-----------------1-4-2--
-----------0---------1---0----
---0-4-0-----1---1---2-3---1--
-----------------------1---0--
-0-----2-1-0---------1---3-0-0
---------------------0---1---1
-----1---4-1-----0-2---2-3-2--
-------------------1---1---2-2
---0---1-----------0-1-1-2-0-1
---------------------0-------0
-0-------1-0---------0-----0--

*** Life<FredkinCell> 10x41 ***

Generation = 0, Population = 1.
-----------------------------------------
-----------------------------------------
-----------------------------------------
-----------------------------------------
-----------------------------------------
-----------------------------------------
-----------------------------------------
-----------------------------------------
-------0---------------------------------
-----------------------------------------

Generation = 148, Population = 25.
---0-------0-----------0-------0---0-----
-----------------------------------------
---0-------0---------------0-----------0-
-----------------------------------------
---0-------0---0-------0---0---0---0-----
-----------------------------------------
---0---0---0---------------0-----------0-
-----------------------------------------
---0---------------0---0---------------0-
-----------------------------------------

Generation = 296, Population = 27.
-----------0---0-----------0-----------0-
-----------------------------------------
-------0---0-------0---0---------------0-
-----------------------------------------
---0---0---0-------0-------0-----------0-
-----------------------------------------
---0---0---0---0-------0---------------0-
-----------------------------------------
---0---0-------0---0-----------0-------0-
-----------------------------------------

Generation = 444, Population = 23.
---0---0-------------------0-----------0-
-----------------------------------------
---0---0---0---0---0-----------0-------0-
-----------------------------------------
-------------------0---0-----------------
-----------------------------------------
---0---0-----------0---0---0-------------
-----------------------------------------
---0---0-------0---0-------------------0-
-----------------------------------------

Generation = 592, Population = 19.
-------0---0---0-------0---0-------------
-----------------------------------------
-------0---------------------------0---0-
-----------------------------------------
-------0---------------------------------
-----------------------------------------
-----------0---------------0---0---0---0-
-----------------------------------------
-------0---0---0-------0-------0---------
-----------------------------------------

*** Life<FredkinCell> 47x30 ***

Generation = 0, Population = 29.
------------------------------
------------------------------
----0-------------------------
-------0----------------------
------------------------------
------------------------------
---------0--------------------
--------------------0---------
------------------------------
------------------------------
--0---------------------------
------------------------------
------------------------------
------------------------------
--------------------0---------
------------0-----------------
---0---------0----------------
------------------------------
------------------------------
----------------------------0-
------------------------------
------------------------------
-----0------------------------
-------------0----------------
------------------------------
----------0-------------------
------------------------------
------------------------------
---0--------------------------
0-----------------------------
---0------0---0---------------
------------------------------
-------0----------------------
------0-----------------------
---0--------------------------
----------------------------0-
---------------------0--------
------------------------------
------------------------------
------------------------------
---0--------------------------
--------------------------0---
------------------------------
------------------------------
-----------------------0------
0-0-----0---------------------
------------------------------

Generation = 40, Population = 333.
--2--37----+---5--02-21-------
0-----3-2-3---3-----------0---
----------------2-3--4--------
-------------2-1----5+-34-----
-------------8---------49-4--4
------3-0---------2-----------
-------45--1--6------------5-2
0-3--2------5--------7--------
-3-----4--55-534-5--9----2-1--
--0---4-3---------3-------1---
------------------3-9--3------
1-4-----------------42-34---4-
--8------------2-----1-------4
5---5-+-5-------4---------2---
4-5--5-----7----4-26---2-4----
----6--------1-3-2------5-6---
---6-5-4----5----5-9---7---86-
8---5-5-6-4-----6-4-2-----0---
---------------3-----5----3-43
----9-35+-5-------------------
---+------8------------5-0-3--
6-6---8-4---------4-------1-2-
-------74-34-863624-3----5---1
-------9-7------5-1----7-5--1-
-7-6------3---52----34-+-4-3--
--6-----2-7-3---------4-2-0-1-
---93--------3---------3-0-2-0
-------1-------4----8---2-----
---8---8-4-53----6-7-----2-2--
9---------6---7-----4---2-5---
---8--6-4+6-2--3-6-+--565-557-
-------------2-4-1------------
--57-8+--7-3-5-6--8---0--3-5--
--6-8-6-9-----5-4-+-6-------0-
---+-------70----5-1-5---1-3--
----7-256-6----3--------------
-3-572-6-------8-0-------1-2--
--3---3-----------3-2-0---5-1-
-4-3---9-----69-275------1-3--
-----3------4--------2------2-
-3--------3---1--5-233-1-3-1--
5-5-2-----9-5-------4---0-1---
---1-6-4--3--------------2-0--
0-3----2------------2---2---2-
-56----2-4---4-2--------------
--4-4-----2-2-3---4-------5-1-
---7-----4-41--------2---3-31-

Generation = 80, Population = 286.
++-+++-+-----+-9--9+8-+8--+---
--------+-----+-9-----5-------
--------+---+-----9---+-------
-----+---+--6---6----+---+8-+-
+-+-++-----------------+------
----+---------------------6---
-----7-----------------+---9--
-7+---7----9-9-+--+-7-----5--8
-------+-----------+-+--------
--------+---+-----+-----------
----------+---7-+---+---------
-----+-9-8--+---+-------------
-+++++97-------------+--------
--+---+-----+-+-+-+-----7-----
--++-9+-+-++--+-+--+--+---+--7
8-+-+---------------------+-9-
---+88-+-----+---+---+--+--+-+
----9---+---+-+-+-+-----9-----
-+++++8+-------------+--------
-----8-8-++-------+-------6-+-
------------+-----++-+-+------
----------7-------+-----------
---------8-+-----------9------
---7+-------------8-9-6-+--+-9
-+-+---------------------+----
--+---+-------------------+---
+-+-++-----------------+------
-------8----+---8------4------
---------+++-+---+-++--+-7----
+---+-+---+-+-+-+-+---+-------
+-----++-+---+---++-++9++---+-
----------7-8-9---------------
++-++----+---+-+---+-+---++---
8---+---+-----+-6---7---8-----
---------9++-+---+-7+--+-9----
-------+--+-------5----4--+-5-
---+---+-------------+---4----
----+-------------------+---8-
-+---+-+-----------------7----
-9--9------+-8-9--------7----3
-------------+---+------------
----------+-----+---+---------
------------9-----79-+-6------
------------+---+---------2-+-
-----+---5---------8---+------
--+---+---7-+-----9-+-8---+---
---+4--65+++--+-+--9----+----+

Generation = 120, Population = 464.
-+----------++++-+-+++-+-++-+-
--+---+-+---6---+-+---+-+-+---
+--+-----------------+----+-+-
+---+---+---+-------+++++---+-
-+----+----+-+----+++--+------
+-+-----+-+-----------------+-
---++++---++--+--+-++-+-+++++-
+------+----------++-+----+++-
-----+------++-+--++++-+---+--
--+---+---+-------+-+---+-----
++-+---------------+---++-+--+
--++--+----+++++----++++------
---------+++9-++---+-+-----+-+
+---+-------+-------+-+---+---
+----++--+--+++++--+-+++++--+-
------+-+-++---++-+++----9-7-9
---++--+--++-++--+---------+--
+---+-+-+-----+-------+-+-8---
-----+--++-----++-+----+---+-+
----+++++-++-+-+---+----+---+-
--+++--+---------+-+-++--+-+-+
--+-+-+-+-+---+---+-+-----+---
+-----++--+--+++-+-+++-+-+8+--
+-++------++--+--+-+----++-+--
------++---+-+---+-+--++---+--
+-+---+---+-+-------+-+-+-+-+-
-+-+---++-+--+-+++---+---+----
-++--+++----------++--+----+--
---++------+-+---+-----+---+--
+-----+-----+-+-+---+-------+-
-+++--++++-+---+++------+++---
--+-+-+----+---+---+--+--8-7++
+---++-+--+--++--+---+-------+
--+-+-+---+-+---+-----+-------
+-++-+-+-+-+-+---+------++----
++----+-+++-------------++++--
-----+---+-++--+-+-+--+--9-+--
+---+---+-+-+-----+-+-+---+-+-
++--++--+-++-++--+--++--+---6-
----+--+----+-+----+++-----+--
-+---+9+6++-++9+-+++-----+-+-4
+-----+-+-+-------+---+---8-+-
-+---++--+-+-----+-+-------5+-
--------+9----+---+---+-+89---
-------+-+----+-----+----+-+--
----+---+---+-------+---+-----
+-+---++---+---++++++++---+--+

Generation = 160, Population = 280.
------+----+--+-+---++-+-+-+--
+---+-+---+-----------+-+---+-
--------------------+-+-----+-
+-+--------------+-+----++-+--
-------+-+-------+---+---+----
------+---+---+---+-+---------
---------------+-+-----+-+----
----+-+--+--++++--------------
-+-+-+-+-+-------------+---+--
--+-+-----------------+---+---
----------------------+-+---+-
+-+---------------------+-----
-----+-+-----------+---+---+--
------+-+---+-------+-+---+---
---++-++-+--++++---------+-+--
--------+-----+---+-+-+-------
--------+-++-+--+--++--++-----
------+-+---+-------+-+---+---
-----+-+-----------+---+---+--
+-+-+-+-----------------------
+-+---+-------------------+-+-
--+-+-----------------+---+---
---+---+-----------+-+---+---+
--------+-++-+--+--+++--+-----
-----+---+---+-----+-+--------
--------------+-+-----+-+-----
-------+-+-------+---+---+----
+-++---+---+---------+-++-----
+--++--++------------+-+++++--
--+---+---+-----------+-----+-
---+---+--+++-+-+-+-+-+-+-----
------------------------------
---+--++------+-++-++---------
+-+-+-------------+-+-----+---
+--++--++------------+-+++++--
+-+++-++---+---------+-+------
---+-+-----+-+----------------
------+---+---+---+-+---------
-----+---+---+-----+-+--------
--------+++--+-++---+---+-----
-+---+---+-----------+---+----
------+-+---------------------
+-+---+-------------------+-+-
+-+---------------------+-----
-+-+-----+-+------------------
----------------+-+---+-+-+---
---+---++++--+-++---+---++-+--

Generation = 200, Population = 503.
-+---+-++-++--++++-+----+-+---
--+-+-+-+---+---+-+---+-+-+-+-
------+---+---+--+++-+-+-+----
-+---+----------+++--+----+-+-
+-+---+--+++-+-+-+-+-+-+---+--
--+---------+-+-+-+-+-+-------
---+-++-+--+-++-++-+--++--+---
-+-+-+-++++-+-+-++-+-+++-+----
-----++++------+-+-++-+-+-----
----+-+-----+-+-+-+-+---+-+-+-
----+---+---+---+--+-+-+-+-+--
-+---+---+---+--+-+---+-+---+-
--+-+-+----+-+-+-----+-+------
+-----+-+-----+-+-+-+-+-+-+-+-
-+-+-++---++-++--+++-+++-+----
----+--++++--+---+-+----------
---+-+--+-+-+-++++-+---++-++--
+---+---+-+-------+-+-+-+-+-+-
+-+-+---+--+-+-+-----+-+------
---+-+-+-+-+--+---------------
-+-+--+++++-+-+----+-+-+-+-+--
+-+-+-------+-+-+-+-+---+-+-+-
---++---------++-++++-+---+---
---+--++--++--++--++---++-++--
------+-+--+-----+--+++-+-----
--------+-+-+---+---+---+-----
+++++-+++--+-+-+-+-+-+-+---+--
---+-+-+-+---+-+++++------+-+-
-+-+-+--+++++-+-++-+---+---+--
+-+-------+-+-+-+-+---+-+-+-+-
-++----+-+-+-+-+---+--------+-
-------+-+---+---+-+----------
--------+++--+++++---+--+-+---
+-----+-----+-----------+-----
-+-+-+--+++++-+++--+-+-+-+----
---+-+-+-+---+++-+-+----------
+++++-+-++-+---+-+-+-+-+---+--
+---+-+---------+-+-+-+-------
-+-++----+------+-++-++-+-----
-+-+-+-++++-+-+-++-+-+-++++---
-+-+--+-++-------+--+-+-+-----
+-+-------+---+-+-------------
-+-+--+++++-+-+--+---+---+---+
---+-+-+-+-+----+-+---+-+---+-
--+-+-+--+---+-+-+-+-+---+---+
+-+-+---+---+-+-+-+-+-+-+-----
-+-+-+-++++-+-++++-+-+-++++---

*** Life<FredkinCell> 40x28 ***

Generation = 0, Population = 49.
--------------0--------0----
----------------------------
-------------------------0--
--------------------------0-
--------------0-------------
----------------------0-----
---------------------------0
------0---------------------
---0------------------------
----------------------0---0-
--------0-------0-----------
------0-------------0-------
----------------------------
----------------------------
----------------0-----------
----------------------------
--------0-----------0-------
----------------------------
---0------0-----0------0----
----------------------------
-----00--0-0----------------
------------------------0---
-------------------0--------
----0-----------------------
----------------------------
0-------00------------------
----0------0----------------
----------------------------
------0-----0---------0-----
--0-------------------------
------------------0---------
-------------0--------------
---------------------------0
----------------------------
------------0---------------
--------------0-------------
---0--------0---------------
-------------------0--------
---0-------------0----------
-------------------------0--

Generation = 176, Population = 543.
-+---++++--++-++-++--+-++---
-++++-+-++-+-+---++-++---+-+
-+-++----+---+-+-++++-+-+---
+++++--++-----++--+---++++-+
---++--+++++++++----++-+++--
----+++++++-+---++--+--+--+-
+-+-++++--+++--++--++++++++-
-----++-++-+-++-----+++---+-
--++++++--++---++++++-+-----
+------+-+--+------++-++++--
++-++++--+--+++---+---+++---
+---+--+++++-++++++-+--++---
-++--+---+--++---++--+----+-
++++-+---++++---+--++-++---+
-+--++-++---++-+-++++++-+---
+----++-+---+-------+-++---+
-+--++----+----+--+--+++-++-
-++-+++--+-+-+-++++++-+-+--+
-+-++--+++++++---+----+--+++
--+-----+--++---++++--+---+-
----++-+--++-++++++-+-+--+-+
-+--+++++---+-+-+++--+-++++-
-+++-+-++++-+---+----+-+++++
+-+++++-++-+-------+++----+-
++-+---+++-+++--+++-+-++---+
----+--+--+-----+--+-+--+++-
+++--++-+-----+---+++--+----
++--+++++---+--+-+-----+--++
-++++-+---+-++-++-+-+---+--+
+--+++--+--++---+++--+--+-+-
-+-++++--+--+-++++---++++---
----+-++-+-+-++-++++-++-+---
---+--+-+++--++-+--+++---+-+
++++-+--+-+-++--+-+-++++++-+
+-+-+++--+-+----+-----++++++
--------+-+-+-+---++-+--+---
+-+-+++-++---++---+++---++-+
++--+-++++--++++-+---+++-+--
-++--+-++--+--+-----+-+-+-+-
--+-++------+---+--++++-+--+

Generation = 352, Population = 530.
--+++---+--++------++-+---++
--+-+---++--+++++----++-++--
--+-+++++-+++---++-+++++--+-
+-+++-+--+-+-+-+-+++--+--++-
----+-+---+--+++++-+++-+++-+
++++--+--++------+----+++--+
++-++--+-+++---+-+--+-+--++-
++-++------+++---+-++-+-+---
-+++--+--++--+++-+--+-----++
+--+-++----+-+--+-+-+-+-----
++-+-++----++-++++-+++-+++--
-+++++++-+--------++---++---
++-------++-++------+---++--
--++-----+++-------+-++-+-+-
--+++--++---+++-++++-++--+--
--+++++---++-+----++-+--+-++
---+--++--+++-++++--++-+--++
+-+++--------+--+--++++-+---
--++-+-+-+--+-+-++-----+-+++
----+------++----+--+++-+-++
+++++++---+++++++--+----++++
--+-++---++--++--+-++-++++++
-++----+++++-++-+--+++-+++++
+-+++--+---++-+--+++--++----
-++++++-++-+--+-+----++++-++
---++++---+-------+-++-++--+
--+-----+-+--++------+----++
++---+----+++-++-+++-+--+---
+++-+---+-+-++++-+++-++-++++
+--+++--++--++----+-+-+-+-+-
--+-++---+-----++--+--++-+--
+----+-----+--+--++-+-----++
+---+-+++++-++----+++-++-+--
--++--+--+++--+--+-+-++-----
----+++-+--++-+++-+--+-+---+
-----++----+-+-+--++++---+-+
+-+-+++--+++---++++-++--+--+
-+--++-++---+--+--+-++--++-+
-++++---+--+++--++-+-+--+--+
----+++-+-++-+----+++++-+---

*** Life<FredkinCell> 4x34 ***

Generation = 0, Population = 21.
---0-0-0----0--0-00---------0---0-
--------0-0-0------------00-------
------0---0-----------------------
---0------------------0-0-------00

Generation = 169, Population = 64.
--+-+-+++++--+---+-++-+----+-----+
++--+-+-+++++-++-++-+-+++-+-+----+
--+-+++--++++++---+-+----+--++-+--
--++-++-++++-+-+-+-----+--+-----+-

Generation = 338, Population = 80.
--++++++-+-+-+--+++-+----++---+-+-
---++++++-++++--++-++-++-++++--++-
+-++-++++-++-+-++++--+++++--+-+-++
+--+-+-+--++-+--++--++++---+++-+-+

Generation = 507, Population = 58.
-++--++--+--+-+--+++-++--+++++++--
+-+-+-++---+------+-+-+-++-+-++-+-
-+-++---++--++--+---+----------+++
---++-----++-+--+-++------+--+-+-+

Generation = 676, Population = 72.
---++-+++-+-+----+----+---++++--++
-+-++++-+-+-++-+++-+++---+---++-+-
-++--+--++-++--+++-+-+++--++++-+--
-+++---+---+-+++-+-++++--++---++++

Generation = 845, Population = 61.
+-+-++-------------+++-+--+-++--+-
++--+-+--++---+-+-++--+--+-+++-++-
--+-+---+--++-+-+--+-++--++--++---
+---++---++-----++++-++++--+++-+-+

*** Life<FredkinCell> 14x10 ***

Generation = 0, Population = 11.
-----0----
-0--------
----------
-------0--
-----0----
0---------
--0-------
----0--0--
----------
---0------
----------
-------0--
-------0--
----------

Generation = 104, Population = 74.
+++-+-+-+-
+-++++++--
+-++-+--+-
---++++-+-
-+-++--+++
-+++++-+-+
-+--+-+-++
-++--++++-
--+++-++-+
++++---+-+
-+--+++--+
+-+-----++
-+--+-----
---+-+++--

Generation = 208, Population = 73.
+--++++---
-+--+-+++-
-++-++-+--
++-+-+-+++
+-+---+++-
--+--+++--
-+++-+---+
--++-+++-+
++--+---++
++-----+-+
----++-+++
-++++-+-+-
-++++-++--
+-----++++

Generation = 312, Population = 71.
++-+-++--+
-+-+-+-++-
+-++++++++
--+-----+-
+---++----
--+++++---
+--++++-+-
+++--+---+
-+--+-++--
+++-++-+++
++---+-+--
-+-+++---+
+-+-++--+-
-+-+--+-+-

Generation = 416, Population = 70.
---+-++---
+-----++++
---+++-+--
-+++--++++
---+-++++-
--+-+-++-+
-+-++++--+
+-+-+++++-
-++-++++-+
+-+++-+-+-
+++---+---
++--+-+++-
------+-+-
-+--++----

Generation = 520, Population = 55.
---+-+-++-
-+-++-+---
--+----+-+
++-+-++-+-
---++--+--
+--+--++--
++---+-+-+
---+---+--
-+--++-+-+
--++-+-+++
-----+-+--
++-++--+-+
----------
-+-+-+++--

Generation = 624, Population = 63.
+-++-++++-
+++----+-+
-+--+++-+-
+---+---+-
---+------
+++++---++
-----++--+
+--+---+++
-+-+++----
-++-++-+--
++-++-+--+
--+-++-+-+
++--+---++
----+---+-

Generation = 728, Population = 73.
-++-++----
+--+++-++-
+-+--++++-
++-+++-+--
+-++-++--+
++++++-++-
+-----+---
++---++-++
-+-++-+++-
+++-+---+-
-+---+--+-
+---++++--
++++---+--
++--+--++-

Generation = 832, Population = 73.
-++-++-+--
++--+-+--+
+----+-++-
--+++-+++-
+-+--++-+-
-+++++----
++----++--
+-----+---
-+--++-+-+
+++-++-+++
-+-+++-+++
++++--++-+
---++--+++
--+---++++

Generation = 936, Population = 77.
++--++-+--
--++-+----
+-++++--+-
+--+--++-+
---+-++-++
+++--++-+-
+++--++--+
+-+-+---++
+-++++-+--
--+++--+++
-+-++-++++
+++---+++-
+-++-+--+-
-++++-+-+-

*** Life<FredkinCell> 31x3 ***

Generation = 0, Population = 20.
---
---
---
--0
0--
---
00-
---
-0-
---
---
-00
---
-0-
0-0
---
---
--0
--0
--0
---
--0
0--
---
---
-0-
---
---
-0-
--0
00-

Generation = 74, Population = 0.
---
---
---
---
---
---
---
---
---
---
---
---
---
---
---
---
---
---
---
---
---
---
---
---
---
---
---
---
---
---
---

Generation = 148, Population = 0.
---
---
---
---
---
---
---
---
---
---
---
---
---
---
---
---
---
---
---
---
---
---
---
---
---
---
---
---
---
---
---

*** Life<FredkinCell> 10x34 ***

Generation = 0, Population = 47.
---0---00------------0-0----0-----
-0----0--00------------------0----
0---------------------0-----------
-0---------------------------0----
-----0--0--0---0-----0--0----0---0
-0-0--0----------------------0----
-------0-0-0-00----------------0-0
--0------0--------------00-0------
-----0------------0---0-------0-00
-------------------------0--0-----

Generation = 163, Population = 167.
+--+--+++--++-+-+++-+------++++---
-+------+-+++++--++++-----++--+-+-
+-+-++---++-+-+----+--+-----+++-+-
---++--+-+-+++++-++++----+-+--++-+
-+-+++-+--++--+++-+-++++-+-+----+-
-+++----+-++----+++----+---+++--+-
+-+---+++--++-+-++--++++++-+-+++--
+-++++-++++--+-+-----++-+++-++--+-
--+-+-+-+++-+--+-++--++--+--+++--+
--++-+-++-++-----+-----+-+++-+-+++

Generation = 326, Population = 166.
+++++--+-++--+++--+++-+---+++--+-+
---+-++-++-+--+-++---+-+++--++++++
+-++++---++++-+---++++--+-----+++-
----+-+-++--+--++-+--+++--+++-++-+
+-+++++---++---+-+-++-+-++++-++--+
+-+-+-+--++--+--+------------+++-+
+-+-++++---+-++--++-+-+---+------+
--++++----+-+-+++-+-+--------+--++
++---+-+++----+----++-+---++-+--+-
+-++++-++-----+++-++-++---+-+--+--

Generation = 489, Population = 176.
+-+--+--+-++--------+-+++-++--+--+
+-+++--------+--+---+--+--+++++-++
+-+--+++------+++++++-+--+--+-++++
-+++-+----+--++--+++--+-++-+-++++-
--+-++++++++-+--++--+--+-++---+-+-
+++---------+++-++++--+--+-+-----+
+-+-+-+++-+-+-++-++++----++----+-+
-+++----++++-+----++++----+++-++-+
++-++-+--+-++---+-+-++-++++-+++--+
++-+++++-++++++++-+--+-++---+--+-+

Generation = 652, Population = 177.
-++++--+-+-++--+-++-+-++++-+-++-+-
++++++-++-+++---++++------+-++-+-+
-+---+-+-+-+-++--+--+------+-----+
+-++--+-+-++-----+--+-+++-+-++-+--
++-+++---+--+--+--++-++-++--+-++--
+-+-+-+++-+++-++--+++-++--+--+-+++
-++---+-+++--++++++-+-+++-+-++++++
+---++-+---+++-+++--+--++++-+----+
-+----+-+-+++-+---++-+--++++-++-+-
-+-+------+-+-+--+-+++++----+-+-++

Generation = 815, Population = 171.
+-+---+++--++++-++-+++-+-+---+++-+
+++-+++++-++---+--+--++-+--++-+---
+-+-+++--+++--+--++--------+---+++
++-+--+--++++++++-----+++---++-+++
+-+-+--+--++---++++---++-+--+--+++
--+-+-+--+--++-++++++---+-+++--+-+
-++++-+++++----+-+-+--+----+---+++
-----+-+-+---+-+---++-+-++---++---
+---+-++++-++-+-+++--++++------+++
+-+--+++-+-+---+-++--+--++++------

*** Life<FredkinCell> 46x6 ***

Generation = 0, Population = 20.
0-----
-----0
------
------
-----0
0-----
------
---0--
----0-
--0---
--0---
------
------
------
-----0
------
------
------
------
0-----
------
--0---
--0---
------
-0----
------
------
--0---
------
------
------
--0---
------
0----0
------
---0--
---0--
---0--
------
------
------
------
------
------
------
------

Generation = 100, Population = 131.
-+--++
++++-+
+-+-++
+--++-
++--++
------
--++-+
+---+-
-+--++
++-+--
++--+-
-+---+
---+--
+-+++-
++-+-+
+-----
++----
+-+-++
++-+++
------
+---++
---+-+
-++-++
--++--
---+++
+----+
-+----
-++++-
+++--+
+---+-
+++-+-
-+++-+
++-++-
-+---+
--++--
+--+++
-++---
------
-+++--
+-++-+
--+---
++-+++
-+-+++
++-+--
+-++7-
--+-+-

Generation = 200, Population = 140.
+---++
+-+--+
------
--+--+
-++--+
----+-
+-+-+-
------
++++++
-++-++
-+-+-+
--+---
------
-+-+++
--+--+
-+-++-
++-++-
-+--++
----++
-+++++
+-++-+
-+-+++
-+--++
----++
--+-++
++-+++
+++-++
+++---
--++++
--++--
++----
++++-+
------
+-+-++
--++-+
-+++-+
++-+-+
-+++-+
+++++-
+--++-
--++--
+-++++
+---++
++++-+
+-+---
---+-+

Generation = 300, Population = 142.
+++++-
-+-+--
-+-++-
+--+--
-+-+++
-+-+++
++-+--
+-++--
+-++-+
++----
---+--
++-+--
+++---
-----+
+-+-++
-+++--
-++++-
+-+--+
+-----
-----+
-+--++
---+-+
--++-+
+--+++
++++-+
-+--++
--+++-
+--+++
-++-+-
+---+-
----++
+-++++
+--++-
-+-++-
+-----
--++--
--+--+
++++-+
---+++
+++-++
-+-+--
--+++-
++-+++
+-+-++
+++++-
+++-+-

Generation = 400, Population = 146.
+++++-
++++++
--++++
+--+++
-----+
++--+-
+-+---
----+-
+-++-+
-+++--
+-+---
--++++
+++-+-
+--+++
+---+-
-+++-+
+++---
-+--+-
++++++
-+-+-+
--+++-
+++-+-
+--+-+
+-+-+-
+---++
++-+++
+++-+-
-++-+-
-++-++
+++++-
--+---
++--++
---+++
+++---
-+++--
--+---
+++++-
-++--+
-----+
--++++
-+--+-
+++-+-
++--+-
-+--++
------
--+-+-

Generation = 500, Population = 137.
+---+-
-++--+
-+-+--
++----
-+--+-
+--++-
--+---
+-+--+
+-+-++
+-----
+-+-++
-++-++
+--+++
--+-++
--+-++
++-+++
-+++-+
+-++++
++----
----++
-+++-+
+-----
----++
+-++--
++---+
+--++-
----++
+-+-+-
-++---
++-+--
-+++++
++--++
-----+
++-+++
---++-
-+--++
++-+-+
+--+++
-++++-
-++-+-
-+++++
++--++
+----+
++---+
+--++-
------

*** Life<FredkinCell> 28x40 ***

Generation = 0, Population = 3.
---0------------------------------------
----------------------------------------
----------------------------------------
----------------------------------------
----------------------------------------
----------------------------------------
----------------------------------------
----------------------------------------
----------------------------------------
----------------------------------------
----------------------------------------
----------------------------------------
----------------------------------------
----------------------------------------
--------------------------0-----------0-
----------------------------------------
----------------------------------------
----------------------------------------
----------------------------------------
----------------------------------------
----------------------------------------
----------------------------------------
----------------------------------------
----------------------------------------
----------------------------------------
----------------------------------------
----------------------------------------
----------------------------------------

Generation = 102, Population = 234.
---3-4-2-5-------4-+----6-++77---8-67-+-
----------------------------------------
----4044-79+---0-4-9-8----2---4---4-----
----------------------------------------
--2-2-1476-+5--0-2-738-+7-+-3+---1--5-8-
----------------------------------------
0-2-5-9-5++---6--3---+-+++9-5-7-----49+-
----------------------------------------
--1-----4-------5---9--+869+-34-2048-8-5
----------------------------------------
2-8---------4-----2-5---2489782--36846--
----------------------------------------
3--+4---3-5-4-2-----------7+--2----4--3-
----------------------------------------
-++++++-7-8-4-5-3-7-7-5-----6-4-2-5---1-
----------------------------------------
378+-8-94-7---3-0-2---4-5-4-1---3-4-3---
----------------------------------------
4---+3+9-93--5--2-1-4+5---------0-2-----
----------------------------------------
-57-8-+7-64+79-5--1346-32---2-1-----1-2-
----------------------------------------
2-5-8----9-9-643--03-853-2--1-------1-1-
----------------------------------------
-1266-6----42-------2-454532--0---0-----
----------------------------------------
-3-65-8---5----1---5--4-13-20-------0---
----------------------------------------

Generation = 204, Population = 230.
-++-+-+++-+---+---+-+--++-++----+-+-----
----------------------------------------
+---++++++++---++-+-+-++++++++--+++--+++
----------------------------------------
--+--++-++--+-+----++-+-++--+--++-+-----
----------------------------------------
6-+--++-+++---+++-----+--++-+--+---+--++
----------------------------------------
+-+--++++++++-+----+---++++--++--++++---
----------------------------------------
-++-+--+--++-++-+----+----+-+-++------+-
----------------------------------------
++-----++-++++--+----+-+--++---+-++--++-
----------------------------------------
+-+--++++--++---+-+--------++++-+---++--
----------------------------------------
+--+-+--+-+-+--98-----+------+++------+9
----------------------------------------
--+++---+++---+86---+-+-+++-+--+--5-9--+
----------------------------------------
9-+---+--++++-+---+-9----+--------5---+-
----------------------------------------
+-+-+-+-+-+++++---9-+++-+-----+-6-------
----------------------------------------
----+--9-----+--8-+--+----------------+-
----------------------------------------
--+++--++-+-+-+-+---------8-+-----------
----------------------------------------

Generation = 306, Population = 254.
+++++--+---+-+--+-+-++-++++---+--+++-++-
----------------------------------------
++----+----+-++-++--------++++--++--+-++
----------------------------------------
---+------+---+---+---+----+-------+----
----------------------------------------
-+++-----+++----++-++++--+-+++--++-+++--
----------------------------------------
+++---++-++----+++++-++-++-+++---+-+++--
----------------------------------------
+-+++++++-+--+-+---++-+----+--+---++----
----------------------------------------
++++++--+-+-+-+-+++-+----+--+-+----+++--
----------------------------------------
-++++-+++-+++++-++++--++-++---+-+++++-++
----------------------------------------
++-+--++--++-++--++++--+--+--+----++-+++
----------------------------------------
+++++--------+--+++-----+-++++---+--+-+-
----------------------------------------
--------+-++-------++-+----+-+-----+-+--
----------------------------------------
--++-+--+-++-+--++-+--+---+++--++--+++++
----------------------------------------
+---++-+-----+---++----+--+--------+-+++
----------------------------------------
-+-----+-+--+-+---+--+-+---++-+++-+-++--
----------------------------------------

Generation = 408, Population = 248.
-+-+-+++--+-++++++---+-+-+++-+-+-+++++-+
----------------------------------------
--++--+--+--+------+----+-+-++--+---+---
----------------------------------------
+-++--+-+++++------++-+------++-+-------
----------------------------------------
---+++-----+++++-----++-++--++----++-++-
----------------------------------------
+-+--++-+---++-++---++---+--++-++--+-+++
----------------------------------------
++-+----++++-----+++-+--+--++++++-+--+-+
----------------------------------------
-+------+++------++-+++---+++++------++-
----------------------------------------
---+----+--+-+-+--++-+---+---+--+----++-
----------------------------------------
------------++-+-----++++++--+-+-++--+++
----------------------------------------
-++--++--++--+--+--+++++-----+-+-+----++
----------------------------------------
-++------+-+--+-+-+--+----+++++-+---+-+-
----------------------------------------
+-+-++-+--++-+-+++++++-+++++-++--++-+---
----------------------------------------
--+-+-+++-----+-+++--+----+--+-+-------+
----------------------------------------
-++-++-------+-+---+-++++++-+--++++----+
----------------------------------------

Generation = 510, Population = 268.
--+--+---+---+++--++-++-+---+----++-+-++
----------------------------------------
+-++++---+--+-++--+---------+-++++-+++--
----------------------------------------
-++++-+--++++--+-++++++-+-+--+-++++-++--
----------------------------------------
-+--+-++--++----+----+-+---+-+-+---+-+-+
----------------------------------------
-+---+---+++-+++-+--+-+++-++-+--++++++--
----------------------------------------
-+-++-++++++-----++++--+--+-+-++++-++-+-
----------------------------------------
--+-++-+-+--+-+-+-++---+-+-+---+-++---+-
----------------------------------------
+++--+-++---+------+------+++-+-----+-+-
----------------------------------------
------------+---++-+-++++-++-++++++-+---
----------------------------------------
+++--+-++-+-+--+-++++-++----+----+-+----
----------------------------------------
--+-++++++---+++-++--+-+-+-+-+--+-++++--
----------------------------------------
-+-+---+-+---+-+--++-+++----+++++---++++
----------------------------------------
-++++++-+-----+-++++-+--+-+-+--+-++---+-
----------------------------------------
+-++-+--+++-+++--+-++---+-+------+-+++-+
----------------------------------------

*** Life<FredkinCell> 38x3 ***

Generation = 0, Population = 12.
-0-
---
---
---
0--
---
---
0--
--0
---
---
---
---
--0
---
---
---
0--
---
---
---
---
---
--0
---
0-0
---
---
0--
---
---
---
---
--0
--0
---
---
---

Generation = 158, Population = 46.
+-+
+--
--+
+-+
-+-
--+
-+-
--+
-+-
--+
+++
--+
++-
---
+++
+-+
++-
--+
--+
--+
--+
+-+
+--
---
---
+-+
--+
+-+
+--
+--
+--
+--
+--
---
+-+
--+
+--
---

Generation = 316, Population = 45.
+++
--+
-++
+--
-++
---
-++
---
+++
---
+--
+-+
--+
--+
-++
--+
+++
---
+--
+-+
---
--+
-++
--+
-++
---
+--
--+
---
+--
-++
+--
-++
---
---
---
--+
+-+

Generation = 474, Population = 44.
-++
+--
+-+
---
+--
+--
-+-
---
+--
+-+
++-
---
-+-
---
++-
---
+++
--+
---
+-+
--+
+-+
-+-
+--
-++
+--
+--
+--
-+-
---
-++
+-+
-+-
--+
+-+
---
+-+
--+

*** Life<FredkinCell> 37x48 ***

Generation = 0, Population = 36.
------------------------------------------------
--------------------------------------------0---
-----------0-----------0------------------------
---------------0-------------------------------0
------------------------0-----------------------
----------0-------------------------------------
------------------------------------------------
----0-------------------------------------------
--------------------------------------0---------
------------------------------------------------
------------------------------------------------
------------------------------------------------
------------0---00------------------------------
------------------------------------------------
----0-------------------------------------------
------------------------0-------------0---------
------------------------------0-----------------
---------------------0--------------------------
------------------------------------------------
------------------------------------------------
------------------------------------------------
----------0--0-------------0--------------------
------------------------------------------------
----------------0----------------0--------------
--------0---------------------------------------
--------0--------------0------------------------
------------------------------------------------
---0----------------------------0---------------
-----------------------------------0------------
---------------------------------------0--------
------------------------------------------------
----0-------------------------------------------
------------------0---------0-------------------
0-----------------------------------------------
------------------------------------------------
------------0-----0-------------0---------------
------------------------------------------------

Generation = 108, Population = 876.
9++++--+-++-+-++-+++-+7++--+-8-++-+-+----++89+-+
--+++++--+--++-+-+-+---+-----++---++-++++-++---+
----++++--+++---++-+-+-++++++---++---------+++++
+-+--+++-++++-+---+-+-+-+-+--+---++-+---+++-++++
+++-+9++--+----+--+---+--++-+----9+--++++--+-+++
9-+++---+--+-++-+-+--++-+-+++-++-----------+-+--
-+-++-++-9+-+9-++----+--++-++-+---++-+---++++---
+6-+++-+-9--+-++-+++-++--++----++--++-+--+---++-
++--++++------++++--+--+---++5-+-+++++++++-++-++
--+++++-+-++++++-+-++--+--+---+++-+----+--+++--+
---+-+-+-+---++--+++--+++--+-++-++++++------+---
+-+--+--+-+--+7--++-+--+++++-++---+-++++-----+-+
-++---+-+++---++-+++-++-+++++++--+-++----+-++--+
+++-+--+-+++--+-+++-----++-+--+---+----+-++-++-+
-----+---+++-++-++++--+------+------+--++--+--+-
+++++--+++--+-------++-+--+-+---++++-++-++--+++-
-----7+------++-+--------++--+++---++------+-++-
++++-+--+---+---++-+--+-+++--++-+-++++++-+------
-9+-+-++++-+++-++-+-+++++-+-+++----++-------+-+-
+-++-+-++--+++----++++++--+---+-+++-+++-+-------
--+++-+9-+-++--+-++-+-----++--+++------+---++++-
-++------+-+++++--+--++--+--++-++---++++---+-+++
-+---++-+----+-+++----++-9+--+----+-+--+-++--+--
-+-+--++-+++-+--+-++++--+++----+-+--+++-+-+--+++
+--++-+-+---++-++-++++++-+++-+----++--+4+6--++--
---+-+++++++--++-+---+---+----+-+--++++++-++-+--
-+++-8---+--+--+----+9-+++--+---+++-+7++-+-7-9-9
---+++-+++--+----++-+----+---++8----------++--+-
-+----++-++++-+--+-+--+++---++--+---++++--++-+++
--+---+-++++++---++-+++-++-++-+--++--+----+-++--
+++-+++++++++--+-+-+++-++--+++---++++----9------
+7+--++--+--+-+-++-++-+----++-+---++-+++--++--+-
++-++---+----++++-+--+-+++-++------+-+-++--++---
---+----+-------++---+--++++--++++-+--+-+-+++9-+
++++-6---++8+-++-+++++--+++-++++--+-8--++---++-+
-+-++-+++---++-------+---++----+-+++++--+++-+---
-+-+-+----++--+--+-+++-+++++-+-------97+-+---+--

Generation = 216, Population = 866.
---+--++++-++-++++++-+-+----+-++--++-+--+++-+-+-
---+--+-++--+-+-----++-++++-+---+-+-++-+++------
-+---++++-+-+----+----+---++++-++--+---+--+-+--+
+-+---+-++++-+++--++-+++--+-++--+++++--++-++----
-++----++--++-+-+++-++-+--++--+-+-----+-+++--+-+
+----++-----++++--+++-+--+++-----++++---++-+--++
++-+-+++---+-++++-+-++++-++-+-+++--++----++-++--
--+-++-+--++--+++---+--+-++---+-----+-+++--+--++
---++++-++---++---+-++----+---+-++-++--++++-+-+-
--+--++--+-+-+---++-+-++-+-+++---+++-+---+++-+--
++-++----+----+--++-++++--++---+---------++-+--+
+--+----+++-+++-+-+---+-+-+++-+----+---+++-+++++
-++---++++-+++-++-+-++-+-+++-+--+---+--+-+-+----
++-+-+++-+-++-+-++----+-+-+++---+---+--++--+++-+
-++-----------+--+--+-+-+--++---+--+--+++++-++--
++-+--+++--+++-+-++---++++++++--+-+-+--+++---+--
-++-----+--+++-+-+--+++-----++-+-++-----++--+-++
++-+-+-++-+----++--+-+-+-++++-+-++++---++-++-+++
+-+-+-++++--+--------+---+-+-++--++-+---+++--+++
+--++++--++-+--++---+-+++--+-+--+--+++--++-++++-
+-+++-+-+--+--++---+-+--+-++++--+----+---+++-+--
+--++--+++-+-++--++-++++---+---+++++++--++-+-+-+
---+-+--+++-+--+--+------+----+-++-+--++---+-+-+
--+++--++--+---++++-----++-+--+------+-------+-+
+-++---++--+------+++-+++++-+-+-++-+-------+-+++
-++++------++++-++-+-++++++++-+---+++-+-+---++--
---++---++++------++-+++++-++++++--++-++++++-+++
----+--+++-+-+-+-+++++++--+-+--+--++---+++-+----
----+-+++-++-++-++-+-+--+--+-+--++-++--+--++-+-+
-+-----++-++++--+--+-+--+-++-++----+-+++++++----
++---+-+++----+-+-+--+--+++--++++-+---++---++++-
+---+-+--+--+++----++-+---+++---+++-++----+++++-
++--+---+--+--+--+---+---++-++----+-++++++-++++-
-++------+++-------++---++++-+++--+-+-+++-++++++
+-+--+-------+-+---+-+-+------++++++--+--+++--+-
-+++-+++----+-++++-+++----+--++--+----+-++-++++-
+-++--+-+--+++-+-+-----+++---++++-+-------+-++++

Generation = 324, Population = 835.
+---+++++---+++--++++-----++---++-----+---+-++++
-++-+++---+---++-++-++++++--+-+-+-+--++-+-++--++
--++-+--++---+++-++-+++-+--++-+++++++-+---++-++-
+-++++-+-+-+++---+-+++++---+--+---+--+-+-+-++++-
++----------++--+-+++----+-+----+-++--+-+++----+
++--++---------+-+-+-++-+-+-+--+++-++-+++-+-----
+++----+----++++-++++-+-+--++-+++-++-+++--+----+
---+++--++++-++--+-+-+-++-----+--++-++-++++++++-
+-----++++-++++--+-----+----++++--+++--+--+-+++-
+-+---+++---------+----+--+-+-+-----+----+-+-++-
------+------++++-+-+----+--+-++----+-++----++-+
--++---+--+++-+---++++------+----++--+--++++++--
-+-++--+++-+++-++-+++--++-+++--++-++--+-+-------
++++++---+-+++---++--+-+++--+-+++--++-+-++++++++
++-------++-+----+++++-+--++-+-++-++--++++-+-+-+
--++-+-+-----++++++-+-+-+----+--+++-+-++--+-++++
-+--++-++--+-++---++-+-+---+----+--++---+-+++-+-
-++-+++++--+-+-+-+-+-+--++--+++-+-++--+++-+--++-
-+--++-+----+++--+-++--++++++--+---+--+---+-++-+
+-+-+--+-+--++++++-++++-+++-----+---+---+----+++
+++-+---++--+-+---++-+++------------+-+++++-+++-
-+++++++--+-+-+++---+-++----+---------+++-+---+-
-+------+--+++---++--+-++-++--+-+-------------+-
---+--++-+---+-+++-+--+-+-+-+---+---++--+-++++-+
+---+++--+---+-++-+-+--+-+-----+--+--+-+++-+-+-+
+++-++---++-++-+++--++--+-+---+----++++-+++-+---
--+-+---++---++--++-+-+-+---+-----+++-+++----++-
----+--++-++--++++--+-----+-+-+-+++-+-------+-++
-----++--+++--+----+--+++--++-++--+---+--+-++++-
+-+--+-++--++-+++++--++-+-------++-+-+--+++++--+
-+--+++------+++--+---+++++-+--++--+--++-+-+++-+
+-+++-+-++---++++++---+--++-++--------+-+++-+--+
+-+----+-+-+---+++-++--+---+---++-+++-+++-------
-+--+---+--++-+--+--+--+-++++--+----++++---+---+
-++-++--++------+-+--+-++--+--+-+--+--++++---+++
-------++-++-+++-+-+-+--++---+--+-+-++---++++-++
+++---+++--+--+-+--+--+-+--+--+-------------+++-

Generation = 432, Population = 884.
-++++++++-+-+--++++---+--+-+--++++--+-+--+-++++-
+-+-++++-+-++++--+----+-+----+++-+-++--+++-+----
+++++-++++++--+------+--+++-+-+++----++-----++++
-+-+++-++++----+---+++++----+--+--+++-+++++++--+
-+-+++-+---+---++--------+-+--++--+-+-+-++-+-+-+
--++--++----+--+++--++++++++-------+-+++++------
++-+-----+--+---++-+++-++-+---+--+----++-++-++++
+--+-++---+--++------++-----+-+---+----+-+-+-+++
++-------++-+-+--+++-++-++-++--++-++++++++--++-+
--++-+------+-------++-++++---+++-------++-++++-
+++------+-+++-+--+-----+---+-+--+-++-+++--+++++
+++---++++-+-+++-+++++--+---+-++++--+-+--+---+-+
---+-++-+-++-+-+-+++++----+-+--+----+-+-+----+++
-+++-+-++--+++--+--+++++++-+-+--+----++-+--+++-+
--++---+-+---+++-+-+--+--+--+----+--+-----+++-++
+-+-----+--+----+--++---++------+++++-+---+-+-+-
--++----++++------++--+++++-++--+--+++++--+--+--
-++----++-+----++--+++-+-+++---++++---+--+-+--++
+++-++--+--+-+-+---+++-+-+-----+++-+--+++++-+---
-+++-+-+++-++++-++--+-++++++--+++--+--++-+++-+--
--++--+++-+---+----++++--+-+++++--++-+++-++-++--
-+----++-+-+-++---+-++-+-+---++-+++-+---+--++++-
++-+-+-++-++-++--++------+-+++-+----+-----+-+-+-
-++++--++-+-+++-+-+--++----++--+++-+--++------++
+--+++------+-+++++++--+-+--++---++++++----+++-+
---+----+-+---++---++-+-+++-+++++---++++++++-+-+
-++--+------------++-+++--++----++---+--+-+--+--
+++++++--++-+----++-+++--++++-++-+++-+---+++-+++
++++-+-----++++-++-+-+---+-+-------++++-++--+---
+-+-+--++++--+-----+----+-++-++---++--+--++-+---
-+++++---++-+--+++--++---++-++--+++-+++--++---+-
+---+-+++----++++---++-+---++---++-++--+-++++---
+-++-++-++-+-+---++--+--+-+++++-+++++-++-++++-+-
+-+---+-+-++-+-++-++-++-+--+++++-+--++-+++--+-++
++-+-----+--++-+-+++----+---++-+---++--++++++--+
-+-+------+++++-++-+++--+-+---+++++-+-++--++++--
+-+-+--++--++-++-+-+------+-++-+---+--+--+-++-++

*** Life<FredkinCell> 43x36 ***

Generation = 0, Population = 50.
------------------------------------
------------------------------------
------------------------------------
------------------------------0--0--
----------------------0-----------0-
------------------------------------
------------------------------------
---0--------------------0-0---------
------------------------------------
------------------------0-----------
-------------------0-----0------0---
------------------------------------
--------------------00--------------
--------------0---------------------
------------------------------------
------------------------------------
------------------------------------
---------------------0-0------------
-----------------------------------0
-------------------------0----------
------------------------------------
-------0----------------------------
----0-------------------------0-----
-----0------------------------0----0
-----0------0-----------------------
---0--------------0-----------------
--------0-------------0-------------
------------------------------------
------------------------------0-----
----------------------------0-------
----------0------------0----0-------
------------------------------------
------------------------------------
------------------------------------
------------------0-----------------
-------------------0-------0--------
------------------------------------
--------------------------------0---
----------0-------------0----0---0--
----------------------------------00
---------00-------------------------
0-----------0-----------------------
----------------------------0-------

Generation = 72, Population = 517.
-9+-+-----4-84------+-+5----+-----+-
---+------97---9-----+-7--6-7-----+-
6--------8--+-+++-+-8++-9---+6+-+---
------------9--+-+-+7+-++9-+++-+-+-+
----8---+-+6----+--+----++-+-++3+-+-
---++--+-----+-+--+-7--------+-7+---
--+-3+----6-+--+--+-+---+----7++-+--
-+-5-++-+----+-------7+-------+---++
----+7---++-+-----------------+-----
+--+---+---+++----8-------+---+7-9--
-+-----++-+-++9--+---+++-7+---+----+
-----------+---+---+8--9-+-+-++-+9--
--+7-------7+----+++--++---8--+---+9
+++--------------5---+-++---+---+---
--+-9----+----+-7-+-+6-+-+--+--9---+
-----+-----+-+++--+-9----++--++---++
-6-+------+----+-++---+-+----+---+--
---+5-6------+-----+6+-+-+--+--79+7-
+--------9--+-++-+-5-++---+--++-87--
-------+--------------+8-+-+-+++-++-
----------+7------++--+--9----++--+-
-----9+-3---------+-+----+------+-+-
+8----+---+--+---+--+-+-----++--+-+-
---+---+---+9----8-+---++-++++9-+++-
--+++--9-9+7--+-+-9--+---+--+-+2+--+
-7---+-----++---+---++------9--6++--
----+-+---+--------++-8-+-8+--+---+-
---------5-+---+-7-+--+--+-+-+++-++9
--------+-+-+-+-----+++-+-------+---
+7-7------+-+-8--68---+-------------
+---+-+-++---------+-8-2-+--9++++++-
-----+-----+---76-+-+---+---+-+-----
+--8+-----+-------++--+-+----+++-+--
--+--9-+--5--5--+---+++6----9-------
-----------++---++--+-+-+--+-----6-+
-+-------9-------+-+-+---+---++--+-+
5-----------+8+-+---+-+-----+++-9--+
--++--++9--+--+---+--+8+--+---+-----
-+------+--9+--+--+++++--++++----+++
-+-7-+-------+--++-+7-+--++-+++-+++-
+-+--++-+-+++-+----++-+----+-+---+--
+-+++-----+--7--+-----+-5---++-6----
----------+--------++++--+-6++--+---

Generation = 144, Population = 476.
----+---+-+-++---+-------+-++-+-+---
-++-+--+------+---+-----+----+-+--+-
++------+---+--+-++---+-----+-+++---
-+--+++----+-------+-----++-------+-
+----+--+---+-+---+-+-+---+++----+-+
--+++------+--+-+-+--+-+---++---+---
----+-----+-+-+-------++-++-++---+--
----+++++-+-++---+++++++-++----+-++-
----+-+++++-+----+-----+-+-++-+--+--
-------+--+-+-+++---+--++---------+-
--+-+----+++-----+--+--+--+-++------
---+------++-+--------+--+-+-+-----+
--+-------+--+++-+-+--+-----+---+--+
+-+-----+-+++-----++++++--------+-+-
--++-----------------+------+-+--+--
---+-----+----+----+----+-----------
----+--+-++-+-+-----+---+---++------
+------+---+--++-+-+---+-+-++---+---
++------------+-----+++---+-+--+-+--
-------+--++-+-------++--+-+-+++----
--+-----------+------+--++--+-+-+-+-
+-++-+-+-----------++---+--+-+---+++
+-+---+--++--+-----+-+-+--+-----+-+-
---+-------------+++---++---++---+-+
-+--------+---+-+---+-++--+-++++-+--
+---+-+-------+-+---+-++------++-+--
--------+---+-+---+-+-+-+--++-+--+++
---------+---------+-------+---+----
++-++-+--+------+-++-+----+-----+--+
---+++-+------------+---+-------++++
-----+---+-++++----+------++-++-+---
---+-+--+-++--++-+++----+-+-----+--+
--------+++--+-----+----------------
++-+---+----+-------+---+---++++----
----+++-------++++-+-----+----+-+-++
-----+---+----+--------+--++--++----
+--+----++------+---++--+------+----
--+++---+--+--+---+--+-+---++---+---
-+-+--++------------+-+--++-++---+-+
++++-+--+--+-+-+-+-+--+-+++---++++++
---+++--------+-----------++-+--+---
+-+-+--+------+++----++-+-----------
--+-----+---------++++--++--+-+---++

Generation = 216, Population = 812.
--+--+++++-+++---+++++--+-+++++-++-+
+-+----++-+--+---+--+++------+---++-
+-++-+-++++--++++++-++---+-++-+-+---
+-+---+---++-++++-+-----+++++-++--+-
-++---+-+--++-++-+-+------+++-+-++++
+--++---+--+----+-++++-++-++-+----+-
++-+-+--+-+++++++-+++---+-+++-++++++
+--+++----++++--+--------+--+--+--+-
++++----+-++--++-+--+-+++++---+--++-
+----+--+---++--+-++---+-++--+--+---
-++-++-++++++--+++----++-+-+---+-++-
++-++-+++-++---+-+-+++++--+----++-++
-+++----+--+----++-+-++--+-+---++---
---+-++++--+++---++++----+--++++---+
----+-++-+-+-+-+--++++++----+-+++-+-
---+++-++--+--+----+-+--+--+--+-----
+++++++++++-+++-+-+-+-+--++--++---+-
-++-+-+----+---+-+--++++--+++--+++-+
++++-+-+++++-+++-+++++-+++++-++--+++
-+++-+-++-++-++--+++--+-------+++---
--+++++-+------+++-++++--++++---+-+-
++++--+-++++--++-++++++++-++-+---++-
+-+--++-+----++-----++++++----+++---
++++++----++-+-+-++-----++-+++-+--+-
-++-++-+++-+---+--------+-+++-+----+
-++--++++-++--+-++-++++---+--++--++-
+-++-+-++-+-++-++++++-++-++--++++---
-++------+++-++++---+-++++-+-+++++--
+++-+--+-++--+--++-+--+--+++---+--++
---++++++-++-+-+--++---+---++-++-++-
--++----++++--++++------++-++---++++
-++-++++----------++++++-+-++-----+-
-++-+--++++-+++-+-+-+++----+-++-+++-
+-----+---+++-++--++++++++++++--++-+
+-+-+++-+-+-+-+-++++-++++--++++++++-
---++-++++-+-+--++++-----+-++--+-++-
--++-++-+++++++--++----++-++++--+-+-
+---+-+++-----+--+--++++--------++++
+--+-----++-++-+-+++++-+++--++-+++++
+-++--+--++--+-+-+-++--+-++------+--
+++++--++--++--++-++---+--+---+++-+-
--+-+-+-+++--+--+-----++++-+-+++++++
---+-+----+-+--+++++-+--+++--++++++-

*** Life<FredkinCell> 1x32 ***

Generation = 0, Population = 22.
000---0--00000000-00000-000-0--0

Generation = 46, Population = 18.
+++++++--+-76+-9+--7-++-+------+

Generation = 92, Population = 16.
++++-++---++--+--++--++-+-----++

Generation = 138, Population = 16.
-+-+-+-+++---+-++-++---+-++--++-

Generation = 184, Population = 17.
++-+-+-+++----++++-+--+-+--+--++

*** Life<FredkinCell> 2x2 ***

Generation = 0, Population = 4.
00
00

Generation = 135, Population = 0.
--
--

Generation = 270, Population = 0.
--
--
