25

9 2
11
0 0
0 1
1 1
2 1
4 0
4 1
6 0
7 0
7 1
8 0
8 1
3 1

7 5
15
0 1
0 4
1 1
1 2
1 4
2 0
2 1
2 2
3 3
4 0
4 1
5 0
5 1
6 1
6 2
2 1

8 6
25
0 0
0 3
0 5
1 0
1 2
1 3
2 0
2 2
2 3
2 4
3 0
3 1
3 3
3 4
3 5
4 0
4 3
4 4
5 0
5 1
5 4
6 5
7 0
7 2
7 5
3 1

6 5
16
0 0
0 3
0 4
1 1
1 2
1 3
2 0
2 3
2 4
3 0
3 2
3 3
4 2
5 1
5 3
5 4
5 1

3 1
2
1 0
2 0
4 1

1 5
2
0 2
0 4
8 1

1 8
2
0 0
0 1
2 1

10 3
14
0 2
1 0
2 0
2 1
2 2
3 0
4 0
4 2
5 2
7 0
7 2
8 1
9 0
9 2
8 1

9 10
52
0 1
0 2
0 3
0 7
0 8
0 9
1 0
1 3
1 5
1 6
1 8
2 0
2 1
2 2
2 5
2 6
2 8
2 9
3 1
3 3
3 4
3 6
3 7
3 9
4 0
4 1
4 4
4 6
4 7
4 9
5 2
5 5
5 6
5 7
5 8
6 3
6 4
6 5
6 9
7 0
7 1
7 2
7 3
7 4
7 5
7 8
7 9
8 0
8 1
8 2
8 4
8 9
7 1

9 3
14
0 0
0 1
1 1
2 0
2 2
3 0
3 1
4 1
5 2
6 2
7 1
7 2
8 0
8 1
8 1

8 9
42
0 0
0 1
0 3
0 4
1 0
1 1
1 3
1 4
1 6
1 7
1 8
2 0
2 1
2 2
2 3
2 4
2 6
2 7
3 0
3 2
3 5
3 7
3 8
4 0
4 1
4 2
4 3
4 4
5 1
5 5
5 8
6 2
6 4
6 7
6 8
7 0
7 2
7 3
7 4
7 5
7 6
7 7
1 1

10 8
39
0 2
0 3
0 4
0 6
0 7
1 1
1 2
1 4
1 5
1 7
2 1
2 2
3 0
3 5
3 6
4 0
4 1
4 3
4 4
4 5
4 6
5 2
5 3
5 5
6 1
6 2
6 3
6 4
6 7
7 5
8 1
8 3
8 5
9 0
9 1
9 3
9 5
9 6
9 7
3 1

5 1
2
3 0
4 0
6 1

5 1
3
1 0
2 0
3 0
5 1

4 1
2
1 0
3 0
10 1

3 3
2
1 0
1 2
10 1

6 4
14
0 0
0 1
0 3
1 2
2 1
2 3
3 0
3 2
3 3
4 3
5 0
5 1
5 2
5 3
10 1

10 6
29
0 0
0 2
1 1
2 1
2 2
2 3
3 0
3 1
3 2
3 5
4 0
4 2
4 4
5 1
5 2
5 4
5 5
6 1
6 4
6 5
7 2
7 4
7 5
8 1
8 3
8 4
9 1
9 3
9 5
8 1

10 3
10
1 2
2 2
3 2
4 0
5 0
7 0
7 1
8 1
9 0
9 2
1 1

10 1
6
1 0
2 0
3 0
4 0
5 0
7 0
6 1

1 7
5
0 0
0 1
0 2
0 4
0 5
1 1

8 8
31
0 1
0 2
0 3
0 4
0 6
0 7
1 2
1 6
1 7
2 2
3 0
3 1
3 2
3 3
3 5
3 6
4 0
4 2
4 5
4 6
4 7
5 1
5 2
5 3
5 7
6 0
6 1
6 2
6 7
7 1
7 3
5 1

4 5
8
0 2
1 0
1 1
1 2
2 1
2 2
3 3
3 4
10 1

8 10
41
0 0
0 2
1 0
1 2
1 3
1 4
1 5
1 6
1 7
1 8
2 1
2 3
2 5
2 7
2 8
3 0
3 1
3 2
3 5
3 6
3 8
4 0
4 5
4 6
4 7
4 9
5 0
5 1
5 2
5 4
5 7
5 8
6 0
6 1
6 3
6 6
6 9
7 0
7 2
7 3
7 8
2 1

7 3
12
0 0
1 0
1 1
1 2
2 2
3 0
3 1
4 0
4 2
5 1
5 2
6 2
8 1
