*** Life<FredkinCell> 27x2 ***

Generation = 0, Population = 20.
00
0-
-0
0-
--
-0
--
--
--
0-
-0
00
--
0-
-0
-0
0-
-0
--
-0
--
--
00
--
-0
-0
--

Generation = 37, Population = 29.
-9
-+
--
-2
9+
-+
9-
4+
--
6-
7-
-3
84
-6
9+
6-
++
+-
--
+-
+-
--
+-
5-
8+
--
6+

Generation = 74, Population = 27.
-+
-+
--
+-
++
++
++
-+
++
++
-+
+-
+9
-+
--
++
--
--
++
-+
--
++
-+
--
--
--
--

Generation = 111, Population = 32.
++
--
-+
++
--
++
+-
+-
++
-+
++
++
++
--
-+
++
++
+-
++
-+
--
-+
+-
++
-+
--
--

Generation = 148, Population = 29.
--
-+
++
+-
++
+-
++
++
++
--
-+
--
--
++
+-
-+
+-
++
++
--
-+
--
-+
--
++
--
++

Generation = 185, Population = 30.
-+
++
++
--
-+
-+
--
+-
--
-+
-+
+-
+-
--
++
++
++
--
++
--
+-
-+
++
++
--
++
++

Generation = 222, Population = 25.
--
++
++
-+
+-
--
-+
--
++
--
+-
+-
--
-+
+-
-+
++
-+
++
-+
--
-+
++
--
--
-+
+-

Generation = 259, Population = 28.
+-
-+
-+
--
++
--
-+
-+
--
+-
-+
-+
++
+-
-+
+-
-+
+-
++
+-
+-
+-
++
--
++
--
++

*** Life<FredkinCell> 35x34 ***

Generation = 0, Population = 33.
-------------------0----0---------
-------0------------0-------------
----------------------------------
----------------------------------
-------0----------0---------------
----------------------------------
-------------------0--------------
----------------------------------
----------------------------------
--------------------0-------------
------0-----------0---------------
----------------------------------
----------------0-----------------
----------------------------------
---------0--0---------0-----------
----------------------------------
--------------------0-------------
----------------------------------
---------------------------0------
--------------------------0-------
----------------------------------
----0---------0-------0-----------
---------0-----0------0-----------
-------------------------------0--
------------------0---------------
-----------------0----------------
---------0---0-----------------0--
----------------------------------
----------------------------------
----------------------------------
---------------------0------------
----------------------------------
---------------0------------------
-------------------------0--------
-----0----------------------------

Generation = 36, Population = 298.
--3----77949+--35+76-7-8-3---2-8--
------2---5-+-7-24-572-3-0-1-----1
-3----5--6--4-----4--6------------
-------------------------------2--
-0---5+-18-5887-9--6-----5--------
----1--------16-------87-5--------
-----8-3---6+856--8+-5+-5-----1---
--------------------------30-----5
-----------6548--5-+9--3-552-1----
2-----3-3-6-5-9-----7----35-------
-----------7---+7+9--67-7-464-----
----------------------5-------4---
-----5------45---24--5287--5---5-1
----------2--2--6----6------------
---8+----+7------7--+--+-+--6-2+--
----6-----5----------------2-----7
--------98-446--5-+6-----------6--
6---------6---4-12--6-7---------5-
-----7-+----87-6----87--+---------
5----28-4-----3-------6-------45--
--3------3--3-555-57---5-------9--
----------9--3+-7--38---3-8-1-6-2-
---688-6-+56+---85-9-+--+--2---4--
-2--3----41---------------3-------
-----6-------974--9---97--54------
-------435----9444--7-75--4-----1-
-4-6----1--566---6---82947-----4--
-----3----------------------------
--1------54---52--+3-+--5---------
---1-5-3-----4-----45-------------
-----------4-5-274-446---+-65--7--
----------------------------------
------35---2-----6-+5-------6--+--
-0-2-3-3-1-----05---8---3---------
---1-----3-2--4----3--4----+-2---4

Generation = 72, Population = 323.
-----8---+++++---+--++---9++--+--+
------6--+--+-+---+--5+---+-+-----
-+----------++4++----------+------
--------------------------+-------
----6-+-+++-----+-+-+++-+-------+-
-4--5-------+7-+----+-+---8-+-----
-8-+6++--+-+-++-----+++--9-++---9+
-------------------------------9--
-----------++++-+--+-----++++-+-9-
-7----+-----+++9-8+---+---+-+-----
------++++---+--+-++-+---------+9-
------------------5-5-----------7-
-++-------+-+5++--+-----+-7---4---
+-+---++6-+-+-+-+-----+-----6-7---
++------+++--+-+++-++----++++-8-+-
-----------------------4-+---+-8--
------+---+-+--+--++--+---+-------
-------8-1-7+-+-----+--6--6-6-----
-+-+---+--+--+++-9-+-+-++-89---+--
------------8-----------8---------
-----9-+6-+-------+---+-6---------
7-+---+-----+---+-+-+---++--7---9-
----+-+++--+--+++-++---++--6+-+-+-
-----------------+-----+-----+---+
----8--8-+--+-+-+---+--+--+-+---+-
---9-----------+-5--+------------+
-+-+--++---+-+-+-+++-+-----+-+---+
------------------6-+-----------6-
-+-------+-8----9--------------+--
3-6---9-+-+-+-+-+--++-+-----6-8+-3
-9-8---7-8--6-+5++++--++----+-+--5
-----------------------+-+---+----
-+-------+5-+----+--+-+-+-++------
----8----9----+-------+--4-8-7----
-8---9-+-------+-+---+-+-+-+-+-+--

Generation = 108, Population = 583.
---+-+++-+++---++--++---+++++++--+
+-+6--+-++-++-+--++--+--+---++---+
--+-+-+--+-+-+---+--+++++--+++---+
+----6+-+-------++----+-+8--+---++
-+-+-+-++--++-+-+---+--++--++-++++
--+-9+-+------------+9+--+++++++-+
--+--+++++++---+++++++---+++++--++
6+-------+---+--+-5-----8------+--
---+--+++---+-+--+----++-+--+-+--9
+---+--+-+--++-+++--++-++++++---++
-++-+++-+--+-+++++---+-+--+++---++
97+-+4+-+--++++-+-------+------++-
--+--++--++-+---------+-+++---+---
+--++++---+------+---++----++++--+
+++-+-+-+----+--++-+---++++-+-++-+
+8--++++-++--+-+++------8--+---+-+
+---+-+-+--+++--+-+-+-+-+-+-6---+-
-+-++++--4-++++++-++--+++-++++-++-
-++-+-+-+--+-++-++--++++-++---++-+
-6++------+8-+--++-+---++---++-++9
+-+++++++++---+--++-++-+--+----+++
+-+---++-----+---+--+++++--9++--++
--+-++--++-+++++++--+----+-++--+++
+---+-++--+-+--++--+-+-+-+8+-+---+
-++--+++-----+----+--+---++-++--+-
-+--+-------+-++--+--+-+++--+++---
+-9+-+++---+++--++--++-++--++-++-+
++67+++----++++----++-++++--+7+++-
-+---+++--++++++---+---+++-+---++-
-77-+-----+---+-+-+--++--+--+----7
+++-6--++++-+-++-+-++--+++-+-+---+
+---+9-7--+-6--9++--+-----++----7+
---+-+++-+++-++++-++-+-++--+-----+
-+-+---+-+----++-+++-++++-+++-++6-
---++--+++----+++-++-++++-++-++-8+

Generation = 144, Population = 306.
++--+++++-+-----+---++-+++----+---
---+--+----+----+--++---++-------+
+---++-----+---+---------+--++--+-
----------+---+-----------+---+---
--+++++--+-+-++---++--+-------++-+
+-+-+---+-------++--+----++-------
-+-+-+++--+-------+----+-+-+--++--
---------------+---+-+---+-----+--
--++--++-+-----+-----++-------++-+
-+--+++-------+-+---+-+-+----+---+
-+-+-++++-+---++----+--+-+---++---
--------------------------+-------
---------++-++------+---+--+---+--
---++--++--------+-+---+----------
---++--+-+--+++-+++-+-----+----++-
-------------------------------+--
------+++------++---+---+--++---++
---+---++8---++----+--++---+---+--
-----+---+---+--++---+-+-------+--
+-------------+-------+---+---+---
--++-+-+-+-------+++-+-+---+--+---
+---+---+++-++----+-+-+----+---++-
----++-+-----+---+-++----+++---+-+
---+-----+-----------------+-----+
-----+--+---+-+----+--+--------+-+
----+---++---+-------+-+----------
--+++++++-------+-----+-------++-+
----------------------------------
++--+++--------+--++-----+--++--+-
-+---+-+---------------------+---9
++--------+------+---+------+-----
---------------+---+-+---+--------
-+-++++-+-+--------+-+--+--+--++--
+++----+-------++----+----+--+----
-+-----+-+-+---+--+--+---+---+---+

Generation = 180, Population = 587.
-+++-+--++--+---++-++--+++-+-+++--
++-++-+--++-++++--++++-+---++-++--
--+++---+-++-+-++++-+++-+---++---+
+--++-+-+-+-+-+++++++-+-++++--+--+
--+-+++---+-++---++----+-+++-++---
+--+++++------++++++++-+++-+-----+
+-+--+---+------++-+++---++-++-+--
------++---+-++++--++---------+---
--+++-+---+++--------+-+++++---++-
-+++-+---++--+++---+--++-----+--++
---++++-+++-------+--+-++---+++-+-
+-+-+++-+++---++-+-+--+--+----++--
+-++++-+-+-+-+++-+----+++-+--+++++
++-++-+--+-++-+++-+-+--+-++-----++
---+-+-+-+++-+++-+++-++++++----+--
++---+++++---++-+-----++--++-++-++
+++-+---+-+-+-++++++++-++-+-+----+
+-+++---++-++----+--++-+----+++-+-
-++++++--+++-+-+--+--+-++++-+++--+
+++++++-+-+---++---++----+-++--++-
+----++++-+++--+-++-++-+-+-+----++
-++-+-+---+-+---+-+--+--++-+----++
+--+-+++---+++--+-+++++++-+++----+
-+--+-+-+--+-++++--+-+-+------+++-
-+-++---+-+-+---+---++-+++---++-++
--+----+-++--+-+++++++-+-++--+++--
++-----++---+-----+++----+-+-+++--
-+---++---+---+--++-------+----+-+
++++-++-+-++----+-+--+++++-+-++---
++-+-++--+---++++--+--+-+--+-+++--
+++-------+-+++--+---+-+--++++--+-
-+---+---+++--++---+---+---+-++--+
-+-++----+++--+++--+-+---+++++----
-++-+++-+++++-+-+-++---+++-+++-+++
----+-++--++++--+-++-+---++-------

Generation = 216, Population = 501.
+--+++++++-+-+-++-+-+-++--+++-+-++
++++-+++-+-++++-+---++-+-++-+-----
+-----++-+--+-+---+-+-++-+---+++--
----+-+-----+-+-+-+-+-+-----------
++-----++-+++--+-+++-+++++---+--++
+-+-----+-+----+-+++--+-+-+-+-----
+--------++++--++-----+-+++-----+-
-+-+-+-+-+-+-+-+-+----------------
---+---+--+--++-++-++-++--+--+++-+
+---+--+++-++-++++--------++++-+--
-+--+++++-+-+++++--+-+-+--+++++---
--+-----+-+-+-----+-----+-+-+-----
------+--++-+++-++--+-+-+--++----+
-+++----+---+-+-+--+++----------+-
+---+-+--+++-+-+----+-+---+-++--++
-------+-------+-+-+-+-+----------
-+++--+-+++++--+-----+--+++--++-++
+---+-+-+---++-+-++-+-+++--++--+--
-+--+-+++-+---++-++-+---+++++---++
--+-----+-+-+-----+-----+-+---+-+-
--+--+--++++--+++-+++--++++-+++---
-+++++++-++-++++-++-+-+--+++-++---
++++-+-+++++-+++++-+-+--+++--+++-+
-+-+-+-------+-+-------+-+-+-+----
--+----+--+++--+-++--+++-++---+++-
+-+-----+-+---+-+--+++-+-+-++++-+-
-+----+-+++-+----++-++---++----++-
----+-+-------+-+-+-----+-+-+-----
++----++-+-----+-+--+-+-----------
---++-+----++++++-++-++++-+-+---+-
---+-+-----+-++----+-+-----++-+--+
-+-+-+---+-+-+-----+-+-+----------
+--+-----+--++-++-++-+--+--+++--++
+---------+------+-+++-++-----+++-
+-++++-+++++++-+--+---+--+------+-

Generation = 252, Population = 557.
-+----+-++-----++-+-+--++-------+-
-++-+---+-+-+-+-+++----++-++-++++-
+-+++-++--++++-+-++-+-+-+--+--++-+
+-+-+-+--+-+-+---+-+-++--+-+-+-+--
-+----++----+-+-+++--+---+----++++
-----+--+---++++-+-+-+-----+-+-+--
-+-++++-+-+--+--++-+-++----+++--++
----+++++++-------+-------++-+-+--
--+++-+----++-+--+----++++-++--+-+
--+--------+-+++---+-+-++++--++-+-
-----+--+--++-++-++--++--+++++++--
-+-+-+--+-+-+----+-+-+++-----+++--
-++----+-+--+++--++++-+++++-+-++--
+-+-++++++++++-+-++++--++-+---++++
---+++++-+-++-+++----++++-+-+--+-+
----------+-++++++-+-+-+---+-+-+--
+++-+-+-+-+-++-+---++-+-++--+++-+-
-+++-+-+--++++++---++----+-----+-+
-+++----++++--+-+---+++-+--+------
-+-+-++--+-+-++++++++-++-----+++--
-----+-+--++++-------++---+-++++-+
--++--++-+-+++-+----+++---++--+-+-
++---+++-+++++--+----++--+-------+
----------++-+-+--+++-+-++++-+-+--
+-+++-++--+++++-+--++----+--+--+--
-+----++-+-++-+--------++-------++
+++-+-+--+--+--+--+-+---++++-+-+-+
-+-+-+--------++-----++++++++-----
---+-+-+--+-+++--++++--+---++-+++-
-+---++-++--+---+-++-++---++-+++--
+---++-+----+-+---+++-+++--++-++--
-----+-+-+---+-+-+++-+-+----+-+-+-
+++-+-+-+---+-++++--+++--++------+
-++-+-+-+-++++-++++-+--++--+--++++
-+-+--+---+++-+---+---++-+++++--+-

Generation = 288, Population = 315.
-+---+-+-+++----+--+-+-+---+-++-++
-+----+----++--+---+++------+-----
------++---------+-------+---+-+--
----------------------------------
----+--+-++----++------+-+++-+--++
-+-----+---+-+------+------+------
----++-+-+-+---+--++-++-+-++-+---+
-----+-+-----+--------------------
++-----+++---++----++-+++--+-+---+
+-----++----+-+-+-+-+-----+---+-+-
+---+-+---+---+-----+-----++----+-
--+-+-----+-------+-------+-------
--+--+--+---------+--+-++--+--++-+
----++-------++----+--+----+------
++++----+++-+-+++++++-+++-----+-+-
-----+-+-----+-----------------+--
------++--+-+--+-----+--+---++--+-
+-------------+-+++-+-----+-+-+-+-
---------+----+---+++------++--+-+
--+-+-----+-+---------------+-----
----+----+--+----++-----+-+-------
+-----+---+-+-+-+-+---+-+---+-+-+-
--++---++++-+-+-++---++-+----++-+-
-----------------+-----------+----
+--++---+--+-+++-++-+++-++++-----+
---+-----+---------------------+--
-+-++-+-----+-++--+-++----+-+--+--
--------------------------+-------
----++------+---+-+-----+-+-------
----+---------++------++-+---+-+--
+--+--++-+-+++---+--+-+--+---+---+
-------------------------------+--
++----++----+-----+-++-+-----+----
--+-------++---++------++------+-+
-+--+--+-+--+--+--++---+--+--+----

*** Life<FredkinCell> 21x21 ***

Generation = 0, Population = 4.
---------------------
---------------------
--------------------0
---------------------
---------------------
-------0-------------
---------------------
---------------------
---------------------
--------------------0
---------------------
---------------------
---------------------
---------------------
---------------------
---------------------
---------------------
---------------------
------0--------------
---------------------
---------------------

Generation = 40, Population = 54.
------4-------------4
---0---03-2-2-3----2-
2-1-------------4-3--
---------------------
------6-3-2----------
---1----------------9
2-------------7-----6
---------------------
------------5-6------
3-4----4--------6-8-6
----3---2-4-------3--
---------------------
3-------------4------
---0---3-----------2-
------3-----3-3------
---------------------
----2-------------2-3
-------12-0----0-----
--3-------0-0---1----
---------------------
------1-------------1

Generation = 80, Population = 41.
--------+------------
--------------------+
--------------6---+--
---------------------
--------8------------
7-83-------4---1----+
--------------------+
---------------------
------------+---+----
----+-+6---4+-+5+-+--
------+-------------+
---------------------
9-5------------------
----+-+------------2+
------6--------------
---------------------
----5----------------
2-+----4-----------3+
----------+---6------
---------------------
----4----------------

Generation = 120, Population = 66.
------+-+------------
---5+-+6+-8-8-+-----+
--4---------------+--
---------------------
----9-----+----------
+-+6--------+-+3----+
+-------------+-----+
---------------------
+---------------+----
+-+-+-+9---7+-+-+-+-+
----------8-------+--
---------------------
--+---------9--------
---3+-+------------6-
------+-----+-+------
---------------------
--------6---------+--
6-+-+-+-+-+-+-94---7+
----------+-----4----
---------------------
----4---------------4

Generation = 160, Population = 50.
--------+-7----------
---6---6--------+-+8+
----+-------+-+------
---------------------
--------------------+
---9---9+-+8---5---++
--+-----+------------
---------------------
------+---------+-+--
---9+-++----+-+----7-
------+-------------+
---------------------
--+-------9---------+
-------++-+----------
----+-----------+----
---------------------
------+--------------
---7-------4---------
+-------7-----+------
---------------------
----6-------------7--

Generation = 200, Population = 96.
--------+-----+---+--
---7+-+9--------+-+9-
----+---+---+--------
---------------------
----------+---+---+-+
+-+-+-+-+-+++-+5+-+-+
+---+---+---+---+----
---------------------
------+---+---+-+-+-+
+-+-+-+---------+-+-+
+-+-+---+---+---+----
---------------------
--+---+---+---+---+-+
6-+-+-++----+-+-+-+-+
+-+-+---+---+--------
---------------------
------+---+---+---+--
7-+8+-+----5+-+-+-++-
+---+---+------------
---------------------
----9-----8---+------

*** Life<FredkinCell> 49x47 ***

Generation = 0, Population = 29.
-----------------------------------------------
-----------------------------------------------
-----------------------------------------0-----
-----------------------------------------------
-0-----------------------------0---------------
-----------------------------------------------
-----------------------------------------------
------------------0----------------------------
-----------------------------------------------
--------------------------0--------------------
-----------------------------------------------
----0------------------------------------------
-----------------------------------------------
-----------------------------------------------
--0--------------------------------------------
-----------------------------------------------
-----------------------------------------------
-----------------------------------------------
-----------------------------------------------
----------------------------------0------------
-------------0--0--------------0---------------
----------------0---0--------------------------
-----------------------0-----------------------
-------------------------------------------0---
-----------------------------------------------
-----------------------------------------------
-----------------------------------------------
-------------------------------------------0---
-----------------------------------------------
-----------------------------------------------
--0-----------------------------------0--------
-----------------------------------------------
-------------------------------0---------------
--------------------------0--------------------
-----------------------------------------------
-----------------------------------------------
-----------------------------------------------
--------0--------------------------------------
--------------0--------------------------------
---------------0-------------------------------
-----------------------------------------------
---------0-------------------------------------
-----------------------------------------------
--------------------0----------------------0---
-----------------------------------------------
-----------------------------------------0-----
-0----0----------------------------------------
-----------------------------------------------
-----------------------------------------------

Generation = 39, Population = 1097.
---13-2--14-142-6---2---1---0-00--2-2-20---010-
--30---010--1----0-0-0-0-0-0---010----1-0-45-0-
-36-7--221-62-5-6-3-----1--------21--310--1-020
0--0-03-1--0----7----0-----0---0-0011200-2+2642
----14332-34--54454---0-1---2-1----5265--50203-
1---303--13-+05-7-52---0---------0--1--120321--
23-2-1---2-25--6-3-23-----0-0-0-0-1-0--5--21---
--2-11--5041----7-2-4110-0--1--0-01-03-2-------
3--1--3-13-------4-23------111--15-100-40------
-0---------0---3--41--10-030002-4-103-5-21-----
-3-2--3--25-1-6-764--5310333313-2013-4-2-60-0--
10--7--0--60---2+---703-012220----7-0-523-7--4-
7---43--1--27--4---253-2-3-1----3----54206-51-2
50-0-0---2--60-4-031+-4-6042---0--4--21211345-0
-+--923-3----212-2-2-2-5727-3-5----43-104-26-8-
607-4-60-2-------240--313021-------1-2---27-4--
+63-33-58-21132-5-25--225245--4---200--4-2-73--
-0--813-62----4--0--40--907-20-0-0411-4--143-0-
-3-13455-2-21-714----2---2-4562--2061---1---1-4
2--0605091-124-------34--452324-3-35-372--4--3-
-----356--63-3--3--45-583-5733---65-48-8-5-----
---0-0----5-5054-07240445--26----0-2+2--6----1-
-----264751532-172-34--3-0------4-492---26---55
-2-05-----4-3-41--8----3--843----354---2-1+-9-1
7---3-495----21----42-213--4-4---417--2-6-13-23
--5-+-5-603--2-----24-5150-12-219-5-30-0-1-221-
1-----55--3120---14----4132-352-8321-35-3-0----
-13-4--4-5----3-73+-7--27352------638-5-----14-
-5-265------5---65-1-232032-137-7--242321-33303
71-03170-4-2-0-5-17-501250-07-0-----3---2-1-51-
----42-4--+-4-6---5423-24--7-1248---7-2--4-4--3
-0----0-4--1-27-------3----1215--4-4----------1
3-5-5--1-1-434----2-----2-4--4--------4--3-3-24
-2---1--1--------0-2--2------1---0-5-0--6----0-
--8---7--3-2-2--1---2--13----26-4-3----4-2-3-1-
-2-0---0------25-----1--31--0-51-----5423-----3
9-9-----4350--5-------4--571-2-6--6-45-14-2----
-1--53--535141---------5---44--531--5-44-3-5---
---256724-54-27-6---83--12--3---12-3413-4-2-3-1
-3-1523-43--600-77-2843--36----1-0711--212-3---
5---20---32-62---5-1222----30-4-0-3----13220--2
----------8------3--84-4-3-32----23-4-0-30--00-
4----6----454---23----3---1---0---1-3--0----2--
-6--7-8--4--65-56-3-6-------20----4-43-----35--
--5--3-37--255-1-132-82---1-26---341-154--5-00-
-1-5--726-4151---232441464---1121-304--112-3-02
755-+-+54864-756-6563---28--13--62-44---313-6-0
1040+5-2----6--2--23--0-32134-1-216----0--01-22
-35--560-5-4----4-30-3---03--2---24-2-4----302-

*** Life<FredkinCell> 28x11 ***

Generation = 0, Population = 24.
----------0
-----------
-----------
----------0
-0---------
0---0------
---0-------
-----------
-----------
-----------
--0--0-----
-----------
-----------
--0--------
-----------
--00-0-----
-0--0---0--
--0--------
-----------
----0--0---
------0-00-
0----------
-----------
-----------
-----------
-----------
--0-------0
-----------

Generation = 31, Population = 151.
9---73---5-
-2-3-15-5--
----6-6----
-6---3712--
----278-96-
-1375-9392-
348-+394---
32----5--4-
--+-6-4-2-8
62--7-5-72-
-++-+49--6-
-78-+-5223-
9-+--9-4--5
-8+7--82---
-+-6--7-3--
6--+--+397-
-1-4----2--
+-96+5--67+
-5-22545---
--+39+-3-9+
5--2--8--+-
-382--9--3-
-5--2+-5-7-
24--986--91
8-51-26-4-8
85+-7----6-
8--85-4----
4066---5-4-

Generation = 62, Population = 156.
++------+-+
+8+-+-++-3-
----+-+---7
---+-9+795+
++6-+-+-+--
+--++--9---
--+++-+-+++
56+6-5+7---
---7+++++-+
++-++---++-
-+----+96-+
---+-++----
-+-----8---
--+-+7-5-+-
-+---+++9+7
+-+-+--7-9+
-7--++-4+--
+8+9+-+-++-
+++-----+++
+8+7-+--+++
-++6-++----
+--8-9-+-9+
-+----++++-
--+8--+-+--
--7----4-++
-+++--++6+-
+++-+++----
+5+-+----+4

*** Life<FredkinCell> 20x8 ***

Generation = 0, Population = 25.
--------
-0-----0
--------
-0------
0-0--0--
--------
---0-0--
--00----
--------
-0------
0-------
----0--0
---00--0
------0-
--------
-0------
----0---
------00
-------0
-0-0----

Generation = 42, Population = 77.
--+-6-3+
495--87+
--5--+-+
6-+-+++-
-8--++8+
-5-+-89+
-+-7-7-9
--7+++--
-76--+6-
4-++-7--
86-+9+-+
---7++--
--++----
5+-9----
------+-
+38+--75
-+6+----
---+6--6
6---86--
----+-8+

Generation = 84, Population = 78.
++--+++-
-++-+-++
-+++-+-+
++++-+--
--+--+-+
-+--+--+
-+-++-+-
---++-+-
--+-+++-
--+-++-+
+--+----
-+---+++
++----+-
-+-+-++-
---+-+-+
--+--+--
-++-++-+
++-++-+-
+-+-+++-
--++--++

Generation = 126, Population = 44.
--------
++--+-++
--------
++--+-+-
+-+--+--
--------
---+-+--
+-+++-+-
--------
++--+-+-
+-------
----+--+
---++--+
+---+---
--------
++--+-+-
----+---
------++
-------+
++-++-+-

*** Life<FredkinCell> 17x25 ***

Generation = 0, Population = 32.
-------------------------
0-----------0-0----------
-0------0----------------
-0-----------0-----------
-------------------------
0--0---------------------
------0------------0-----
------------------------0
----0--------------------
---0---000---------0-----
-----0-------------------
--0-------------0-------0
------0-0------------0---
-------------------------
--------------0---0--0---
----------0--------------
---------0---------0-0---

Generation = 34, Population = 198.
-8-+----+--------4-7-81--
-78-8-8-+-8-4---8----16-2
-+------4---6--1-+--68-67
9--36-5-88-----3+-5---7-6
-53--5--+-849----4-8-+3-+
7---+5-8-+-39-+-5-+-+53--
----7--6+0---+-------+1--
6-90--96--763--4---6+4-93
-3--68----96-72-3-+--+39-
5-6--9-97-++9-7--6-57-776
-3----+---54--64-3--888+-
--+---92+-+---+25-6573---
7+4498--7-9--+--958+2444-
-8--+--94463--3--3--327--
7---7--48--5+-7--5---572+
6--35-93-43-8-6----5----5
4--5-+---767-91-7-8-7--4-

Generation = 68, Population = 188.
7+---++-+++--+-8----++-+-
--++++---+-+-9--+--+---+-
++---+-+-----++-8+---+--+
+----++---+--++-------+--
-++-++---++-----++---+---
+++-+-++++-----9--+-++---
+++9------7+-+-9--+69+-+-
-++-+-+--+--+++---+---8-6
-+--+++--8+-++++-------+-
+++++++-+--+--++-+++----+
--+---+++---+-++----++-++
-++-+++--++------++---+-+
-+--+--++-+-------+--+--+
++-++--+----+-++----+9---
+-+--++++-+-+--+++--+++++
-9----+-+-+--+--+-+-+---+
9--++-+--+-+--7+-+-6-+-+4

Generation = 102, Population = 234.
++-+-+--+++++++++++++++++
-+++---++-++--++-+++--+--
+-----+-++--+-++--++-++++
-++++--++---++++++-++-+-+
+-+8+---++-9+++--+--+----
+++--+-+--+---+++-+------
+-+---++-+--9+-+--+-+--++
-+-7--+----+++---+--+++++
+--+-++-----+++--+-+++-++
+-++---++-++--++-++----++
++--+-+--++-++++-++-+-++-
-++++++8---+--+-++++---+-
++-++-+-+++-+++++++------
-+-++-+--+-+-------++-+++
--++++--+++++++-++-+++-++
--+-++-+-9+-+-+7---9+++7+
++-+-+++++--++--------+--

Generation = 136, Population = 203.
-+-++++++-++----++++++-++
--+-+-++-----+-+-+++----+
-+--+++---++-+--+-+--++++
+-+-+++-+++--+---+--++---
-+---++--++-----+---+-+-+
++------+-++--+--++++-+-+
-+++++--++-+++-++-++-++-+
-+----+-----++--+-------+
++-+-+-+++++--+--++++--++
++-+-+-+-+--+-++++-+-+---
--++-+++----+-+--+++-----
++--+-+-+-----+---+---+-+
----+-+-+-++-+--+-+--+-+-
---++-++++-++-+-----+--++
-+++---+-+--+++---++++---
-++-+-+-+++--+--+----+--+
++-++-+--+-+-+-+++++--+--

*** Life<FredkinCell> 14x24 ***

Generation = 0, Population = 25.
---0--------------------
-----------0------------
------------------------
-----0-----------0------
-------0----------------
-0-----------------0----
-------0---0------------
------------------------
---0----------------0---
----------0------0-0----
--------0---------------
-------0---0-00-----0---
-0----------------------
-------0---0------0--0--

Generation = 22, Population = 167.
-1--12-3----1-----14-210
---4-21---3-----54166-2-
-515-62---5---2-010-631-
-7---227---3-63-4--65---
---4162-55--1-135-1333-4
2403-5--31--32-5-5324321
03--0-5---1---1--21667--
--2475-----7-6----35--13
55-3-3--51-5-1312---8-1-
--235-3-61--1-4-3-5+2413
-4-5-3---1---2-2514-9-1-
-+4----534-457-----826--
-6-2--12-2-4--0--1-74---
2--+-63----5-5122---1--2

Generation = 44, Population = 150.
3---77---1--542-3--86+2+
4-28--5----97----8--96--
-+5+5---98+--+--5-3--++7
3-5--9-+-------+------+-
28-+-----8--6---6-2-4--9
791-3--+55+--+5-7--6---8
4--9-7--+--33-355-4-+--+
4+9++8-6-6-+--+-62---958
+-------+-59-7--6---+-54
+------9+---4+---98+---+
--8+----9676+649+-------
++-+--4+++--++------7-+9
7-+67---------52-37++---
-+-++9--4-4-+----48-----

Generation = 66, Population = 131.
---+-+-6-------7-4-+----
---+---+-+---+-----+---+
-+---9-+-+---+---6--++--
-+---+---997---+---+-+-+
-+---+--+--+------4+-7+-
-----+-+9--+9+++-+--7+--
-+---+---++---+--9-++---
-++--+----+-7+-++--+-++-
-+-7-----8--+--7+--+-7+6
----+-++-----+-+8++-+---
--++-+-+-+-+-+++-+------
+--+-+--+-+-+++++--+-+++
-+-8++-9-6-+-----++-----
+-+-+---5++--++9--++--+-

Generation = 88, Population = 175.
++---+-++7--+++--+++--+-
+--++++--+-+-+++-++++---
-+++-+-+-+--++-+--+-+-+-
++-+-++---++---+++++-+-+
+---+++--+-+++-+-+5+----
+-8--+-+-+-+++++-++---++
++----++---+---++--++++-
----+---+--++---++--+++-
-+-++-+-+-9+--+---++--+-
-+-+----+-9-+--+-++++-++
+--++++------++--+--+++-
-+++-+-+-+++--+-++-+-+++
+-+-++++-+-+--+9-+++-+--
++-+++-++-----++-+-+-5-+

Generation = 110, Population = 169.
-+--+-++-+-++-++-++----+
--++-------+++-++---+++-
----++-++--+-+-+--++++++
-++-++-----+---+++++++-+
---+-+--+---+---+--+++++
--+-++-+--+++++++-+---++
--+---+-+-+--+++++--+-+-
-++----+-++++-++-+++-+++
-++--+-+--++---++-+++++-
--++--+-+-------++++--+-
-+-+-+-----+-++-+-++++-+
--++++----++-+-++-+++---
+-+-++-----+-+++++--+-+-
+++-+----+--+--+-++++++-

Generation = 132, Population = 146.
-+-+---++--+---++-------
-+----+--+++--++-++----+
---++--+-+--++-+-+-++--+
-+-+-+-+--++---++--+---+
+----+++-+-+---+-+--+--+
-+-+-+-------+--+--++++-
-----+---+-+++-+-+++---+
+------+--+-++-+----++++
---+++----+--------++--+
-++--++++-+-+-++++-+++-+
---++---++--+++++--+--+-
---++-++---+--+++-++-+--
++-+--+----+---+++--++-+
-+-+++++---+--++++-++---

*** Life<FredkinCell> 25x48 ***

Generation = 0, Population = 21.
--------------------------0---------------------
-------------------------------------0----------
----------------------------0----------0--------
------0------------0----------------------------
------------------------------------------------
------------------------------------------------
------------------------------------------------
------------------0-----------------------------
-0----------0-----------0-----0---0-------------
------------------------------------------------
------------------0-----------------------------
--------------------------------------------0---
---------0------------------------------------0-
------------------------------------------------
------------------------------------------------
------------------------------------------------
----------------------------------------0-------
------------------------------------------------
----------------------------------------------0-
--------0-0-------------------------------------
------------------------------------------------
------------------------------------------------
------------------------------------------------
---------------0--------------------------------
------------------------------------------------

Generation = 38, Population = 436.
---1-3-37-34---------4-7-5-4-1------0-3---2---9-
-------4----0------302------1----33------51-4-16
34---5---9-9-4-----5---3-4-7-6-3-6----7-+---8-8-
-1---2---45--73--43--241--6---523---6--36-52-334
138363-117-6-3-------2--38-454+-5-63----6-6---8-
---1------51---30-6-----13--32----3---3-16--42-5
3-9-49-3-753--53--2--232-2-33-----6--2--945-6---
-----5--9-5-48--8---55----43--------7-9---33---1
6-9-6-+2-+---5-----3-----67-8-----9-+-3-2--3+-7-
----1---6-3-3---0-6-1-4---------------3-1-3-41--
--6-5---4--3-----24--3------3-7-----4--6-3--92--
--2-------6--3------+38-6-7----------3----4-6-6-
--9--13---5---32--+7+-85------7------4-+-482+-71
--2-2-------4-----74---23----------2---72-2---1-
3-202-016-52-----36--3--44---31-21-2232786-1813-
5---3-3------48-+4---3--70-------2----4-41--3-6-
--7--28--5---22-3-54---26-0---2--31-64--2512-11-
--0-----0---4---3-1---314-3----2----6-1---02--02
----2--1--129-51-----01---3--------1945++-44--8-
-------------29--4+---5-3-5-5-----4-3---6---4174
------1-13---5------3-5-----4------5-3166143----
--1---0---20--024-4-2--23-2----2----1-0---1--01-
-1----0-4-43------+-3-----0-3----3---3--42--61--
1--------2---1----6-+45--2-------2---15-1--46-6-
---1-3--686-6---------4-3-4---0-1--42153-2-1--5-

Generation = 76, Population = 443.
5++-5+---+7----98-+-79--+--+9---4---7--9----5-+-
-----------5-8-4-+---5---6---5-------7---+------
-++-----7+-++++---++--9-9--++-6+6-+-+-+-+-9---+-
-67------------9+-+------5-8+-+7----+-8--+------
-++-+8+-4-----+-+9+-+--++--+----+-+5--+++--5+---
-------5---8-----3---7---+-----------+---9---4--
-----++--++-+--7--+-5-+9--+---++5--85------1----
+-+--++-+-+++-+9---+++-7+-7----2--+6------9-++--
+-----+-+-+-++-7---+8-++--+-+---+--5+-++--+++--9
---3---4-------------4-----------6---+---9---6-4
+-+--++-+-+-+-+---987-+----+--977-+----++-+----9
--+4+--5+7+8+--++--++--+--+4+---------+6+-----+-
-++--++---+4--+-8-+++--+--+-+--+5-+----++9-++-+-
---3-------------------------4---8---+---8---7-6
-+---67-+7--------+-+--++-77--9-+-47----+-+8+4--
+--1--+-+-++9--8-9+7-7+6+-72--893-+-6---+-8-+3++
++--7-+-6+--+5-+6-----+8+-6+7-9-+--49--+--8--95-
-----------------------------3---3---7---+---8--
4+--++--9----+--+-----7---+----+5-6-+--+--+---+8
--+-7-99-4+--8-+-+-+-7-7+8+5+---+-+---+4+4-8-6++
3-5--4+-+---++9-9++49---+-+5+-849--+------+-+--2
---------------------------------1---9---9------
----+6---+--+----6--------------9-84+------3+---
6---+6--+5-6+9+3-9--++-+++--313---5+-7+++9++-+-6
--6-3---++--+8--+----9+9+---3-3-------++3-+7----

Generation = 114, Population = 657.
++-+-++++++-----+--+++++--8-+-+---+9+++---+--5-+
-+++--5-++++++6--+----+-------8--+++7+--4+7--+--
-----+++--+++----+-++-++++-+++-+-+-+--++--++-++-
+--+--++-+-+--+-++-+++-+++-+++----+-++-++++-+--+
-+-++---+----++--++-+++-+-+++-++-++-++---+++++-+
+-+-+-+5+-+++---+--+6-8--+++-+--5+++-++-9+++--59
+-++--++-+-+++--+++++--+++++-+++-++8+++-++-4+8-+
+9----+----++++-++----+-+----5+8+8--+-+-++--++-+
++-+-+--++-++-+++-++--+++--+++++++-+++-+++++-+++
-8--+-++-++8-4--99++-++-+--++9+-6+-+--++--------
++-++-+-+--+--+--+-+++-+-+-+++++-+-+++--+-+----+
+8+9+----+---+-+--+--+-+-+-++-++-++--+++-+--++-+
+--+-++8-++--+-+++-+--+--+++-++-++++++----++-+-+
6-+--+--++---7++-8-++++--+++++-+-++-++-+---+----
-----+-++++--+---++9+++++++-++++-++-6--+-+++--+-
+--7--+---+-++--++-++-+---+--+-+7+--+--+-9--+---
+-++++-+-+-++---+--+-++---8++-+-+-+--+--++---++-
---7++--+9+8+----+-+--+--+++-++---6+-+--7---++--
-+++-+---++-+---+----++---++++--+--++--++---++++
+-+4--+-+-++-+++++-+--++-++--3--+7-9--++-+--+++-
++++-++--+-+++-8-++-+--++-++-+---++-+++++---+--8
55+-+-9-85--9-+98-9-+--+++-+-+-+--+--+9-8+----+-
++-++---+-++-++-+++++++-----++++++++--+++--9++++
+7++--+---++++++++--+-+--+-+-7---+-+---++++---++
---+-++-++++-++9++-6----+--+8--++++++---+--+-+-9

Generation = 152, Population = 454.
-++--+---+-+--++++--+-+-+-+++-+++---+--+---++-++
-----+---------------+---------+-----------+----
-+-+--+-+--+-++-++-++----+-+--++++++--+---+--+++
-++-++--+++++-+++++---+-+-+++-----+---+-++---+-+
---+++---+-++-+-++-++--+++-+--++---+--++-+++---+
-------------+---------+-------------+----------
-+---++-+++--++-++-+---+-++-+-----++--+---+-+-+-
+-+--++----+-------+++-----++---+-+-+++-+--+----
---++--+++------+-++---+--+-+--++--+--++++--++++
-------------9---------+-----+---------------+--
----++--++++------+++---++-++-+++++---+++-++---+
++++---+++++---+++-+++++-+++-----+-+++++-++++-++
--+++------++--+-+++---+--++--++-+++---+-+++---+
---------------+-------------+-------------+-+--
-+---++--+---+--++++++--++++----++--+-++------++
++-++---+-++++-----++---+-++--+-+---+-----+--++-
----++--+--++-++------+++-++--++--+-+-++-+++--++
---------------+-----+---------------+----------
-+----+---+------+-+++++---+---+---+---++++-----
+------+++-+++-+++++--++--+++-----+-+-++-+-+-+++
-+++++----+----+-++++-++---+---+-+++---+++--+--+
-------+-----7-------+-------------+-+-----+-+--
-++--+---++++++--+-----+-++++--++-+----+-+--+-++
--+-++----++---+--+++---+---+-----++--+---+----+
--+-+-+-++--+++++--+---++--+--++-+++--+++-+---++

Generation = 190, Population = 596.
--+-+--+-++++++-++--+++----+--+-+---+---+-++++++
--+----++--+---+-++--+---++-+-+++---+++---+--+--
+----+--+-+++-+-++++++++++-++++--------++++-++++
+--++++---+----+++--+---++++-+--+--++-++-+-++--+
-+-+-++-++++--++----+++++---+++----+-+++-++-+--+
++-++++---+++-++-+-+-++---+--+--++---+-+--+--++-
++--+-+-+++---+-+-+---+---+--+-+++-++--+---+----
-+-+---+-+----+--+---+-++++-+++-+-+++++-+---+---
+---++-+++--+--++-+--+-+---+--+---+--+-+-++-++++
+---++-++-----++++--+-+--++--+-++--++-+------+-+
--+++-+-+++++++--+-+++++---+--+--+++-++-++++-+--
++---+-+--+-++-++--++++-+++--+-++-++-+-----+++--
-+--+-+-+----+++++--+++++-++++++-++---+++--++-+-
--+-+-+--++++-+-++---++--+--+-+---+--+++++++-++-
--+--++--+--+++----+--++--+-+-----+----+++------
-++--+++-+-++-----++-++--+-++-+++-+---+---+++--+
+++++-+-+++--+--+---+++-+++--+---+++++-++++++---
+-+-++------+-++--+-----+-++--+--+--+++++--+----
-+++---+-++--+++----+--+--+-----++-----+-+-+++--
-+++++---+++-++--+++++--+-+++++-----+-+++--+++-+
+-----+++-+-+--++++-------+-+++-++-++-++-+++++++
-+--+-+--+----++-+-+-+++++---+-++++----+--++--+-
---+--++--+---+-+++++---------+++--+--+--+++++--
-+-+-++++++-+-++++++-++----++---++++-+++---++--+
++--+--++-+-+-+-+--++++----------++++++-+--+--+-

*** Life<FredkinCell> 23x34 ***

Generation = 0, Population = 5.
----------------------------------
----------------------------------
----------------------------------
----------------------------------
----------------------------------
----------------------------------
----------------------------------
----------------------------------
----------------------------------
-------------------------------0--
---------------------------------0
----------------------------------
--------------------------------0-
---------------0------------------
----------------------------------
----------------------------------
----------------------------------
----------------------------------
----------------------------------
----------------------------------
----------------------------------
----------------------------------
--------------------------------0-

Generation = 50, Population = 154.
2---3-----------3---2-----------+-
-------------------1---0-----5---+
35-2--0-------0--1-2--1-------2--3
-----1---------1------------------
-2-2-1---------1-3-4-2---------+-8
---2---1-----0---3-5---3-----6---+
-2-11-1-------0-12-56-0-------1-++
-----0---3-----0---------------0--
----1-1----4-30-23-41-0-------1-6-
-------2---3-------2---7----------
4---4----722-71--4-5-7----------4-
-----2---1-----------3------------
--------4--7-20-25-5--0-----------
---2---2--------------------------
----------0---0-1---1-------------
-----2---------------1---------2--
1---3-----------3---3-----------5-
-------------------1---1-----3---4
23-2--1-------0--4-3--1-------2--+
-----2---------1------------------
21-211----0---01-3-4-5---------+68
---3---1-----1---2-2---3-----6---+
-2-1----0-0------1-21-1----------6

Generation = 100, Population = 147.
56-59---------------------6+-6+-++
---------2---7-----------8--------
--2-----2-------------6-----9-----
----------------------------------
93--6+-8---------------+-+2--++-++
-5---------6---------+-------7----
-447---247------------8-----+-----
----------------------------------
-33+--7-6-4-----------+---5+768-++
-----4-9-7-----------7---8-9------
9+-57--+---+-+------------3---5-+-
----------------------------------
------9-6-5---6-----------3---6-2-
-----3---5---3---0-7---6-+-----7--
67-55--1-4----------------4---5-+-
----------------------------------
36-+4-1---6----------------+-8---+
---------0---5-5-----7---+-+------
--3---2-6-1-----------4---3-+-+-+-
----------------------------------
57--1749--2------------9-+---+---+
-0---9---------------+---+---+----
-5-8--5-6-4---5-----------7+-++-++

Generation = 150, Population = 270.
------------5-+3--98-89--++---+5+-
-1-----------+-----+-+---+-+-+-+--
----------5--+-+--2---+--+4+-+-+-+
---5---4-2-------5-+-------+-+---8
-----+-+---+-++---2---+---7--++--+
-------8-+-9-5-+-+-------------+-+
---+8+-79++-9+-++-6---+-++7-+---+-
-----3-2-9-3-4-5-8-7-----4-+------
-+7+-+-+-+-+9-+9-+-----+--8+-9+-++
---+-9-+-+-+-+-9-+-+-+-+-+-+-+-+-+
++-+-+-+-+-+-++-++6+-++--+4+-++-++
-----4-4-+---7-5-----------------+
++-+-+-+-+-+------3------+5+-+-+--
-------9---7-------+-+-+-+-+-+----
+--+-+-6-+--5-8-8+6+-+5+--9+-+9+--
-------4-2-5---3---8-------6-+-4--
--4-54-85-+-7--78+-----97++-++--++
-----5-------------+---+-----+-+-+
--+----------+++---------94+-+++-+
---1---4---------1-9-+-----+-+----
+-7-------7+-+--9+-+-+-+--6----++-
-6---+---+-----+-9-+-+---+-+-----+
------------95--+68----+--++-+----

Generation = 200, Population = 140.
----------------------------------
-+-+---+---+-----+-+---+-+---+-+-+
------------+--+++3--++++-----+-++
----------------------------------
-------------+++--7+++--++-+-+--++
-+-+-------+---+-----------------+
------------+---+-9---+-+-----+-+-
----------------------------------
------------+---+-+---+-+-----+-+-
-----+-----+-----+---+-+---+-+---+
-------+-+---------+-+-+-+-----+-+
----------------------------------
------+---+-------8-------7---+---
-+---+---+---+---+-------+-+-+----
--------------+---+-+---+-------+-
----------------------------------
--------------9---8-+---+-------+-
-+-+---+---+-----+-+---+-+---+-+-+
------------+--+++6--++++-----+-++
----------------------------------
-------------+++--++++--++-+-+--++
-+-+-------+---+-----------------+
------+---8-------+-------+---+---

*** Life<FredkinCell> 27x7 ***

Generation = 0, Population = 10.
-------
-------
-------
-------
-------
-------
-------
------0
-------
-------
--0----
-------
-------
-------
-----0-
-------
0------
-0-----
-------
-----0-
-------
------0
-----0-
0------
------0
-------
-------

Generation = 26, Population = 90.
--3046-
----014
3---353
-4-0--3
2-2--50
1--1-2-
--413-3
2-6---5
--1--55
2--03-6
1-0----
-------
----17-
0--02-2
2--0-34
623---5
3-30499
3------
6-3-346
-------
5-4-186
2-----6
5-11488
946-2--
7-81-94
1--24--
2----7-

Generation = 52, Population = 63.
-69-++-
-----4+
-----++
49---9+
+----9-
--8-6--
--+----
-------
--5----
-9---+-
-----8+
49---+-
8----+-
-73-3-+
-3--+8-
--+-5--
-75-5+-
-77-9-6
------+
37---8-
+----++
-----5-
-+---+-
-----7-
----+--
-45-748
5----+-

*** Life<FredkinCell> 42x47 ***

Generation = 0, Population = 18.
--------------------------------------0--------
-----0-----------------------------------------
-----------------------------------------------
-------------------0---------------------------
------------------0----------------------------
------0---------------------0------------------
--------0----------------------0---------------
-----------------------------------------------
-----------------------------------------------
---------------------------------0-------------
-----------------------------------------------
-------------------------0---------------------
-----------------------------------------------
-----------------------------------------------
-----------------------------------------------
-----------------------------------------------
-----0-----------------------------------------
-------------------------------------0---------
---------------------------------------------0-
-----------------------------------------------
-----------------------------------------------
-----------------------------------------------
-----------------------------------------------
-----------------------------------------------
-----------------------------------------------
-----------------------------------------------
-----------------------------------------------
-----------------------------------------------
-----------------------------------------------
-----------------------------------------------
-----------------------------------------------
-----------------------------------------------
-----------------------------------------------
-----------------------------------------------
-----------------------------------------------
-----------------------------------0-----------
-----------------------------------------------
--0------------------------------------------0-
--------------------------------------0--------
-------------------------0---------------------
-----------------------------------------------
-----------------------------------------------

Generation = 26, Population = 654.
-4631-----100-0-201---4-1-0-33-6-2---1---1--3--
---22-8-73----21-0-22---3113--34-3-------222--2
50----6-3-1--3200---3---2-1---23---03-----41-00
12--23522--21-1021-13-25---15204---11--0--1113-
2----5335---1-2-2-5---216---1---2-2--11--2-11--
5--6--6--3--3-4-83----4--8--0---373---3-35--3--
--704--0--3-1-5---4-7-53145---1---4-3--2-----3-
----2----3------2----1--------0------2---20----
--31-3-1--21----0-13031-320--0--12--51---10--2-
512----2---01---2022--22-5-------32---2------5-
3-2--6--12--0---2-1--1422--11-----11--340--1---
3-22--4-12--3-13-1-32112---142-4-6-12------133-
1---2-1-4-1----10---1---1-0--00201--1-0------00
22----5-4-----12-1-00---2-21--32-4-1------01-40
-13-1-6---1-------2---2---0-1-25333-1---0---1--
--1-----0---01---4----01---1-1---3----------00-
---0----2-01---0--63-2--03-2000-21---20--2--0--
---01---31-1---0----------32--32---------4-1---
-1------1-1--0--02-01-----10-402---3-------2--0
11--0120-110-10-----11-1-4-121------01-0---0-0-
1-------4---0---0-0--1-023--0-0------3-0-1----0
2-03--3221-1----1001--01-2-0-----012--1--0---1-
3-3--1---12---1---0------30-0---0----32--1--0-0
----------1---00---001---------0----0----1-0---
0--0-------0----0--0---------10--2--0--10----10
--00---0-----------0-------0-----1---0-0---0-3-
-----2---0--------0--1-----0-------0--0----1---
--0--01-----0--0-000-0---0--11-2-4-------2-----
--------1-------0---0-0------101-1----0-0----50
0---0---10----0012-10----001--01-0-0-0---------
-0----1---1--0----1-0---0---10--10--0-0-0-0-4-0
-------00--1-----12----0----0----0-0---0---0---
---0----0--0---0------0-------00-----10-11----1
----0----110-------------0---0-------1---4---3-
-0-----------0---------------------1-------2---
----0-----1--0------01-0-00--------------2-0---
--------------0-------2-------0-0----10-11----0
-0----102--------1-3--1021-100---------0---1---
-----2------1---1---3---1---0-0-0-0-0-0-0-1-1-1
1--1-----2----512----1----00---0---0-------1---
---0---0------0-------0-------0-0-----0-0-----0
-00---------1-----11-0-------0---0-----0-0-0-1-

Generation = 52, Population = 547.
-68------3---0---35--0----3--7---5--6----51-44-
--------7----3---53--+6--5-----8-8-6-6-5-3--5--
-----99--4---5-0-4---3--+4-----------5+--3---3-
-4-----9-------3-----6-8-9---4-7-5-------------
3----+6-7----------------3----3------44--------
-5--4-+--+--5-8--++--8+-7-6-5-----95-7+-9-----6
--+-------4585---4-5+-----+-7-------7--------7-
---3-----8-3-4-------6---7---4-----------5---8-
--4-6-------3-----4-------4--3---4--+-----2-+--
-49--+--763--+----4-4-8-9+--8-9-3-5--85---6-3--
--------55----126----27---------------9-7-----2
-----4-7-5--68----1----6-7---5-+-9---8---8---7-
------8-56-----------55-71---2---4---5--8------
-8----8--+---+-----2----8---35---+5--53----6---
--4--2----2-48---4--8----82-4+---86-6-----1--7-
---2----5-----2-4-----2--3-4-9---4-------------
--2-------6-16---6+-3----8--29---+4-------4-5--
-4---+6------5-1-+-----44----8---+----26-8---6-
--------96-----------+---7---6---9---+---9---6-
------------32----2------+---4-----------5---4-
-2------7-----122----76---------------7-3-----3
-26--6--977-3----2-5455-----34---76--+---3120--
----6-----2-4-----5-3-----6-35---6--3-----1-38-
-1---3-----1-------2-6---8-2-5-------------4---
--5--5----200-----401-------1---------------27-
-4--5-5-51--40--6-5-----4-4------+---15-2-----0
4----56-----------------------25------2--------
-21--454-4---5---3---+---7-----8-+4----5-7---8-
-----43--------2--2---4-22-----------2--14---8-
---5----5---00---3-2--4--4-6-----2-7-6------1--
-0--2----23-35---25-4-----4225---7-31-----2-88-
0-1---4--32--3---9-0----------1--4---51----0-7-
-20-----------2---4---2---1--6---34-3-3--4--17-
-3-----23----5-0-22---2----------+-----3-9--2--
-----3--18---5-0-4---3---3---2-2-5---7---+---6-
-32--663-----3-3-----4-3-8---7-5--7--4---6-----
0-----1-5----2---22---6-------15--2--58-2-1----
---052+-----6-4--52--+4---259----1-3-3--35---03
--2-------21-3---2227-----2-54---51-3-----4-41-
-3-2--5------7---2---4---0--2------4-3-----5---
--1-3---13--1--------0-----2---3--41--4--------
--3-----343----5--4--2014----1--1----2------1--

Generation = 78, Population = 965.
--+-5++395+455-6------+5-5-9-+----+-9++5+-7-+--
-893---7-7-54-7----4---6++---7----7+-----6-+8-+
7--69-+4-932-+7--82-97--+--4----5--68+---++---6
6+-47+-+-+36367-8+-8-+6+-+7----+6+-74+-+-++86+-
475--+--+78385-+-8+-5-+---48-57---838--8--865-3
+-8---+4++8++9+-+++87+-++--8+-+6-++--++-+-++-5-
7--8---259++9+--+--8+-+-+8---+-69+-+-8--+8---+7
7-+79-+-7+58--7-8--+5+----2-876-+--+5+5-----4--
-----+-4-282---5--8--++5---6-------+++-4---6---
+9+---+-+---4-----7-4-+--++-+-+-+-++5--5---+-++
8----+-8-+5--+---+--54-7-9------3-5--+-6-9----3
+---9-----58-----85-96679--7++6-6+85-+5--+-6-+4
4-61-+-9+-64---5--9----2-6----5-4-3----+-6----4
-+8---+----7-+-66+--5+74++8+68+-6+--5--3+---3+-
668359+--8--++--3----------36-++9---+------3+9-
---59---+++---7---67--59++-64-4--63--+2----7-+-
3852--95---6---6-------9--8-6-8--++---+9--93-7-
-----+++--+--+-23-3-793--+9--+-62+--3----+-9---
4-1-2+--+---46--79----5--+884---2-586+--+------
---5-+-76+7487-3324--9-76+-5-+----7----9-7-----
764-2-+--------4--465----+-5--4-483838+----3---
-5---+-8+++463-3-5---+---9-2-----+-----3---2---
7-+3+-+----------7+-6741--9--+38587+5-+412--4+-
--+8--+4-3+5--625+3--+-3----+--4--3+-+52-8---3-
+-+-3-9-6-------9--648676----9-73+5-+6++41-5--6
9-------+93-758---8-+8-8--96-6+-3+-8---86--9---
8-026-+-+-7---5---63-6--+8-4---+--5136635853-82
+6------56733---8+946-+-8+-2753+5--5-+-8-+2----
74--46+-+-5-----62-----2+804-6-9-369797+7763-+-
--38-++5+-551-+3+74-5-8-578+5875--9--+-1-8-6---
--63---2+---5---------5244++6--86--8438240-4++3
---5-+7447532--22-+-4-343--++6--29-96--2-727-+-
------5--28---6-47--548--87-2+---8+--+88-7733--
-8--5++86-6--833--3-475--++-+-++-+-6-+3-4+-9++-
--423---2--15-400-1-4--24--2--29---35+-66+6----
--8-7++-7+--46--36--2--86-73+-59-7-8-+342+52--3
3+7-374---+-442-64----9--1---9--94-3-++69------
47967-+2--+--664--7-5-+-+-+-+---+8-53+--7+283-8
--75+-+5+-4-7-52---3-------0---6-785-7---------
-+5549--7--+---42---1--27-4+-79----8--73--1--62
----5+6---6-2----2-----------3-6-3-65----------
---2--6------4-+-66-4-2--9-5+8-6---4-3--3-1-1--

Generation = 104, Population = 462.
7----++-------7-9-----+-+------++-------+----+-
-+---+-------+---+-+----+---+--------+9--------
+----+---+--9---+-+--+-+-------------+++----+--
+--7-++------9+--+--8----+--++---+-+6+-----+---
----9---+-+------+--7-----4--+-+-9--9-----+----
---+-+---+-+----+--+9+---+----+-+---+----+----+
++---+-------+--+-+---++-+-----9-----++7+------
------+----------+------+---+----+6---9------+-
--------+---+------------+----2+---------2--+-5
-+-5-+---+-9-+-------+---+-+-+-----+-+-----+-+-
--------7---------------------49--------------6
---+-++--+-9---------+---+-8++---+-+-+-----+-+-
-----++--+--+-----+--+--+----------------+--+--
-+-5---------+---+------++-+++---+-7--+------+-
++---+----+--+--6+----++--+--+-+-+----+5+----+-
+----+--------+-+---2-----9---8-+---9+---+5---7
----8-+-+-----7--+--+-+++----+--++--+-++9-+----
-++--++------+----------+--+-----+-+-++----+-+-
---------+--------+--+---+------------+--------
---6-------7-+-----9----++-7-+----+---+--+-+-+-
+------------59-72----+--------++-----+-9------
---+-----+-------+-+-+---+-6-----+-------8-----
+----+--------6-8-+---6--+-----+9----+--2------
------+------+---+------+---++---++---9------+-
--------+---3------------+----8+-----8+-----9-+
+---++---+6+--+-+--+-+---+----+-4----7-----+--6
-6--------8--+------------7------------------+-
---+-------3----+--9------7--97-++-------++--+8
-----++-----9-+---+----8++------7-----++-+--8--
------+----------+------++-------+----8--------
6-------+-----5-4-----8--9----6-+----7--8-----5
---------+-----------7-------------+-----------
2-----+-+----++-9+----+-+-----+-6-------+-----+
-+7--++----7-+----------6+---+-----+-+9----+---
---------+--------8--7---+-----------+---+-----
---+-+-----9-+-----+----9+-------++---5--------
-+--8-----+---------5-+---+--+5+-+--8-+-+-3---9
7--------+----8-+----+--------+-+--+-+---+----9
--------+--------8----+--3---+7--+---+8-8----44
-+----+------+----------+--+-----8----+----+---
------+--+--5-----9--8--4------------+------+--
-+-7-----+-9-6---9-+-4-----7-+---+-------7-5-7-

Generation = 130, Population = 219.
----+-+-+-------------+-+-+-----------+--------
--+--------+-------------+---------+---+---+-7-
------+-----+-----------+-----------+-+-+---+--
+---+----+---+---------++--+------++-++--+-+---
----------+---+-------+--------+----+-+---+---9
--+--------+----------+--++-----++-+-+--+----+-
------------+-------+---+----+---+--------+-+--
-+----------------------+----+---+++-++------+-
----------------------+--------+--------+------
---6-+---------------------+---+---+-+---------
-----------------------------------------------
-+-+---+---------------------+-----+---+-------
-----------------------------------------------
-----+-------------------------------+---------
-------------------------+-----------+---------
-----+-------------------+---------------------
-------------+---+-----+---+-------+---+-------
---+---+---------------+---+-------------------
-----------+-------8-----+-----------+---------
-----+-------------------+---------------------
-------------+---6---------------------------+-
-------------------------------------+---------
-----+-------------------------------------5-+-
-----------------------------------+-+-+-------
---+-+-+-----------------------------------+-+-
-----------------------------------+-+-+-------
---+-+-5-------------------------------------+-
-------------------------+-----------+---------
-----+-----------------------------------------
-----------------------7-+-+-----+-------------
-----------------------------------------------
-----------------------9-+-+---+-+-+-----------
--------+----------------------+---------------
---+--+------------------+-++--+-+-+-----------
------+-+-+-------9----------9-+-+-------------
-+--+++-+----+---+-+-----++--++--++------------
--------+-+-----+-+-9---+----+-+-+-------------
---++-+-+--9-----+---+-----++---+---8+---------
----+-----------+-+-+-+---+----+------+--------
-----++------+-----+-+------------++---8-------
------+-----------+-----+-----------9---+------
---+-+-+-----------+-----------------+---------

Generation = 156, Population = 953.
-+--+-----+++----+-++-----++-+---+-+-+---+--++-
+---9---++8++--++--+++-++--++--+-+--++--+---+-+
------+++-+--+-7-----+-+----+--+-+----+-++---+-
-+---------+-+-------+-++----++--+-+-+-+-+---+-
++---++-+-+---++------++-+--++++-+----++-+---++
--+-+-+++++-++++++-+++-+++-+-+---+-+----+++-+--
-+++----++-+--+--+-++----+++---++++-++----+--+-
-+-+--+9-+-+-+-2-+-++-----8-++-9---+-+-8-------
-+--+---+++-+-+--+++9+---+++-+-++--+-+-----+++-
+----++-+-+++-+-+-+-++-++--++--+--+----+-----++
++--7++++---++-8+----+-+---+---++--9+++-++---++
--+------+++-+--++----+-++---+-+++-+-+-----+-+-
----++--+---+-+--++---++++-+---+-+-++--+++---+-
--+-++----+-+++-+-+-+++-+--++-++++-+--+-+--+-+-
+++--+--++++--+-++-+---+--+++--+---++--++-+--+-
++-+-++----+8++---++9----+-+++------++-+-----+-
+-------+-------+-+--+++-+-+++-+---+++++++---+-
++----+-+--+--+-9-9++++-+---++-++-++---+-++-9-8
-++-++--+++-+++++--9+-++-+-+--7+7--+---+---9+--
--+-+++-+++9--+-7+++-+--+-------+++--+--3------
--+-++------9-----++++----++-+---+++-----+48++-
-+++++++--+-++---++-++-++++9-------+++++--7-+--
+++-++---+-----6++-+++-++-++-+----++---+--+6-++
+-++++++++-+7+9--+-+++++---++-+-----9+++-+--8+-
++----+-++----+9+++--+++++-+9--+-+-+++++-----+-
+-++-++++-+--++-+-+--+++---+-+++------+----++-+
-+---++---++--+----75+-+++--4-++++-----5-++--++
-+++++--+++-+-+-+++-----++-+---++-+-----+-++--+
-++-++-----++++---++++-++--+++-+---+---+-+--+--
+-+-+-+---++++---+++-++---++---+-+++7+--9-7--++
++--++++----+-+8--+-----+--+-+--+--+++-6-+---+-
+--+-++-+-+-+++-++++++---+--++-+---++-+--++++-2
++-----++++----+++-+++-+++-+---++--++---+--+-++
+-+++-+-++----+-------++-++---++++-++-++9-7+++-
++-8+----+++----+-+--++-----9-9+-+-+++--++++--+
-++++-++-++-++++++--+-++++------++-+--+-8-++8++
---+++-----+++-+++++++-+++-++--++------++-6-++-
+++-++-++-++-----++-------+++++-+++++++-++-++-+
--+--+-++-----+-----+----9------9++--+-+--+---9
++++--++++++-+--+-9+++---++-++-----++++-8-+-7-+
-------9+++79+++59-9++-+++-+-+-+---+++--++--+-8
+-+-++++----+-++-+---+7-+----++++++-+--7+++-++2

Generation = 182, Population = 957.
+---+--++---+++++++-+-+++++-+++--++-+++-+----++
++--++-----+--++-+++------++---+-+++----++----+
--+-+--++--+--+-+--++-+++++-+++--++-+-----+++++
-+++---+-+--++++-----+--+------+++---+++--+-+++
--+--+---++----------+--+++-++-+-+-+--++++++--+
+-+--++++--++++----+---+-++------+++---++---+-+
-+++-+------++++-+--+----++---+---++--++----+++
---+-+--+--+----++-+---+-----+---+-+++-+--+--++
-----++-+++8+-+---++--+-++-++-----++--++--+-+++
+++--+---+++++-+-+-+--++--++-----+---++--+-----
+---+-+-++++++--++--+--++--+--+++--+--+++++++--
++++--+-++-+----+--+--++-+-+-+-+-+--++-+5++++++
+---++-++--+------+--+++-+-+---+---++--+--++-++
-+-++--+-+++++-+-+-+++---+-+------+-----+-+++--
-+-++-++---+-+-+-+++++--------+++-++-++--++--++
+--+-+++--+++++-++++---++----+-++------+-++----
+--9+--+-++-+-+++-+-+++-+++++--++---+-++++-++++
-++--+---++-+++8+-+---+----+---+-+-+++-+-----+-
-+-+-++++-----+-+---+-+++-++++9+-+++++-+-+--+-+
+++--+-+----+--+-+++++++----+-+-+-+-+-+----++--
-+++-+-+-+----+++------+--+-+-+-------++-+8--++
+++-++++-+---++-+-+--+-++++-+++++++-+-+++-+--+-
++-+--++--++++---++---++-++++---+-+++-----+-+--
--++-+++++-+----+--+-+-++---+----++++-+--+++--+
+++--+-+---+---+--+++++---++--+++-+----+-++----
-+--+-++--++----+-+--+--+-++--------+---+-+++-+
+--+++-++++++--++-++-+-+++++6+--++++-++9++++--+
++--++++-+++----+-+++---++-++++---+-----++--+-+
--+++++++-+-++++++---++----+++-+++----++++++-+-
+---++++++-++-+--+-+-+++----++++-+-+-+-++-9-+++
+-+-+++---+-----+-+++---++--+---+---+-+-+--+-++
-----+-++-+-+-++-++----+++++-+--+-++---+-+-+++6
--------+---+-----+--+---++-++-++++--++-+++--++
-+---+----++++++-+------+-++----++++----++-+-+6
--+-+----+---++9+++--+--------++--+-++--+-++-++
+-++----+---++++---++--++-+++--++-+---------+-+
9---+-+-+----+---+--+-+---+---++--+++-++++-+--+
++--+++----++-+--+------++-++++--++---+-+---+-+
+++--++++-++---++--++--+++---+--++--+--++---+++
-++++-++--++-+--++--+++-+-++--++++++--+-++---++
+-------++-----+--+-++---++--++-++--++++-++--+-
---++-+--+-+--------+--++++--+-+-+-----9-+++---

Generation = 208, Population = 371.
------+-+---+-----------++---+---+---++-----+--
--++-++----+-------+-------++------+-+-----+-+-
--------++---+---+---++--------+--------+------
-+-+-----+--+-----+----------------+-----+-----
--+---+---------------+-+---------+-----+------
-+------+---------++--+--+-----------+-----++--
-------------+-+-+--------------------+--------
---+-+---+-----------------+-------------+-+---
------+------+---++---+-++-----+-----++-+------
---+-++----+-------+----+--++-----+---+----+-+-
-----++-+---------+-----+------+------+--------
---+--+--+-+-+---+------++-+-------+--+--+-+-+-
-----+--+----+-+-+----+-----------------+----+-
--------+---+---------+--+-------+-+--------+--
--+---+-----------------+---------+----------+-
---+-+-------------+-----+-------+-+-+-----+---
------+--+-----------+--+--------------------+-
-+-------+--+-----+--------------+-------+-----
-----++------+---+----+-+----+-+-+------+----+-
--++-----+-+-+---+------++-++---------+--+-+---
------+-----------------++-----+-----+---------
---+-----+-+---------+-----+---------+-----+---
-----++-----+---------+-++---+-+-+---+--+---++-
-----------+---------+---+-+-------+-+---+-+---
--+---+--+---+---+---+--+----+---++----------+-
-+---+--++--+--------++------+---+----------+--
------+--+-----+-----++-+---------------+------
-+---+------+-----+------+---------------------
------+-+----+---+------+------+-------------+-
---+--+--+-+-----+-+-------++------+-+---+---+-
-----++-+---+-----+---+-++-----------+--+---++-
--+---+----+-----+-+--------+------+-+-----+---
-----++-----------+---+-++-----+-----++-+------
---+-+-----+-----+-+----+--+------+--++----+---
------+------+-+-+----+-+------+--------+------
-+------+---+------+--+--+---+-------------++--
--+------+-----+-----+------------+------------
---+----+---------+--++--+---+-----+-+---+--+--
--+---+------+---+----+-+----+---++---+-+------
---+---------------+-+---+-------+---+---+-----
------+-+----+---++-----++-----------++--------
--++-+---+-+-+---+-+-+--+--++------+--+----+---

*** Life<FredkinCell> 25x36 ***

Generation = 0, Population = 11.
----0-------------------------------
------------------------------------
------------------------------------
------------------------------------
------------------------------------
------------------------------------
------------------------------------
------------------------------------
------------------0-----------------
--------------------0------------0--
----0-------------------------------
--0---------------0-----------------
------------------------------------
------------------------------------
------------------------------------
------------------------------------
------------------------------------
------------------------------------
------------------------------------
---------0--------------------------
----------------------------0-------
-------------0----------------------
------------------------------------
---------------0--------------------
------------------------------------

Generation = 43, Population = 418.
-0---0-020-0-------0-030----20----4-
--3-5--1-2--3-0---6--452---3-1---123
-0-0----30-0--30-0--+08-305-5-2-1-8-
8-3-9---3---6568--43-627---0411-14--
-0--4-------303----07-3-50--4-1-005-
--3242--2--2-53---1-41-504---5---4-3
-0--+-0--0--+-----60-020205----0--2-
7----4-2------4--5-3--12-31572----3-
8090+-20---0-03050--+0-06--080---0-0
--+-55--6---7+9-----95--2-3-3-------
--70--6----0+0+-6---20--70-0+0------
93-6--97--35++--5365--6695-6-75---7-
6--0--1--0--4030-0---0301-+-6--0-0--
---053-------514-5-4-6-3-2413-5-----
30---0-0--1--010309--07---1--0-----0
6+-1+1--0147---4-+4-------2-2-------
2060----0030---03030-030--3-3--0-030
214--1-1-2----2-124546-101--420--4-2
---0504-10--5020--7---3--0-040200020
-785-6-1---4---+4---1---142312--26--
-0--3-40--40-----0-0-0---03-1--00-2-
65---3--012----12---0-2-1--33-20-1-1
508--0-0--0--04-1------------01---1-
75-5-7--1-00-0-3-45-5---5-16220-----
5--070-0-0--40-010-0-0-0----10------

Generation = 86, Population = 323.
3---+-4-----9-9-5-------------7-----
67--+--7-9-+-+--7+----9-8--+++-----7
----+---9-+---+---+---+-+---+-+-7-+-
+7+-+-+--++-++-+--8+-+7-+----+---7-3
------+-+-------3---+-+-7-6-+-+-----
+--8-8+7--9-+---+-8--98-387+-+-7-+-+
--+-------+-------------8-+---9-----
--+6+9+8---+9--5+++--75-9-7--+-9-99-
+-+-+-+-------+-----+-------+---5-+-
--+-++--++--+--+---+-+-78+7-5---9---
--+---+-+-9-+-----+---+-+---+-----+-
+++-++-+-7---++-+-+-++++--+++-------
------9-8-------+-+-+---4---+-+---9-
-8+7+7---7+-++7--+-+7-+++-7-5+-----5
--+-8-----8-+---+-+-+---+-7-+-6-----
----+-7-9+-----+----+++--56--+---6-1
+-+-+-6-5---+-----9-7-+---+-8-5-2-6-
---4-+77-4--9-77-58--+--6-72++-6--54
--+-+-----4-+---------------9-8---8-
---++-+3-9++-----+---8-+597---5-8--7
+---8---5---------+-8-+---+---2-3-9-
----+--+----5-74--+--+-+6--+--622-8-
+-+-+-----5-+-+-6-----9---+-+-9-----
---+-+---7-+-++--+-+9-7-++-++---6-65
+-----+---2---+-6-----------6-------

*** Life<FredkinCell> 30x5 ***

Generation = 0, Population = 21.
-----
-0---
-----
----0
-----
0----
-----
--0--
---0-
-----
---00
----0
--0-0
---0-
-----
-000-
-----
---00
-0---
-0---
-----
--0--
----0
-----
-----
-----
-----
-----
-0---
-----

Generation = 34, Population = 70.
---6-
5-66-
-7-4-
-+---
-4--+
8-+-+
--55-
-7--+
6--8-
+7--8
----8
-+--7
-6---
8-7+-
-5---
9--+-
27-6-
+87+-
38+97
--5+7
586-7
+5+-+
-6+--
----8
7-+8-
-73--
-8---
6556-
---8-
---36

*** Life<FredkinCell> 27x29 ***

Generation = 0, Population = 18.
-----------------------------
-----------------------------
----------------------0------
---0-----------------0-------
-----------------------------
-----------------------------
------0----------------------
----------0------------------
-------0----------0----------
-----------------------------
-----------------------------
--0--------------------------
-----------0-----------------
-----------------------------
-----------------------------
-----------------------------
------------------------0----
-----------------------------
-----------------------------
-----------0-----------------
------00---------------------
-----------------------------
-----------------------------
-----------------------------
---------------0------0------
------------0---------------0
----------------0------------

Generation = 31, Population = 357.
--4----85-321247-1----23--2-2
-1-1--320-2-------3--0-121---
5-2-8287--9--221---13-4--0---
-4-6---6256724-0---122---53--
--6------264--642-2-22-12-6--
-------1--3---42---1---16161-
--6---3-6-+-32-------28-5-22-
-2-5-7-1--4-45-----1-1-020--2
7-9---9--47---7-8-2-446241---
-0-------0-3--------01--0-8-3
------7-925-6-8-3-80----72---
-4---+83642-------69-1-4-6--2
2---33+-44--6-4-88-------5144
---543-3---2---444---4-12----
0-642-7--21----49-5-1--45-414
--43-4-1533---7--33---1-0-3-5
31--6-+9-228-4---4-132-74-634
506--15-0-11----3080-447-----
-244-3-6-4--54-+56--3-----133
--92-53-3--325-73-----58-61-3
--64--5+--352--7---38-76-3-14
-0--4--2-153--53--2---330212-
1----4-4-26--15-84--30-5-3---
------------53-16171142462-1-
6----4-7-3-48-5++2--25-4----9
-0----6-4----15-6-----91-0---
1------3---3-3844-3-4-5---4-4

Generation = 62, Population = 397.
6-+-98++---+--+--7-++388-3+--
--745----5--9-7-62-65-6-9-+6-
+-+9+-++9--++7697--9-4-+--+63
9+4-7+++--6+7--678-689---+4-+
739-74+++---4-7876--+56-54+--
----966--77---+55--46----3---
+-+9+5+--5----+--+-++9++-----
73-8-9-3--+-+9+3-4-17-85-4+7+
+--97--+--+9--+---9--6-+--+--
+3+-+7-9+--9-5+5--4---+5-5+5-
-58-44--+8-+-5---3-------5--5
68-+6------+-++----+76+--++--
--88---8-9-+-69---++-9+----7+
6-+-7--8+1-7+-+-85-72--4-47-9
5-+--4+++7-+5------+-7-++-+--
97-+-+-3----+-76+6--44-34--2-
-----6-++6-------79--6-++5+8-
-0--8---4--4-7+5---328---2--9
+-++----+-+-+---+-4+---+---5-
+9+--+-+-+8+6-9--9++4-++3-5--
-6+-+-++-9--+-------+9-++8+4-
-2---2-7--7----8-5+-44----8--
--+6-7++-8+++-+------2-++-+-+
549-----+-9+9++5+--1------5--
+-998-++-+8++6+++--+6-----9+-
-063+1+18093----+0--6---+-+-+
-5++-8---5--9-+++-9+--+9+7---

Generation = 93, Population = 372.
99+--+-+-9-+-4-++-+---+-+6+4+
+7+--++-6-+++--8+----3+--1-+-
+6-+-----+++-+++--+-+7+--5---
---+++-+------9+--5++-79++-+-
-8+-+-+-+---+++----++---+-+-7
95-++--+--+--++-7--58--5-----
+5---9----+++7--++++------+-+
+--9--++-3----+---+5-9+9+5-+-
+5+++----9---5+-+-+--8-++6+-+
---+--6-+---+++9--+6-4--77+--
+6+++7-+++++---------6+-+--7-
--+-+--+++--+-----++---+9+--+
-+---8-----+-+-+++--+-++-9+++
+3+---6-+4--------++-+98-6---
--+-+-+++-+-+----6---+--+6+--
+-----+-+8+--7-9+--8-7++-5---
-3--+-+---+-+---+-----++---+-
+0-----+7-27-++-+5+-4--+----+
+9+-++-+-9--+-+++--+-6--+6--+
+-++--+++++----+-++++--+4-++-
-+-+-9----+----+-+++----++-++
----+4+++--8+-+-+---6-+--3+9-
---+-++++-+++--+-+---7-++8---
------+--7-++++8+-+3+--+----+
-8--+++---+-+-+-+++-+-+-++--+
--+6--+5-0----+3--+1+4+4+---+
----++++-8+---+++-+-+---+8-+-

*** Life<FredkinCell> 3x18 ***

Generation = 0, Population = 19.
---0--00-00-0--0-0
--0-0-0--------000
-00---0---0------0

Generation = 29, Population = 27.
5-9778+9--+----9--
--7-5+87----5-9--4
8+257+8-----54--4-

*** Life<FredkinCell> 28x5 ***

Generation = 0, Population = 7.
-----
-----
-----
-----
-----
--0--
-----
-----
-----
-0---
----0
0----
-----
0----
-----
-0---
-0---
-----
-----
-----
-----
-----
-----
-----
-----
-----
-----
-----

Generation = 21, Population = 64.
11-0-
15322
242-1
452--
2-30-
-----
2--0-
6-5-7
1--2-
364-1
-4-0-
-----
2----
-5-0-
--30-
-----
07---
-8-2-
-5--1
1-1--
01--1
-6-15
0--04
-3--2
0----
1-200
--3--
2-0-0

Generation = 42, Population = 75.
2452-
--8--
-59-3
+-6-3
967-8
-73--
--639
+-+2-
447-9
-+---
--+--
-9+--
-36-9
-+94+
--63-
7+-6-
-+---
-+5--
2---4
47--7
53---
-+458
28-1+
-+749
-+-47
4-4-5
-6---
97-2-

Generation = 63, Population = 79.
-6-5+
+--++
--+--
++--+
+--6-
+-+-+
+--7+
++-5-
++-5-
---+9
+++-+
-+-5+
-890+
+--6-
--+++
+++++
7-+6-
+---+
-++--
-++5+
--+-7
--68+
-----
-++6+
7+--+
+---+
7--4+
+++4-

Generation = 84, Population = 58.
9-+--
-+--+
----+
-++--
----+
-+---
+-+-+
--+-+
-+---
-++-+
-----
-+--+
+++--
----+
+-+-+
++--+
+++-+
++--+
-----
--+-+
----+
++8--
+++--
----+
+++-+
+++-+
-+---
+---+

Generation = 105, Population = 71.
-9++-
+++++
-++-+
++++-
+--9-
----+
--+-+
+++-+
-++--
-----
-+-++
+-+++
+-+6+
-+--+
----+
+++-+
+++-+
++++-
+-+--
-+-5+
--+--
---+-
-+++-
-+-7-
--++-
---7-
-++9+
-----

Generation = 126, Population = 68.
----+
+++-+
--+-+
++-+-
+-+-+
-+-++
-++-+
-----
---++
-+-++
-----
--+++
+-+++
+--+-
-+---
++++-
+-+-+
+-+-+
-----
++-7-
+-+-+
-+-++
-----
+++-+
+-+--
++--+
--+-+
++++-

Generation = 147, Population = 67.
--+-+
-+---
--+--
+++++
-+---
-+-++
++-+-
++-8-
-+++-
+++-+
---+-
--+--
--+-+
--+-+
++--+
+--+-
+++--
+----
--+-+
++--+
---+-
+-+-+
+-++-
+--7+
--+-+
++-9+
-+++-
+-+--

Generation = 168, Population = 55.
+++-+
++---
-+---
-----
-+--+
+-+--
-+---
+++--
-----
-+--+
+-+-+
++---
+-+--
-+--+
-+---
----+
-----
-++--
+++-+
+++-+
+++--
+-+--
----+
+----
+++-+
-++--
-+---
+-+-+

*** Life<FredkinCell> 19x45 ***

Generation = 0, Population = 10.
----------------------------0----------------
------------------0--------------------------
--------------------------0------------------
-----------------0---------------------------
--------------------------------0------------
---------------0-------------------------0---
---------------------------------------------
---------------------------------------------
----------------------------------0----------
---------------------------------------------
---------------------------------------------
-----------------------------------------0---
-------------------------------------------0-
---------------------------------------------
---------------------------------------------
---------------------------------------------
---------------------------------------------
---------------------------------------------
---------------------------------------------

Generation = 25, Population = 272.
---010----0----0-0---0---02----0----------2--
--2011---2-2--2-----0---1431--2-3-110-1122---
---000---00------0-0-----02-------310-1361-40
1---0-1-----------------0-11---1--21---2-----
-00--0-0-0-0------3------0510-2-1030-----1862
-0-0----0-1-0---1333--1-0-130--02423--0-0-040
--0--------0-0---02----0-----0----62---0-----
----------1---------------------0-0----------
--0----0-0---0-0--3----0-1---0-1--2------1---
-0-0--0-0---0-1-23-1--1-----0---042----30--30
-00----0---0---0-02--------0---3-0--0-3531221
0-0-----0----------2---00-------0---------04-
-0-------00------0-20-1-1-23------725-1-12-5-
---------0-0--0--34-1--024100-0-0-010--30-0--
----------0----0--20-0----2--0-1-----0-----1-
------------------3-------0-------------0-0--
-------0--0----0-02--0-0--01-0-------0-3-2---
------0-00-0--2-43-11-1--01-0--0--0-0------1-
-------0--0----0-010-------40-0220-1---0-00-0

Generation = 50, Population = 265.
-----------3---20---2-------------8-3-4-5--+-
4---6----6---2---6----38---3--6+5--83--4---3-
--------60------403---4---70--43--------94-+3
-2---1-3---6---3--4-----2---2--3---5-----0---
--4-------61--423-9-2----1------335------2-+6
3---7--5-6------8---5--6-5-+---35+-73--------
1---3---1-3-----5-5---3---+14-331---2---4-46-
-0---0---1-------2-------2-0-----1-------2-4-
0-4---2----13--22---5---3-6-5-1-5-5---6---76-
3---31-1-1-4-1-97+-72----5------5---2--8-7-9-
0-211----1--1---508-------513-24--2------36--
--25-----1--3--7-1-6---4-0-7---6-01-----2--9-
127--11---56--27--7------3----4-738-----4-7+5
-----1---63---3-2---5--4-7-5-2-2-3-3--05--04-
--111-----------3-8---2---45---2--7-2---3-5--
---------0-----3-0-------0-----3-0---------5-
----------------1---4---5-24---5--5-3-4---62-
-------3--22--38+--33-----------------04-906-
--1-0-2-----------2------1-53-56-34-----45-8-

Generation = 75, Population = 361.
4082-1---3---074-392-0---3-6-0-------0----+-6
--+3------+-96---+----8---8-7------+---+-+---
--66---4+0-----6-1773--3-0-3-0--7--3----+7+--
-23---27-23--74-----43--5-----5-444------3-8-
3----1+-84+81-+--1+--4+--2-7-2----+------6+-8
8----+4+5+++79---+--8---------5----+9--9--9--
------7--05---25-0+6-0---0-3---------0-3-0-9-
--4-----2---4-04---30---1-1---0-2--70-064-2-0
---5-133-143----33--6--0---------18+30+8+--+-
6-+-85--54+-5-++-+++75-9--24--4-985+--5+7+-+-
---5-3---19-6---+--352+980--71--7458-7----+--
--3--55-----456-----2726-2--244-31-85--8----3
----5-75-45+--3+3-----5-+6++-36--4+-934-+-++-
1-2--52-6+-----77+-7+-6-++6-7------47--8--48-
---4-23--27----642--+-5---+8-----3-7-0-4-7-6-
-------5--12--08---31--81--2----2-2-----1-09-
---2----5--31-3--545---79--750-+-----0---6+-5
-------4-+87+-++-+-7--64-653-3--4-2-1----9---
-------133---2-8-1585-+641-+8----5---0--+--+4

Generation = 100, Population = 217.
9-+---8---++-------6+-+-6-+-3-3-+-+-+-+------
-------+--+++++++++--++--++---------+--+++-+-
+-----+7---+---+--++------+---8-+-+----+---+-
---------5-------6-------------------4-------
9-----+----+---+---+---3+-------------++---+-
----++-+++---+-+-+++---+---------+-----+-++++
6-5-6-+-------------5-+-+---+-------8--------
---------2---------------------------1---3---
6-7-7-6----+-------8+---+-------+-----+8--+--
----++--+8---7+--+-+--+----------------+-+8++
6-+----9---+---+---5--------+-+-+-8-+--++--+-
-----8---6---9---4---------------3-------8---
+-----+9---+---+---+--+-+-+-+-9---++--8+-----
-------+-+-++-+++--+--6--+----------+8-+8--+-
6---8------+-------++---4-+-5-+---+-5-+------
---------3---3-----------------------0-------
--9-7-5---66-------+--------------+---+9-----
-----6--++-+-6++++----6-------------88-+---+7
+---9-+-6--9---+---+---97---+----------+---+-

Generation = 125, Population = 426.
+1+5+-+-+-++---+-5+---+--8-++3-++9--+1+++-+++
--------+++-++++++-++-++++--+--+-+---++---+--
+-+-+9+-+--++-+++-+---+---++----+2++-++++++-+
-------+--5---8+--9+--+---+-8-6+--+++--+-----
+3+-+6++--+--7++---+---9+--++--++---+---+++-+
----++--+--+++++-+-++-+-++--+--+-----+--+++-+
+-+5+---+-+---++-0+++-+8-0+--0--30+7--+--0+-+
--78--5-6-3----6---9--681-453--72-6-1--8--3--
+-++--+---++-5+---+++4+9+---+3--+3-++3--++++-
+++---++++-++--++++++---++-+++-++--++-+--+-+-
9---+-++--+---+----8--+++6-++3-++--+++++-++--
--8-8------9+------+----4---8-+---7+---+6--+7
--+--+++-9+--9+++-+++++-+-+++---+---+-+---+++
-+-+++++--++++-+---+----+-++-+-+-++++----+-++
--+--2+---++-6-------3+++5-+----+7-++3-++--+-
--460-2-4-374-1+--++2-3---37--3-2--9--294---6
-5------+--+-6+-+7+-+3+++3+-94+-+-++-3+++-+-+
-6-+-8--+++-+--++-+---+-+------+8+--+---++---
-48-+-+-----------9-+++-+-+-+9-+-7--+-+++++-+

Generation = 150, Population = 376.
+--5-4-------3-+------+--9++---+-+--+-+++-++-
+--+-+++-+-+-++-+---+--+-+-------+-++-++-+-++
-8--+--+--++-----6+---++--+-+-+-+-++++++---++
9-+-6+++-+----+-++-+--+-+--+++9+-++++-++-+8+-
---++--+---+--++--+-++------------+----+---++
++---+-++---++-+--++--++++-++++---+-+----+---
+--8---7+-----+---------+-+8------+8--+++-+--
53-+-4---2------4-++42-+---5-2-935-+312--7---
-7++--+8-7-+--+++----5--+9+-+4--+5+----+++++-
--+----++--++++++++-+---++--++----+--++-++-+-
-3+-+-----++----+5+9--+-+--++---+---+++---++-
6--+--++-8--+----8-+6--+-9---++-69---98+8+---
++-+--+---+--++++9+--------+--+++++-+-+++--+-
4+--+-----+-+---+--+++++++---++-+---+-----+--
--+--3+----++++----+----+7-++-+--7------+-++-
-249-3-------5-+42-+-4---3-----+-15-51-+-----
-9----+9-7-++-+---+--5++-3---5---7-+---+++-+-
-----+-+--+++++-+-+++-++++-+--++-++--+++-++--
--+5---9+---+---+-+--+----+++-+-+--+--+++---+

Generation = 175, Population = 412.
+1-++7---6++-5---9+9--+--9-+-5+---++-5++--+++
-++++++-+++++---++++++++-----+++-+-+-+-+++--+
+---++--+4-++4-++-+-+++-+-+-+6-++5++-+-+---++
+-----------++--+++--++-+-+++-+++++--+---+--+
+---++--++---++--+-+-+--++----+++---+++++-+-+
++-+-+++-+----+-++---+---+++-+--+-+++++--++++
+-+-+---+-+-+-+----+--+-+---+----0----+-+-+--
-5-+----84--8--+98+---8-1---4---4--+5---78---
--+----+-+-++9-+--+--8+-++-++7-+--+++8++-+---
--+-+----+++-+-++--+++---+-+-++--+++---++++--
+7------+8-+---+-++++---+7-+--++----+-+-+++--
-8+---+-+--+-++-++--+-+-----9----+--+----+--+
--++-+--+-++-+++++--++-++-----+++++++-+--+-+-
4---+-+---+-+------+-++-++++-+-+-+----+--+---
-2-++5-++6++++-+--+++7---8---3+++-++-7+------
1--+-4-+-----9--53-+5----55+7--+527+-3-+66--+
--++++-+-8++-9+-+8+-----+---+---+-+--+++-+++-
-+++--++++-+----++-----+----+++--+----+----++
+8--+++--7+-----+----------+--+--++-+++-+++++

Generation = 200, Population = 198.
--------+---+-+-----------+-+-----+-+-----+-+
+-++-------+-+-++------------+----+++-+--+-+-
---++-+++-+++---------------+-+-+--+--++--+-+
---------+-------------------+-------+-------
+-+---+-----7--++--+--++--++--------+-+---+++
+--+-+--+----+----++-+---+---+-+-+-+--++----+
------------+-------+-----+-+-----+----------
---------------------------------------------
--------+-----+---+-+-------+-----+-+---+-+--
++-----++----+----++---+---+---+-+----++-+--+
+-++--++--++--+-------+-+-+--------++--++---+
-----+---------------+---+---------------+---
----+--++--++---+-+-+--+----+-+++-+---+------
---+------++-+-++-------+-+-++-----++----+-+-
+-----+-+---+-+---+-----------------+-----+--
---------------------------------------------
------------------+-+-----+-+-----+----------
-+-----+--+--+--+--+---++-+++--+-+--+--+-+---
--+-----+-+---+++-+++-+++--++-----+-----+--+-

*** Life<FredkinCell> 27x26 ***

Generation = 0, Population = 11.
----------0---------------
--------------------------
------------------------0-
--------------------------
--------------------------
-------------------------0
--------------------------
--------------------------
----------------0---------
-----------0--------------
--------------------------
--------------------------
---------------0---------0
----0---------------------
--------------------------
--------------------------
--------------------------
--------------------------
----------0---------------
--------------------------
--0-----------------------
------0-------------------
--------------------------
--------------------------
--------------------------
--------------------------
--------------------------

Generation = 37, Population = 261.
--32-26--422-3---5-----4-1
-3-4-851-332--2-0---0---0-
-26--24---6--------4-5----
--1-2-6---1---------------
-0-09----5-7---------4----
9--4966-4-5----7--3------1
---020--------1-5--3----1-
4-12--4-2-2-------0------2
40-26--17-1--179-3-1---3--
--6-9-+69--------645-0063-
2144-0-31--794--642----34-
1---2--3--------5----3-0--
---6----279----7--7+-----9
--6-22------734-7-4-25--7-
-1-1--33----53-4---11----2
--42--------3--4--0-------
6-8-4---48-3-----1-5-1-63-
-2-2--42-6-4-235511233---+
4----0-04166335-532--8---5
------3----2----2--0-1611-
----6--1-3+1-4----4-23-27-
---0-2--51-67-6464---6446-
----60---27---+-4-2-4--1-5
----------2-1--0--5------3
-----1-1---2-348-5-3-5--7-
------5---0-31431-4----3-6
-----------7--44-4-4----3-

Generation = 74, Population = 273.
------+---4-5-++------5--+
-98+-++------9---1-3---6--
--9-++-5+---89++++9+----+-
-247--++-3-51-82-----5-7-6
--+3+2+3-+--++86+-+----+-+
+-+--++4+-+++7+-8----9-+--
--4-95-+------8+---44-4+-7
--6-+275---465+-----------
9---+-------+-+-------+---
---6-----------+-----7-+--
-6----+8-++--+--8+-++--+++
+----59--6--86638--6--25-8
+--+98+9-+--+---++-+--7+--
+-+-+---+-+-+9--+-+-6+--+-
-2--6--9-5---5---5-7---9-5
81-4--------+-978----36---
--+-+---+-------------6---
-6-5+5--+--------4-8-8-+--
----+7-2-------+---+8--7++
-165--9-8-8-3-4----6-3--37
7-8+-+-7-6--68--8-+---++--
+---+-9-+-----+-+-----79-6
+---+2-4--+---++6--7+--8-+
3---+---4-466---6-------34
6-+-+-+---9-5-8+----9----9
----+-+--0--+7+-+-+-------
9-+-9--------7++-+----67--

Generation = 111, Population = 356.
-4-8-++----+-----++--+++--
----++++----+-+--69+-++++-
+---++++--+-+---+--+---+-+
+8797-+-+--+8-+7-+66--6+-8
-----+++-+-+--++++--+++--+
+++---+++---+++--+-+-+9-8+
----+-++----+----++--+9--+
+6++--+----6+---9-4----476
+--9-8+---++-+-+-+++-+-+--
+--+-+-++++------+++--++-+
+++++9--++-+++++------+-+-
+9+------+++--+6-+5---4+7+
-+--++-----------+++-+--++
--+++++---+---++---++--+--
+---++-+-7-9+--+-9--+8+-++
+1+---8-9-6++9+++-4-6-969+
--+++--+-++++--+++--++--+-
----+++-++-+--+--+-+++--+-
+------9--++-++---+++-++-+
---+62+--++--+-8+-----+67+
+-++--+-++--++++++++++-+--
---++++-+---++--++-+---+-+
+-+-------+++-+++----+-+--
9----6+--1+--4+-+--26-+46+
+8+-+++8+8---+-+++++++++-+
+-+-++------++++---9+-+--+
-7---+-+-+++-+--++--++-+-+

Generation = 148, Population = 259.
--+++++++++++---++---+----
--++----+++-+---+-+---++++
++-+++--+++++--+-++--+--++
--------------------------
+-----+-+-----+-+-----+-+-
-----+-++++++++++-++++--++
+-++-+-++++++--+++---++--+
--------------------------
-++----+++-+--+-+-+--+-++-
--++-+-++++--+-+-------+--
--+-+-+-+--+-------+++++--
--------------------------
-+-++-+++--++++++++++-+---
--+---++-+-+----+-+---++-+
+-+-----+-----+-+---+-+-+-
--------------------------
-+--+-++-+++--+---+-+++++-
--+-++-+++-+----+-+--++++-
+---+------++-+----+-+-++-
--------------------------
--+-+-----+-+---------+---
++--+++++++++++------++--+
---+++++-+-++--++++-+++--+
--------------------------
--++-+++++-++---++---++-+-
--+--+++-+-+----+++--+---+
++++-+---+-+---+-+---+--++

*** Life<FredkinCell> 43x26 ***

Generation = 0, Population = 4.
--------------------------
--------------------------
--------------------------
--------------------------
--------------------------
--------------------------
--------------------------
--------------------------
--------------------------
--------------------------
--------------------------
--------------0-----------
--------------------------
--------------------------
--------------------------
--------------------------
--------------------------
--------------------------
--------------------------
--------------------------
--------------------------
--------------------------
--------------------------
-----------------------0--
--------------------------
--------------------------
--------------------------
--------------------------
--------------------------
--------------------------
--------------------------
----------------0---------
-------------------------0
--------------------------
--------------------------
--------------------------
--------------------------
--------------------------
--------------------------
--------------------------
--------------------------
--------------------------
--------------------------

Generation = 45, Population = 408.
------------0---0---0---0-
-------------0-1-0-0-0-1-0
--0-------0-0--00----1--0-
-0-0-----0---12-3--1430---
--0-------0-0--00----0--0-
-----------------0-1-1-2-3
0-----0-0--0----00-00----2
-0---0---10-4--467--5--444
0-----0-0--0----00-10----1
---------------------2-4--
-00----0----0--00---01-10-
0110--1-3--1-30331-047-83-
-00----0----0--10---01-3--
---------------------1-3-1
00-0-0--0--00---0--1--0--2
23----33-60542-1-10562-366
00-0-0--0--10---0--10-0-02
-----------------1-1-----1
-0--00-000--0-01--0-------
0-0-3--3-400--6-50-1-4-4--
-00-020100--0-010-0-0---0-
---0-0-------1-2-----0-0--
00--03--0101-20---0---0--2
3-43512-36---9+9-----2-555
-10-050-03-1020-0-0-0-0-01
-1-----2-1-------1-2-----3
-10-0201000-0-0---0-0203--
0-4-17----13-4---1--25--3-
04---3-501--0---0-0--1030-
-1---1-----2-2-------3-4--
0303-00-0-0-0-0-0202----02
33-2--7--5-----58+--+--58-
-5-207------0---03-20----2
-2---0---1-----2-1-------2
-10-0-02----0-000----1040-
0-1--2220----41-21--34-311
01-----2--0-0--00----204--
-0---0-----2-1------------
0-------0-0-------04-----3
---------1-1-----2544---1-
--0---0-0---------01-----3
-0-0-0-0-0----------------
--0---0-------------------

Generation = 90, Population = 321.
-------0-----0---------0--
0-1-0-0-1-0---1-2-------1-
---------1-1-------------1
----------3---9-9-4---7---
-----------------1-0-----1
0-0-011-3-132-6------3--26
-0-1-------------2---7-+-8
---3---3-4+--+----49-----+
-0-0-5-------8---3-3-7---5
2-2--32-2--3--3---3-357--3
-0-1-----------2---2------
--7---2-4---+---------8-5-
-----------------5-6-----2
3253--3-----42--0527--6-5-
-------3---0---1-6-9-5---5
-+-4-6+---295---7+95-7----
-----6-------6---6-7-9----
12-43-2---1-16---5-5------
-------0---1-----------2--
1---7---------+-7-9-------
---------4-0-------------8
---350--1-424-5-7-----24-7
-3-----6-9-+-+-7-----6-9-9
61+9++-88+---++-----+9-8+-
---5-----+-+-+---4-6---6-8
--23-8-----64---------1818
-4-------------2-----6----
--9-----3-5-----------3---
-7-2-----------6---5------
-435--353-----34-7-9465-4-
-7-8-----7-3---------6-+-6
97+6--+--+--8+-++-+-+8+++-
-+-------7---9-----+-+-+--
24-32--6----3-4339-5-74---
-----3---5-1-7---------+-3
--3-------6-----------+---
-------4---0-----------6--
----2-543--7--454--64-28-2
-+---3-------6-8---------9
----59--6---+-+-+---+--+5-
---4---2---7-7---5-6------
------21---3--353--34-1224
-2-------------2-----2----

Generation = 135, Population = 385.
----------------0-------0-
---------------4-0-----6--
--------------0-0-0---0---
-------------8-7-2-7-+----
----0-------0-0-0---------
---5-3-----6-4-7---7-5----
--0-0-0---0-0-0---0---0---
-5-7-9-9-+-+-+-----+---+-+
0-0-0-0-0-0-0---0---0--+0-
-3-1-5-6-8-8---+-6---7+-6-
--0-0-0-0-0---0-0-0--50404
---8-+-+-8---+-+-+-5+-+-+6
--0-0-0-0-0---0-0-0+0608--
-2-6-1-+-3-5---4-84+8-8+-+
0-0-0-0-0-0-0---0+0+-+----
-+-6-+-+-+-+-+--+-+++--+--
--050-0--60-0-0--+-+0+0+--
--3652--6-23-6-7--6-7---3-
-5-505-6-3-70-0-0--+0-0--+
7-8-8---+-3-+8-+-+-+---+--
-5-5-----4-7-+--0-07----0+
--3-------5-7+8--+3-8---3+
-----------+0+0+-+-7-+-+--
--+--------+++++-++-+-----
--0-------0+0+0+-+08-+----
-378-+-+-9387+5---447-4---
0804-----+080+-----906-9--
7++-++-+8-9+6-------6+7-+-
-+-90+0+08-6--0------+-+-8
-77+73-76+25-+-5-----+6-6-
0--+0-0-0+----0-0---0-0+--
-----+-+---+---+-+-+-+-+--
0---0-0-0---0---0---0-0---
---4-7-+-6-----6-----+----
0-0-0-0-0-0-0-0-----------
---8-9-+-+-----------+----
0---0---0---0-------0-----
-8---------9-4-----+------
--0-0---0-0-0-0---0-------
-----+-+---+-+-+-+--------
------------0-0-0---------
-------------3-7----------
--------------0-----------
