20

4 49
23
3 31
2 44
1 29
0 14
0 6
3 38
0 30
3 41
1 15
3 31
0 27
3 22
1 43
0 1
1 6
0 18
3 8
1 20
2 42
1 22
1 12
0 15
2 28
250 25

36 2
11
5 1
34 0
20 1
9 0
7 1
2 0
27 0
1 1
0 0
10 0
25 0
80 23

50 18
3
24 10
49 10
41 1
140 42

3 6
33
0 4
0 2
1 2
1 5
1 0
0 4
1 2
1 1
0 5
0 4
1 0
2 5
0 1
0 0
1 5
1 2
2 5
1 2
1 1
0 1
2 5
1 4
2 5
2 3
2 5
2 0
2 4
2 2
2 1
0 3
0 3
0 0
2 2
109 42

5 4
28
0 2
4 3
2 0
3 3
1 1
2 0
0 3
4 1
0 0
2 2
3 3
3 2
1 0
4 0
2 2
0 0
0 2
3 0
4 2
4 1
4 0
0 3
1 2
2 0
4 0
2 1
4 0
0 3
199 35

1 36
18
0 33
0 0
0 0
0 15
0 4
0 18
0 20
0 26
0 2
0 26
0 20
0 20
0 7
0 0
0 20
0 24
0 33
0 4
194 40

44 28
27
3 12
16 5
12 19
37 3
27 14
38 0
27 22
11 23
6 10
3 14
17 27
13 23
22 1
19 0
13 18
14 14
15 13
38 26
14 4
32 8
11 15
29 26
19 19
13 15
42 23
34 10
6 15
42 43

22 37
28
5 7
2 14
2 7
15 16
6 0
10 19
14 22
6 27
17 6
16 36
5 33
4 2
16 15
1 16
20 30
5 2
20 27
5 4
20 26
5 18
0 11
4 5
7 11
7 13
15 19
2 8
4 6
17 36
240 45

21 23
28
7 2
10 15
12 0
0 7
16 1
18 15
19 12
12 20
10 19
15 6
12 9
16 4
11 3
1 20
5 8
7 13
17 9
17 21
15 12
20 17
6 22
20 2
11 18
7 7
6 21
9 8
19 7
7 9
152 21

16 26
29
1 10
5 19
5 3
7 16
3 1
13 1
13 18
6 15
2 17
15 14
9 22
6 22
2 15
10 14
12 4
5 3
3 2
9 24
3 0
10 4
13 21
4 23
2 4
3 22
3 15
0 22
2 4
4 10
14 22
269 20

17 30
24
14 27
2 19
8 16
13 20
4 24
4 14
16 24
15 0
8 7
14 2
4 3
3 13
5 24
3 7
9 4
1 11
10 17
5 16
7 6
15 27
2 17
0 16
6 16
2 9
160 24

25 44
21
18 34
21 23
11 5
17 43
13 1
15 34
16 5
15 11
19 43
1 17
0 42
21 35
8 23
11 25
22 21
7 6
1 25
17 32
10 13
6 28
5 40
166 27

30 28
15
19 5
19 23
17 18
11 10
1 4
11 14
0 9
19 23
0 12
3 7
19 11
6 10
4 5
26 10
11 26
115 47

1 27
19
0 10
0 20
0 12
0 17
0 19
0 14
0 21
0 24
0 7
0 11
0 1
0 4
0 5
0 17
0 24
0 7
0 26
0 8
0 19
7 36

36 17
24
35 2
22 4
12 12
31 2
11 13
26 1
20 16
5 2
24 10
16 4
29 16
7 0
0 5
11 12
12 7
22 15
33 6
18 9
4 4
0 10
18 14
0 11
4 7
20 11
287 20

41 37
24
25 13
14 1
3 5
11 9
11 31
24 4
0 14
11 19
9 8
19 26
10 18
8 12
32 3
3 2
23 31
28 30
29 32
31 31
26 9
28 33
26 15
35 22
12 30
17 26
78 31

47 15
31
26 2
30 10
29 12
6 13
12 14
20 3
6 0
11 5
29 13
30 8
41 1
38 13
23 12
34 9
34 10
3 11
46 4
23 10
29 6
42 11
28 12
10 1
28 2
23 2
29 11
29 12
40 9
46 14
9 4
1 10
40 6
257 28

46 50
23
21 34
16 26
16 47
32 30
18 11
12 2
14 47
32 30
42 42
6 45
40 22
24 17
20 4
36 43
2 7
17 8
36 35
20 10
1 28
26 9
36 11
30 9
10 39
274 22

48 50
3
27 28
0 46
2 49
116 31

25 25
10
12 16
5 22
12 13
18 2
16 21
24 10
23 23
17 13
20 13
4 22
76 41
