*** Life<Cell> 34x36 ***

Generation = 0, Population = 18.
----0-------------------------------
----0-------------------------------
------------------------------------
------------------------------------
------------------------------------
------------------------------------
------------------------------------
--------0--------0------------------
------------------------------------
------------0-----------------------
------------0-----------------------
------------------------------------
-------------------0----------------
-----------------0------------------
------------------------------------
----------0---------------------0---
----------------0-------------------
------------------------------------
------------------------------------
-----------------------0------------
------0--------------------0--------
---0--------------------------------
------------------------------------
------------------------------------
------------------------------------
------------------------------------
------------------------------------
------------------------------------
--0---------------------------------
------------------------------------
------------------------------------
-0----------------------------------
-----------0------------------------
------------------------------------

Generation = 93, Population = 113.
....................................
....**...*..........*...............
...*..***.*........*.*..............
....**.**.*............*..*.........
.........*........*.......*.........
-..................**....*..........
..................*.*****...........
.-................***............-..
..................*.................
-...............................*..-
...............................***..
..............................*..*..
.............**.............**...**.
............*...*...........**...**.
...........**.*.*...........**...**.
...**.....**.....**..........*..*...
...**........**..**..........***....
.......*.*.*.....**...........*.....
........*......**...................
-..............**...................
....................................
...................*.*..............
......................***...........
......................*...*.........
.......................*..*.........
.....................*.*..*.........
...................*.*..**..........
....................................
....................................
-..........**.......................
..........*.*.......-...............
...........*........................
**................-..-..............
**..................-.-.............

*** Life<Cell> 41x10 ***

Generation = 0, Population = 21.
----------
----0-----
----------
----------
----0-----
----------
----------
----------
-------0--
----------
----------
------0---
----------
----------
---------0
--------0-
----------
---0-0----
----------
--0------0
--------0-
----------
------0---
---------0
----0-----
----------
----------
----------
--------0-
----------
----------
----------
----0-----
----0-----
----------
----------
--0-------
----------
----------
---0----0-
------0---

Generation = 14, Population = 181.
11--.*-*1-
-110.**-.-
1-1...0..-
*.-.*....1
*1.*.*..**
-*.0**-.-*
--0..00.-.
--*.-0-1.1
-.-.....-*
*.*.**.-.*
111..*--11
00*.**.*.*
10--*0.-.-
1*-*.*..**
0*0*0***.1
.*-1....*.
1*0--*.**.
...-1...*.
001--1.**-
.--**..-*.
--1-*-*.**
-0*.-1-..*
01.11-.-..
*..-*-*--1
*0.-.-1--*
*-*.**.**-
.00-*0-000
.-.1.--00-
-0**...0-0
1..1***-.-
.-*0*..0-0
.-***.0-*.
*..-*..-*-
*.-..0.-.1
*...*0.111
-.-...1-.-
-*....---*
1-.*.-.-1*
11.0-.**1.
-*....***0
-0--.-.-1-

Generation = 28, Population = 105.
..........
..**.....-
.....**...
.*-..***..
..*.**..*.
......**..
-.....*...
-...-.....
-.*..**...
.*..*..*..
.*...*.-..
.-..***...
..*.*.....
..........
-.-.......
.......**.
.......*.*
.........*
**.......*
***.......
-*........
...***....
....**....
....*.....
...**.**..
.-**.***.-
.*-**.-*-.
**.*..0**.
.-..*****.
....**.1..
..*..*...*
..**..-.**
..**...*..
..**.....*
...*..**..
..-...***.
.....*.-*.
.....*..*.
-.***...*.
....**.*..
......*0..

Generation = 42, Population = 86.
.......*.*
.........*
..*.......
.*.*...**.
**...**.*.
...*..*.*.
-..*.*..**
0.......*.
-....***..
......*...
.......-..
.-........
..........
.**.......
**1**.....
...***.**.
******...*
..*.....*.
..*....*..
..*.......
*.........
*..**.....
.*.*......
..*.......
......*.*.
......*..*
......*.*.
......-...
..........
....***...
..........
.....*....
.....**...
**..*..*..
*..****...
*....**...
.*.....-..
..........
-.........
...**.....
...**..-..

Generation = 56, Population = 44.
..........
..........
..........
..........
..........
..........
..........
-.........
0.........
..........
.......-..
.-........
..........
..........
..........
..........
..........
..........
..........
**........
**.....*..
.......*..
........*.
......*...
....*..*..
.....***..
....*.**..
..*...*...
.*...*....
*...***...
*..*.***..
*...*.....
.**.......
..........
....*...**
.....*...*
.....*.-.*
......***.
-.........
..........
.......-..

*** Life<Cell> 46x42 ***

Generation = 0, Population = 14.
------------------------------------------
------0-----------------------------------
------------------------------------------
------------------------------------------
------------------------------------------
------------------------------------------
------------------------------------------
------------------------------------------
------------------------------------------
------------------------------------------
--------------------------0---------------
----------------0-------------------------
------------0-----------------------------
------------------------------------------
------0-----------------------------------
-----------0--------------0---------------
------------------------------------------
--------------------0---------------------
------------------------------------------
------------------------------------------
------------------------------------------
------------------------------------------
------------------------------------------
------------------------------------------
------------------------------------------
------------------------------------------
------------------------------------------
------------------------------------------
------------------------------------------
-------------------0----------------------
-------------------0----------0-----------
--------------------------0---------------
------------------------------------------
------------------------------------------
------------------------------------------
------------------------------------------
------------------------------------------
-----------------------------------0------
------------------------------------------
------------------------------------------
------------------------------------------
------------------------------------------
------------------------------------------
------------------------------------------
-----------------------------------0------
------------------------------------------

Generation = 13, Population = 674.
0-0-0-0---00-00---0------0-0--------------
------10-0-010-0-0-0--0---0---0-----------
0-0-00*0--001-0---0-00-0--0--0-0----------
------1-0-01*0--0--0-00--0-0--0-----------
0-0---.0-0000-00-0--------1---------------
--10-0.01010-0-00-00-0----1-------0-------
0010--.01010--0000-00-0-00*0--0--0-0------
--0-0-11100-0-11100-00---0---0-0--0-------
--00-0.00--0-0-0---0-0---1-10-0-----------
00-010.0----1-00.0.-.0-000.00-0-------0---
-00010100--0.0-0*-10-000-.-**010--0--0-0--
--01*000*1.-..---1*****0*0*-11---0-0--0---
-0-00-00*00-10.-*-*0-*.0-.**---10-1-------
0-0-00-0001-*001*.1*-1-1....-1-10-1-------
-0---0000010*---*-011-1-.-.-.----0-0--0---
--0---0110---.1-....*----1.--010--0--0-0--
---0-0-0---0---0.-0*-0000-100-0-0-----0---
0---0-00-0----1-*---0-00*--*0--0-0--------
-0-0-0-00--0.0-0*----0-00-*-.---0-0-------
0-0-0-0-0-0-.---0*.1*00---0------0-0------
---0---0-0-00----0-.0--0----0-----0-------
--0-----0-00-00*10**0-010--0-0----0-------
-0-0---0-0-00-0---*.1-010---0----0-0------
--0---0-0-0-0-0-1-01*1------------0-------
-------0-----0-01*-*00*----0-------0------
------0---01----1-.*1*---0-10-0---0-0-0---
-----0-0--0-001-..-*.*1-*-1--0-0--00-0-0--
------0---0.0--*100*--0*100-*-0--0-0--0---
-------0---.---...*.1.1*--.--*----0----0--
------010----.*1-.--***--.***-.0--.---0-0-
------010----.*1-.0*-*0-1*.*.0---0-0--00--
-------0---.--0.....0.1-0*-.*-*0--0.-0-0--
-----------1--01---..--100-1*-*---0*0-0--0
----------0*001-1.*.-*1--0-000.---010-0-0-
----------010----1*.11------10-0--00-0-0-0
-----------0----1--.-0---0----00-0100-00--
---------------0-*-.**----0---0*00*---0*0-
--------------010-*.*--0--.---010--0---10-
--------------010--*----00-0--00-0**-0-0--
---------------0---.-0----0.-0*0001.-00-00
-------------------1--0---0*001--11.11--1-
------------------0*0-----010---0--.--0--*
------------------010-----00-0-0---0-----0
-------------------0---0-0----00-----0-0-0
----------------------0-0---0-0100-01*-1--
-----------------------0---0--010-0-000*00

Generation = 26, Population = 727.
-0-*-....1...*.-1--.-.*-01*01*1-0---------
.*-*1****11*.-----*-.0.110..*11-----------
-1.*.*.-110-.*..*-..*10*.*.1*..-.-0-------
-**.*-...-..*.*1**01...-.**-.*-1.*-00-----
.*..10.*.**-.*.-*-*1*-...-..-...-----0----
-*.**-..*-*.*0.1*-**.0.*....*-*--*---0----
.*****...*-*1*.....-.-..*.*...*...-011----
.**--....*1**-*..1***......**-1-.11-00----
.-1.1*..-.--.**-*-**.0-..*-.*..-.**.0*--0-
........**..*-1***.**.11.*.....**..1-*.-0-
0*.-1.*10*-.***-.*.**.***...**...---.*00*-
-*-......*.*...*......***-*..*.*..-.-.-.1*
*1.......-...1.1*-..-..-..**.....*.0------
.11--....*...*-.....-...*...0..*.*.*.1*.10
*.--.-..-0*......**...*0.**.*..1***..-.*-0
-.-*-*-*.........**......*.*..**.**.**-.0-
11.0.1..-1*....1....1...**.*...-.---.1-0--
0-**.0......-.....--**.-.*..1.*.--.*--*---
-0-*.1--..*.*1....*..*..-.*0..01-*..-01-1-
*10.*.*1*.-1.-........**0**1.-***10...1**0
1-*0-0-1-.**.0**...*******...1*0-*.1.1-00-
0-*.1----0*.*..*.-*.1*..*-...-..-*...-0.00
-0-0*---*..***-.**...*....-.1*.--*1..-*-0-
-01-.*-1.1**.*...*0..*.-..*-.**.1.1*.----0
---*-1-1--*.1....***.**-0.....*01--1.--0--
0-0--111-*.*.-1*..**.***.....*.-1*-...1*-0
-11*0--...*******.**..*.*..1....**..*..-*1
-1-1--...1***...*..*.1*....*..-.**.*.10*-1
--*.1-..1.....*.**.**....*.*...-**.*.*...1
0.0.*.**.*..-..**.*.*.*....*...*1*.*1..-.-
-*--*.**.*..-..........**..*..**.*1*...*.-
---.*-0...-..**.....0..*..0.....*.-.-....*
001.0-*-*-1**.*.-....-........**-...*1.1-*
0**.1**-....***.....*..**.*......*..*-*01*
-10-.110--.**-.**.....*1....****.-..**1.--
---.-0.-.10.*..-.....1.--*..**1..-.**.0*01
---*-1---****.*.*....*1...-.01.*.1.**..***
-0-.11-1-0-*.**.-*.....*....**.---0.*..*1*
-0--1-0*0--1..**..*.**.--......*..****.1-*
---1----0-0--.-..1*.1.-1.*..*...-..*-...1*
---0--0----0**-*-**.1-.*.*.*...--.***..0**
-------------01*.**.-...1**....--*.**.-.1.
-------------01*1*..*.-1**...-.....0**.-.-
------------0-*-..*....----*--1....*......
---------010--1*..-*.*.-1*1*-.*...-*..-**.
---------0--1.0*-*-..*.*1*01.*****....-.*-

*** Life<Cell> 39x18 ***

Generation = 0, Population = 14.
------------------
------------------
------------------
------------------
------------------
--------0---------
---------------0--
------------------
-----0---------0--
------------------
----------0-------
------------------
---0--------------
------------------
------------------
------------------
------------------
------------------
------------------
------------------
-----------------0
--------0---------
-----0------------
------------------
------------------
---------0--------
------------------
--------0-0-------
------------------
------------0-----
------------------
------------------
------------------
------------------
------------------
------------------
------------------
---------0--------
------------------

Generation = 55, Population = 106.
..***.............
.*..*.............
.**.**..**........
.**.....**........
.....**...........
..**..*...........
...*...*..........
....*...**........
....*.*.**........
..................
..................
..................
..................
.**.........--....
*..*..............
.**...............
.............**...
.-...........**...
..................
..................
..................
..................
.............*....
............****..
......*..***......
..**.....**...*..*
.*...........**...
***.*....*.....***
*...***.......***.
*...*.............
.**.**.....*.*.*..
......*...*.***...
.......**.*.*.....
....*.....*.......
...**....***....-.
..*.......**......
.*.......**.......
.*................
..*.............-1

*** Life<Cell> 20x17 ***

Generation = 0, Population = 27.
---0-------------
---0-------------
---------0--0-0-0
---0-------------
---------0-------
--------0--------
----------------0
-----------------
0----------------
--------------0--
----0------------
-----------------
----0------------
--0--------------
--------------0--
---------0----0-0
-----------------
0------000-------
-----0-00--------
----------------0

Generation = 49, Population = 55.
...........-*....
..****.....**....
.*...*...........
.*....*..........
*....*.....*.....
**.*..*..****....
**.*.*****..*....
.......*.**......
....**.**........
....***..........
......*..........
.................
.*...............
*.*...**.........
.**...**.........
.................
............-....
.................
...-.....**......
.........**......

*** Life<Cell> 34x17 ***

Generation = 0, Population = 18.
-----------------
-----------------
-----------------
-----------0-----
--------------0--
-----------------
-----------------
-----------------
-----------------
-----------------
-----------------
------------0-0--
0----------------
------0----------
0-------------0-0
---------0-------
-----------------
0----------------
---------0-------
-----------------
-----------------
-----------------
-----------------
---------------0-
-----------------
---------0-------
-----------------
-----------------
-----------------
---------0-------
----0------------
--0--------------
-----------------
-------------0---

Generation = 70, Population = 60.
...............*-
...............**
...***...........
..*...*..........
...*..*..........
....**...........
.................
...*.*...........
...*.**..........
.......**...**...
...*.*.**..*..*..
.**....**...**...
.**.*..*.........
..*....**........
...**..*.........
...**.*..........
....**...........
...**............
...*.............
....*............
.................
...............-.
...............1.
.................
................-
.............-...
.....***.........
.....***.........
.....*...........
.................
.................
.................
.................
.................

*** Life<Cell> 17x28 ***

Generation = 0, Population = 27.
--0-----------------0-------
--------0-0----------------0
------0---------------------
----------------------0-----
----------0-----------------
--0-------------------------
------------0---------------
---------------------0------
-------------0--------------
-----------00----------0----
------0--0------------0-----
----------------------------
---------------------------0
--0----0---------0-----0----
-------------0--------------
---------------------0------
---0-------0----------------

Generation = 119, Population = 39.
-...........................
....*.....*.................
...*..*..**.................
...*..*..*..................
..**.*.......*..............
..*..*...*...*..............
..***........*..............
..........*.................
...*.*........-.............
...***......................
.........*..*...............
..........**...............-
............................
............................
............................
**...**.....................
**...**.....................

*** Life<Cell> 34x47 ***

Generation = 0, Population = 28.
-----------------------------------------------
-----------------------------------------------
0----------------------------------------------
--0-------0------------------------------------
-----------------------------------------------
----------------------------0------------------
---------------0------------------0------------
-----------------------------------------------
----------------------------------------0------
----0--------------------------------------0---
0----------------------------------------------
---------------------------0-------------------
-----------------------------0-----------------
-----------------0---------------------------0-
-----------------------------------------------
-----------------------------------------------
------------------------------0----------------
-----------------------------------------------
--------------------------------------0--------
-------------------------------------------0---
---0-------------------------------------------
-----------------0-----------------------------
0-----------------------0----------------------
--------------------------0--------------------
-----------------------------------------------
--------0---------0--------0---0---------------
---------------------------------0-------------
-----------------------------------------------
-----------------------------------------------
-----------------------------------------------
-----------------------------------------0-----
-----------------------------------------------
-----------------------------------------------
-----------------------------------------------

Generation = 98, Population = 172.
......-..............*........................-
.....................**....*...................
.....................**....*..................-
...................*.*.....*..................-
...................*.*.........................
...................*.*............*............
......**......***...*..............*...........
......**.....*...*...............***........**.
............*...*..........................*..*
............***.............................**.
..............................................-
...............................................
.-...........................**................
...................*.........**................
..............*..*.**..........................
..............*................................
............**.*...***..............*..........
............***..*.*.*..............*..........
...........***..**...*..............*..........
............*........**...................-....
..........***........*....**...................
...........*........**....*.**.................
...............*...**.......**..........*......
..............**....**....**.......*...*.*....-
..............***.....*....*.......**..*.......
.........*.........***...*.*......*.**...**....
........**.........**....**......**............
.-....**....**...................**.**........-
.....*.......**....................***.........
.-..*.......**......................*..**......
.....**.............................**...*.....
......**...........**.........**.....**..*....-
..................*..*........**.......*..*....
...................**...................**.-..-

*** Life<Cell> 11x25 ***

Generation = 0, Population = 15.
-------------0-----------
------0------------------
------0------------------
-0--0----------0---------
----------0--------------
------------0------------
-------------------------
--0--0-------------------
0------0-------0---------
-------------------------
-----------------0---0---

Generation = 37, Population = 48.
............**......***..
..........*...*.....***..
...-.-....*...***...*.*..
..........*..*.......*..*
...........*..........*.*
............*....*...**.*
............*.*.**..1*..*
.............***....-...*
..............*.........*
...........-...**......**
-..............**..-....1

*** Life<Cell> 47x33 ***

Generation = 0, Population = 29.
---------------------------------
---0-----------------------------
-----------------0---------------
0--------------------------------
---------------------------------
---------------------------------
---------------------------------
---------------------------------
------------0--------------------
---------------------------------
---------------------------------
---------------------------------
---------------------------------
---------------------------------
-----------0-----0---------------
---------------------------------
---------------------------------
---------------------------------
---------------------------------
---------------------------------
--------------------0------------
---------------------------------
---------------------------------
-----0-0----------------------0--
--------------0------------------
--------------------------0------
---0-----------------------------
---------------------------0-----
-----0-0-------------------------
---------------------------------
---------------------0-----------
---------------------0-----------
---------------------------------
---------------------------------
---------------------------------
-----0---------------------------
------------------0------0-------
---------------------0-------00--
----------------0----------------
---------------------------------
-------0-------------------------
-----------------------------0---
-------------------------------0-
---------------------------------
---------------------------------
---------------------------------
--------------------0------------

Generation = 22, Population = 560.
.***.-0......-.0....---1---------
*...**.*.....*..-*1*.*.--0----0--
.*...*.*0.....*..*...1.-----0----
.****...*..**---.*.*--1---0-1---0
.**.*1*...-.*..-.-.1.....-1---1--
*-......0.*.0.*--*..1..-0-----0-0
***-*...1...1.11......-.*.01*0--1
.**..-*1.-....*1--....-*--**.-0-*
.--.-01.-1**-100**.*.*00--.--0.1.
.-..-0**..1....1..-00**--*-.11.1-
-1..0**...-...-.*-.11*0---00.10-0
....0*0*.*0*1*.10*-..0.01---01.*1
1-*....*..**...*..**.......1.1--0
1*....**.-.*...-***-...-0-...1--0
1-..-.***.....*.-*....-011-..-*0*
.*1*..*.**....-1-**-...*.*..-.-.*
-..1-1..*-.*..-*0**.-.-*...00*.--
...***.*.00*11--*1*0.*-.**0.*.**-
--..10-*-....*.*.*0*.**---**-11-1
..1*-*..-*-**-*--**-*-.......-**-
****-..*.**..1.-.1*-*.....-1..-.*
....-..*1*.****.*-.-*..*.1....*1*
*.-*-.-.-..-*.*.-.1.-.-1-.--...1.
*....*-.*...**..-.*--.*.......**1
-.****...-....011..*.....-*1*..*1
-.*-0**.....-..0*.-.*.....1...*..
..*-****.*....-****...-..........
..-.......-....--*--1..*...-....-
.-*..*......-...***0*.-1*.***..-.
-*-*-1...-.-.....**.*..-.1.....**
**..*11*-1-**....*..*...1*...11.-
*.*...1*.-**0.-...**....**....*..
..**.*-*-.-**-........1*.*......1
*...-..-1.1***..........*.***.*.*
1***1..**-..-0*1..-......*.*....*
0*.*.*-*00-......*..1..*..*...*..
-**.-*-......1*..*.....*...*..*1.
1.-10..*1.-1*1-11*.....**.-.*....
-.-.*..*....-*.1*.**...**...**...
1...*.1*-1---.*-.***...0*-..*-*..
*..*-...*.00.*-....0.--.**.**1.*0
-.0.-..*.-**-..01.---.**-***...*.
-*.*-*-.*.-*.0-***....-..**.....*
10*.0.-.*.*..*-*--...*-.-*0.....*
--0.1.*...*.-.1-*-*.**..-.-.....*
-1-*..*.0*1..1-.--*.*1...-.*.*..*
-*-0**0..**.1*-***0--........***-

Generation = 44, Population = 374.
.....-.......-...*..*...*...*-.-.
............**...*.........**....
...........*..*.*....*..*.......-
................******...........
..................**.......***...
..*..........*...**......*...*.-.
.*.**.**.....**..*......**-......
....***.*.....*..*.....*.*...*...
.....*..*......**.....**..*..*.**
..*...*.............-..**...*.***
.*...****........-....-.....*..**
...*.*.**....................*...
...*..*..*.............*.........
...*******............***.....*.*
.***.*............*.**...*.....*.
.*...............*...*.**...-....
........***.....*...**.**.....***
.......**.*...-..*...***......*.*
..*.*.****.........***.*........*
.**.**................*.*...*..**
*.............****......**.......
.***..*.......*..**....***.......
...*....**....***.**.***.........
....*..***......**...**...*.*....
...**..*.**...-..**..********....
-...*....*......******.****.**...
.....*..*.........****.*.*..**...
......**..**.......*....*...*..*.
..........**........*****.****.*.
.....-..**.*...**...**.1.........
......**.*....*.......***.*......
...*......*...*.....*..*.........
...****...-...*..*.*.............
..*.....*..........*.....*.......
......*....*.*...*.*....*.**.....
......**..........*.**....*......
.*...*.........*.....***.........
*...*..*......*........*..*......
.*.**..*...***.........*..*......
*.****...*.*..........*..*.......
*.*.......*...........**.**......
.........*........-...**.*.......
......*...............1*...*.....
.*.**..*......-...........**..**.
..**.*.*...............**.*.***..
...*****................*.*****..
......*.............-....*****...

*** Life<Cell> 43x8 ***

Generation = 0, Population = 20.
--------
--------
--------
--------
--------
--------
-----0--
---0----
--------
--------
--------
--------
-------0
--------
0---00--
--------
-----0--
--------
--------
0-------
--------
--------
--------
---0----
--------
--------
--------
-----0--
--------
--------
-0------
--0-----
------0-
-----0--
--0---0-
--------
--------
-------0
-------0
0-------
--------
-0------
--------

Generation = 32, Population = 89.
.....-.-
-...*1*.
....*.*-
.....*..
.*......
***.....
......-.
*.*.....
*.**....
*..*..1.
**...*..
.*...***
......**
...**..*
*...**.*
.....*.*
.*..*..*
....**.*
....**.*
..**..1.
.*....1.
.*......
.1....**
...**.**
.......*
......**
.....***
....**.*
-..*.*.*
....**.*
.....***
......**
.....*..
....*...
........
........
........
..**....
.*.*....
.*....-.
.*.*....
..**....
......-.

*** Life<Cell> 33x44 ***

Generation = 0, Population = 27.
--------------------------------------------
--------------0-----------------------------
-----------------------0--------------------
-----------------0--------------0---------0-
----------------------------0---------------
--------------------------------------------
------------0--0----------------------------
--------------------------------------------
--------------------------------------------
--------------------------------------------
--------------------------------------------
-------------------------0--------------0---
--------------------------------------------
--------------------------------------------
--------------------------------------------
------------------------------------------0-
--------------------------------------------
------------------------------------------0-
---------------0----------------------------
-----------------------------0--------------
--------------------------------------------
--------------------------------------------
--------------------0-----------------------
--0------------------------------0-----0----
---------------------------------0---------0
--------------------------------------------
---------------------------------------0----
-------------------------------0------------
-----------0--------------------------------
------0-----------------------------------0-
--------------------------------------------
----------------------0---------------------
-------------------------------------0------

Generation = 29, Population = 500.
--.-..**1**..***........**...-..*.**.0---..-
.**...*...1.-***...***.1.*.....*...*....*.-*
0-...-*.*........**.*.*..1.....*....1..*.*.*
-.1.*...1......*****.*****....*.......*..*..
*...**.........**..*.**..***.**.-...***.....
**.**....-***..*.....**.*....*.-....***.*-.-
**........******.***1....**1..--***..**-.1*.
-..-.-.*.1.....-.***...***-*....***..*-.**.*
0-1..1..**...*0..**.***..10*.*...**.1**.**-.
-1.*1..0**....-............-.*....**-*..**.*
-**.*...**.*........*...***....*..-**--..*..
0-*-.*-*****...-...*.***...-*0-.....**.*...*
*--01*...**.........**.-.*..-.*..****1.....*
-1----..*1-***..*.....*1....-..**..**......*
-.-0***-**.****.*****......1-*.1-..*.....*.*
011*.-10.10.0-....*...**-.*.*-**.*.**....*-.
0------.*.*..0-.**..*0..*..-**.0***...*.1*.*
-00*-.-.1**.....*.***..***..*.......*.*.*..*
--.011-*-*..--.*-......***...**..........*.*
0--..*...*0.*..*........1*....*............-
.0-...1.*...*..*.........1...**.........-...
*.**....*..*..*.......*...*-......1.*.....**
*1-*....***..........*.....*.*...*..-*.....*
*-**.-....-...*...**..-....**.............**
.1-.***.*..*.*.*.1..*......-0**.**.*.......*
1*.---*-.-.**......**....*****.*****.....*.*
-1.....0...*-..*-****....**.*.***....*..**.-
*--0.....*..*..**.......**.*..*.*........**-
100-*.-*.**..........-...*..*...*....***....
---*--1.1-.1-11*........-*..*.*......-.-.-..
--*.*0*.1-**1***..**.-..--...*1...**.-.-*...
0---*-*--.0*.-.--**........***....*.....*-..
--0**1-*.-0.00-.............**..-......**-..

*** Life<Cell> 24x15 ***

Generation = 0, Population = 27.
-0----------00-
------0--------
-----0----0----
---------------
----0---0---0--
---------------
--00--------0--
-0-------------
---------------
-----------0---
---------------
------------0--
------0-------0
--------0------
----0----------
---------------
---------0-0-0-
-------0----0--
----0----------
----0----------
----------0----
---------------
---------------
---------------

Generation = 58, Population = 10.
...............
.......-.......
...............
......**.......
......**.......
...............
..............-
...............
-..............
.....-.........
...............
...............
..........-....
..............-
...............
............---
......**.......
.....*.*...-...
.....**........
...............
...............
...............
...............
...-.-........-

*** Life<Cell> 50x49 ***

Generation = 0, Population = 24.
-------------------------------------------------
-------------------------------------------------
-------------------------------------------------
-------------------------------------------------
-------0---------0-------------------------------
-------------------------------------------------
-------------------------------------------------
-------------------------------------------------
-----------------------0-------------------------
-------------------------------------0-----------
-------------------------------------------------
--0----------------------------------------------
--------------------------------------0--0-------
------------------0------------------------------
-------------------------------------------------
-------------------------------------------0-----
0----------------------------------------------0-
-------------------------------------------------
-------------------------------------------------
-------------------------------------------------
-------------------------------------------------
-------------------------------------------------
0-----0---------------------0--------------------
-------------------------------------------------
-------------------------------------------------
-------------------------------------------------
-------------------------------------------------
-------0-----------------------------------------
-------------------------------------------------
-------------------------------------------------
-------------------------------------------------
-----------------------0------0------------------
-------------------------------------------------
-------0-----------------------------------------
-------------------------------------------------
-------------------------------------------------
------------------0----------------0-------------
-------------------------------------------------
-------------------------------------------------
----------------------------------------0------0-
-------------------------------------------------
-------------------------------------------------
-------------------------------------------------
-------------------------------------------------
-------------------------------------------------
-------------------------------------------------
-------------------------------------------------
-------0-----------------------------------------
-------------------------------------------------
-------------------------------------------0-----

Generation = 22, Population = 937.
*01-01-0-0-----------0---001-1*-10-1-**.-*.01000-
.--10-1-----0-----------00-01-010--1-1-.-.**1110-
...-1-*-0--0-------0-0-01-0--..1-1.-*...-..----0-
..**.-1-0-----0------001-.1...-*-10-0.1.-...**10-
*-01.*.*1-1--0-----0-10-*.*...-*.*1*.-.*...*..1-*
.-*0.***00--0---0-011---1-1*..0--1--..1-..**-.1**
1--**1..-0--1--0-0---*010.1-....--0.**....---.*.-
**.**1-1------0-000-0-0*1.-...-.0.***.--..-..0-*.
--1-..*.---*-----1-0011.-.*.-...*.-.0-....*..*.*.
.-*.--*10-0-1-001-*0-*0..-.*..-**.**....0*.-*.*.*
.1...-***.1-.--01-01-0111.-....-...-...*.*..***.-
.*..***0*---*0*0*11-0--0--.-.-*11.*...0*.*...*-.*
..*.*-...*--.1*1*00----.0...**....-......**..*1..
.*--.-.0--.1-0--1-1-0-.*.*...1.--***..-..**..-*.1
-.*.*-*..*1..*00--0001...*.*...--*.-***..-1..-.-*
1***11-...**.-1-*-1-1-.-01*10---0-1--...-.*..*-.*
.*...*.-.**..*.*.11-.*0-0.1*-.1...1*****....--**0
.**1...*.*...*-*-1-*.-0--01---*-0.1-.1..11..0*-.-
...-....-*-.--.1-...*-1*--.*--0-1..-****-..*.*0.0
.1.-*.**.1**0.1--1.-..1*--00*1**1-.-.**1*.1.0*1-1
.*..1.*--01-.-*-.-*-..1.1000*1.---01-.-..-*.-.*--
-1*..--*0**-.-.**00.*-**-0--1-*..*.-.*-1-*---.-.-
*.*--1-..--*1---.1*..1..-1*--.01-0-10-*..**-1*11-
*-......--*001.-.-*...1.-**....1.----1*0*****.0.-
1..1*----0---*1-...1*-.-.**.1.*.-10-1.......*--10
**---100--00--0-.1.11*.-1*.-*..---.-1*.---*-11---
-11-001-----0110--.*-*.*1*.-....-1.***010.*.01---
00.-**-110--010-1-.*.*.*.*0....*.*.-*1---*.-.-1*0
**1--0--0---0--1--1-.*.--...*.*..1--....*.*0---*-
---1-010-0000-*--*..*-*..1.-.*-1.-.****-1-1-*.--0
00-00--------10*-..*-.*.-......***.**1.--1..10-1-
0--110--11--1-0..-*.*..1.....*0*.*.-.*---....1.--
0-1---------00*-1-..-..-.*...**.-*....---1-.1.--.
-01----0--1--00.1.*.-.-***--1-.-1*..*--*.-*..---*
0-0---0-0-----1---*-*.***--***.*-*1---*.-**..10**
------------0----.0.1-0*.*-.-*-*.*.*..*.**.1-..0.
0-----0-0-0--0---1-*.*-0*..**..1*-.-..0*-*.****.-
-0-----0-----00--0--01*.--**-1..--.-.-.**.-..-*..
--------0---0--0--01---111.1*0*1--0*-*0.-..*..--*
---0-0---0-0------00-1*1-..*.*--.*..**-*...*.-1**
------0---0------0--0----*....-1-1-.001.-.*.*.*-*
---0-0---0-0--------00-00-..-.0*1--.00*1**.*.*.1*
0---0---0---------00--01-1-1*01--0-01.1.-.1-0*1*-
-0-----------0--------01-0-.11-*01..*..-.....*-1*
0-----0---------0---0----0-.-11--*0.0-0.**0*--..-
-----0-0-0--------------00-----*.01..-..**--..-.*
--------------0-------0---110*0*0.-*..-.0.-*-*--1
-0-0-0---0-0-0---------001...-..1**.*.0.*-..-*-.1
------------0-----------0----*0.-10***--*..0010--
-0-----0-----0-------0-0-0000*1----1*...***-.1-01

*** Life<Cell> 28x6 ***

Generation = 0, Population = 13.
-0----
----0-
------
-----0
------
------
------
---0--
------
-----0
-0----
------
------
------
------
-0----
--0---
-----0
------
------
------
---0--
---0--
------
------
------
-0----
-----0

Generation = 23, Population = 35.
-..-.*
......
*.-..*
*...*.
.*-***
..*..*
..*...
..1..*
.*..**
...*.*
*.**.*
.....*
.*.0**
.**...
.*.*-.
.*-*..
....--
......
......
1.-..-
....-.
.....-
......
......
......
......
......
.-....

Generation = 46, Population = 7.
-..-..
......
......
......
......
......
**....
*.....
*.*...
.**...
......
......
......
......
....-.
......
....--
......
......
-.-..-
....-.
.....-
......
......
......
......
......
.-....

Generation = 69, Population = 7.
-..-..
......
......
......
......
......
**....
*.....
*.*...
.**...
......
......
......
......
....-.
......
....--
......
......
-.-..-
....-.
.....-
......
......
......
......
......
.-....

Generation = 92, Population = 7.
-..-..
......
......
......
......
......
**....
*.....
*.*...
.**...
......
......
......
......
....-.
......
....--
......
......
-.-..-
....-.
.....-
......
......
......
......
......
.-....

*** Life<Cell> 16x29 ***

Generation = 0, Population = 29.
0----------------0----------0
------------0-----------00---
---------------0-------------
--0-0----0-------------------
-----------------------------
-------------------------0---
---------------0----0--------
-------0----------00---------
-----------------------------
--------------0-----0----0---
-----------------------------
---------0-------------------
--0---0---0---0------0-------
-------0---------------------
-----------------------------
------------0----0----------0

Generation = 10, Population = 185.
--.-*---**1--0-0-1--..*-.-*10
-01-0--*.-1-0-11**11.*.**.**.
.--0.1*--.-.-*---1.-0--*-100-
-01.1..*.--*-0.*0--0-*-1--0--
-0.1*-11-.-*0-*..1-*------1--
-0*1-*-1--10*--11.*11-.-.11-0
*-*-.--10-.--1-111*1--.-*0*-1
1*-....101-1---.--.10---*-.--
*---.11----1-------0.-----1-.
-0.-*00*1*-.--*.*----*..*1.0*
----0----11*-*.----1--*1--0-0
0-.0-1-00-0*.*.*11**1------0-
0-----0----1*-.0--..1.*11.0-0
-00---00--*.*-.*-.0--.11.--.-
0---1--00--*--..-.0-.1-0-.0--
--0---.1...0-11.-*.0111.-----

*** Life<Cell> 24x20 ***

Generation = 0, Population = 14.
-------------0------
--------------------
--------------------
----------0---------
--------------------
-------------------0
--------------------
--------------------
--------------------
--------------------
--------------------
--------------------
-----------------0--
--------------------
------0-----------0-
-------0----0---0---
-----------0--------
----0----0----------
--------------------
0------------------0
--------------------
--------------------
--------------------
--------------------

Generation = 19, Population = 186.
--0--100-.-1.-1**.1.
---*-----.11-..-***.
01-1..*-01.0-.-*1*-*
1-1*-.--.1*.-*1.*.**
---00..--.*-11.**.-*
*0-.*--1-*.*0*-*1**-
.-.*.*.-.*..1*-...**
.--.-.0.-*111*0...-*
---0--.-**-.-*1..1..
****.*1.-*.11..1*.*-
*-..**.**--.-0.**..-
...-.*-*...--.0-..*.
.-.....0-...-...-..*
....*-.1.0...-.*....
.***.*-****1*..*....
*.*...--..-*.*.-1.*.
*...1..-*.*1...11...
*......**-*.-*......
.1.*..*..1..-.1.*.-.
*.*-*...*1.*-.**.*.1
1--*-.*..-0101..1*..
--********-*.*.**.1.
0---.0----..-.--.1*.
-010-...*..**-*-*-..

Generation = 38, Population = 107.
-...-...-....-**....
*.*...-1....****....
*..*.......*.....*..
*.*.........*....*..
.................*..
..........**.......-
.........**...*.....
.-........**..-***-.
...........*..*****.
........*....***..**
...........*-...*.*.
..*...*....**..-**..
..*.........*...**..
.*.*..*.....*....***
.*.*...**...*.......
.*.*.....*****......
.*.*....**.**.......
.**....**...........
*..*....*...-.......
.**-..*.*...........
.....**.*..*..*.....
..***.....*.........
*.....**..*.........
**........*..**.....

Generation = 57, Population = 64.
-*..-...-*..........
*.*...*...*.........
*..*..*.............
.**...**.**.........
........*...........
....................
....................
.-..................
....................
.............**.....
......**.....**.....
....................
..............*..*..
.....***.....***....
....****..*.**.*....
..**....*.*.*...*.*.
..*..*......*.......
........*...*.......
...*....**.**.......
.....**.............
....*..*............
....*...............
........*...........
.....**.*...........

Generation = 76, Population = 58.
-...-.******........
.....*..*..*........
.....**.............
....................
....................
....................
....................
.-............*.....
.............*.*....
...............*....
............*..*....
...............*....
............**.*.*..
..............*.....
...**......*......*.
...***.***..*.......
.......**.***..***..
....................
....................
.......*.**.........
.......*.***........
.......*....**......
........*...**......
.........*.**.......

Generation = 95, Population = 52.
-...-.******........
.....*..*..*........
.....**.............
....................
.............*......
............***.....
...........**..*....
.-.........**.**....
..............***...
............*.**....
...........*..*.....
..............*.....
...........*.*......
............*.......
........**..........
.......*..*.........
........*.*.........
.........*....*.....
..............*.....
..............*.....
...........*.....*..
...........*.*.*.*..
...........*.....*..
....................

*** Life<Cell> 50x19 ***

Generation = 0, Population = 13.
-------------------
-------------------
-------0-----------
-----0-------------
-------------------
-------------------
------------------0
-----------0-------
0------------------
-------------------
-------------------
-------------------
-------------------
-------------------
-------------------
-------------------
-------------------
-------------------
-------------------
-------------------
-------------------
-------------------
-------------------
-------------------
-------------------
-------------------
-------------------
----00-------------
-------------------
0------------------
-------------------
------------0------
-------------------
-------------------
-------------------
-------------------
---------0---------
-------------------
-------------------
-------------------
-------------------
-----------0-------
-------------0-----
-------------------
---------0---------
-------------------
-------------------
-------------------
-------------------
-------------------

Generation = 140, Population = 56.
............**.....
.........**...*.**.
.......**.***.*.**.
.......****.*.*...*
......***......**.*
.......*........**.
...................
...................
...................
...................
...................
...*...............
...*...............
...*.........*.....
............*.*....
...........*..*....
............**.....
...................
...................
...................
...................
...................
...................
...................
...................
...................
...................
...................
...................
...............**.-
...............**..
...................
...*...**..........
...*...**..........
...*...............
...................
...................
...................
...................
...................
........**.........
........**.........
...................
...................
...................
..-................
...................
...................
...-...............
............-......

*** Life<Cell> 33x39 ***

Generation = 0, Population = 18.
---------------------------------------
---------------------------------------
---------------------------------------
---------------------------------------
---------------------------------------
---------------------------------------
---------------------------------------
------0--------------------------------
-------------------------0-------------
------------------0---------0----------
---------------------------------------
---------------------------------------
---------------------------------------
---------------------------------------
---------------------------------------
----------------------------0----------
----------------------------------0----
-------------0-------------------------
----------------0----------------------
---------------------------------------
---------------------------------------
---------------------------------------
---------------------------------------
----------------------------------0----
------------------0--------------------
--------------------------------0------
-----0---------------------------------
--------------------------------------0
-------------------------------0-0-----
---------0-----------------0-----------
----------------------------------0----
---------------------------------------
---------------------------------------

Generation = 16, Population = 368.
----------------------------------1----
-------------0-------------------------
----------------0----------------------
---------------------------------------
-------------1--.---------------.--.---
------------.11---1---------0-----.----
-----------11--0---------0------1..1---
------0-*-*--.-111----0--------0----.--
---------11-1.00*10-.----------**-.***1
--0-----*1*...*-.*-*----------.0-1.0-0.
-----1----00*--1.*-1*----------1-..---1
-----.-----0.*10--00*1----1---1-11.-.0-
-----.------001-*--*000----.-110-..0*--
----1*1--0------*0101*101-.0--.-11-1-0-
---*-*-1*---0--0-1.1.-01...-0*--.0.*.0-
-----.-1.1--*----.-1-*.1.*01.-.-*1.-*-*
-*-0-*-*.*-----0.1.01-0*-*...-*..**-*00
-1-*0-.--0-----1-.*1-1-*.--0.0-1*-...-1
0-1.*-..010-----0-*--1---..-0--..*.---*
--011.*--*0------0*-**----1**--.*-.-.-.
---1-------0------.-0--.-*-*-.1.-..*.*-
------0-1.100----------.-1.1*----.**--*
-----0*--.-*.-1-------1-...*-101-*.-.0.
----*11--.--1.----*-0.---1...*0*-1*.10*
-11---..-.-..-*1-----.-1.-...*.*.-.-0.*
-..-1-*.-.-.1.---1.*-0--0*.*.1.**-*-..*
-*.0.-.*.*-....---1--*--.--**11*1.*.-*1
0.11-.**-*-0*.----01---0-*0***..1*.**1*
1.--0.-0-.00-.10--..0.1...-.***--.**.1*
-..*....-.*0-.1*--11-*0-....-*******.*.
1-*-...1-*--*11---1.0*.*.1...*...**--..
--**0.0*-010-.-------0---1-.-*-..-0*.1.
011--.0-*1---.--0-----*-**---....****-.

Generation = 32, Population = 386.
-1---1---1..-..1--*.*-.*....**.*.*..000
-.........*.-.1*1**...1.-000.-*.1.*.-.1
---*--*...*....**-*-.-**.-1-***.-.1.*--
-*-.1...........1..--.-.-0*.*..*.1--**-
1--.-..*.**.......-.1....0-*.1....*.**.
..-.-.0-*...*.......-*1-0-.-1**-.1*.-.*
-**-*..*1.1.*...-.*-.-**.*..*.....**...
0-*....*....*.....1.-..*.**....***..**.
.****.*.-..-......***1........**.......
-*-.**.*......*...*....*.....1.......*.
*.1.*....--..*..*..*..*.1.-1.1**....*.*
*0..-....-..**.*.0...-*...**..*....*..*
-*..*.**...-.**.**....*..*.*.*....**..*
....**...*..1...**..*.*..*..**.....**.*
..-.***..*-**-****....*.**.*..-..-.**.*
*....**...*..*...*........-.*........**
*........*...0....*..-.**..............
....--.-.....-......0*-....-*.*........
.......***.*...0.....***....**.**......
*..**.**...**...**..*..***..*...**.....
0.....*0.*..*-***...*...0.1...*...*....
-..*1......*..*-.....-..*.**.....***.-.
...-.**..**.......**..1.*..*.....*.***.
.......***.........*...**.............*
*..*..**-**.......*-*.*..**....*......*
0**1**..**..........*.*.......*........
-....-..........1.*****....*...........
**.**...*.*...-...***.....*....*..*....
**.*..-.*...*.......***.........***....
.*.*.*.......*..1-....*...........*....
***.******.**.-.......**...........**..
.***........*...-*..1**-*.....-..-**.*.
.*-***...***-.-..*...***....-......***.

*** Life<Cell> 27x13 ***

Generation = 0, Population = 13.
-----0-------
-------------
0-0----0-----
-------------
-------------
-------------
-----------0-
-------------
-------------
----------0--
-------------
-----0-------
-------0-----
-------------
-------------
-------------
-------------
---0---------
---------0---
-------------
---------0---
-----------0-
-------------
-------------
-------------
--0----------
-------------

Generation = 158, Population = 17.
.............
.............
.............
.**..........
.**........**
...........**
.............
.............
.............
.............
.............
.........*...
.........*...
.**......*...
*..*.........
.**..........
.............
.............
.............
.............
.............
.............
.............
..........-..
.............
.............
....-......-.

*** Life<Cell> 10x19 ***

Generation = 0, Population = 14.
----0--------------
--00---------------
-------------------
--------------0----
---0----0----------
-0-----------------
-----------0-------
---0---0-------0---
----------0-0------
----0--------------

Generation = 42, Population = 28.
.....****..........
........***.....**.
.....*...**.****.**
.....*.*.....*****.
......**...........
...................
...................
...................
-..................
1....-.......-.-...

Generation = 84, Population = 4.
...................
...................
............***....
...................
...................
...................
...................
...................
-..................
1....-.......-.-...

*** Life<Cell> 43x4 ***

Generation = 0, Population = 17.
----
----
----
----
0---
----
----
-0--
----
----
----
----
-0--
-0--
--0-
----
----
---0
----
----
---0
----
--0-
---0
-0--
-0--
----
----
----
----
----
----
----
----
----
----
---0
----
---0
-0--
-00-
----
-0--

Generation = 129, Population = 7.
....
....
....
....
....
....
....
...-
....
...-
..-.
...-
...1
-...
....
.**.
*..*
.**.
....
....
-...
....
....
....
....
....
....
-.-.
....
....
...-
....
....
....
....
..-.
....
....
....
....
....
....
--..
