20

48 17
18
13 5
37 6
14 14
13 10
30 14
13 9
30 1
0 1
5 6
39 13
30 7
40 8
20 0
31 11
35 16
46 2
40 15
46 14
133 15

42 1
15
32 0
31 0
39 0
30 0
13 0
1 0
7 0
16 0
3 0
4 0
8 0
17 0
29 0
8 0
8 0
131 84

39 37
24
5 15
0 35
27 26
13 6
16 13
8 26
23 2
34 22
35 21
10 14
7 2
7 27
34 20
31 22
17 12
4 36
24 21
11 7
21 32
35 15
12 36
29 14
5 12
29 1
178 88

8 41
28
1 15
4 10
0 5
2 1
5 4
5 11
5 4
4 21
4 29
7 12
1 37
2 22
7 31
6 1
3 28
6 33
3 17
3 11
5 31
2 21
7 2
1 16
7 18
1 18
1 2
1 39
4 11
0 26
161 132

47 8
20
27 1
32 6
33 3
10 2
8 5
32 5
9 1
19 5
19 4
12 7
2 7
31 3
11 5
24 2
46 5
13 1
29 4
36 3
25 4
12 7
26 13

23 26
22
16 3
1 10
1 21
9 10
8 15
12 24
9 8
15 5
9 7
18 14
8 2
8 17
9 18
22 14
2 4
2 25
9 11
21 16
0 14
10 23
9 20
12 20
114 38

46 40
21
43 33
16 28
37 28
43 29
28 25
30 23
21 27
12 19
39 33
24 9
13 25
9 39
12 37
18 32
19 28
24 9
12 28
29 21
15 8
2 32
5 27
26 11

27 42
26
3 40
9 35
14 26
17 36
16 8
0 22
2 9
7 40
18 31
6 1
0 37
15 12
14 17
23 20
11 37
1 22
21 32
8 23
18 32
13 22
0 12
11 17
21 35
3 19
5 8
10 15
152 12

8 34
19
7 20
5 33
2 12
7 1
7 18
1 30
4 11
4 33
2 7
5 2
7 2
3 14
5 11
0 18
7 21
5 3
6 25
3 12
2 2
179 71

40 39
16
26 12
39 13
37 18
11 3
25 7
22 22
15 24
24 15
11 31
34 18
17 4
26 37
13 32
14 7
17 21
15 22
34 33

43 13
19
25 9
31 4
37 12
33 9
5 5
14 0
40 12
9 12
37 3
1 7
6 10
36 4
38 9
36 11
8 11
42 1
23 4
11 7
16 7
194 175

49 38
24
18 9
35 35
38 35
6 24
28 25
14 35
45 10
34 25
33 24
8 17
3 9
16 24
10 21
9 3
12 24
12 11
6 3
36 24
34 15
6 31
39 36
44 29
48 36
42 1
139 40

4 3
21
3 1
0 1
3 0
1 1
1 0
1 2
0 2
1 0
0 1
0 0
1 1
3 2
1 1
0 2
3 2
2 2
1 2
2 2
1 0
2 1
1 2
16 10

13 12
22
6 0
1 1
3 6
12 0
9 0
0 8
10 11
10 8
8 5
4 4
1 3
2 5
6 4
9 3
0 1
11 10
12 10
12 0
3 4
3 3
5 7
12 1
51 13

8 36
25
1 33
2 27
6 33
1 2
3 20
3 10
7 17
3 2
5 16
3 8
4 9
1 29
6 30
6 13
3 17
0 21
5 32
5 13
3 21
0 29
2 21
0 3
5 31
0 2
7 0
149 69

11 35
19
10 5
7 32
1 28
9 6
9 5
0 30
8 10
8 13
2 14
6 32
8 33
8 17
10 6
1 13
3 10
3 15
1 3
10 17
5 24
98 11

15 18
13
7 4
1 10
0 3
8 0
1 0
6 0
1 14
7 10
8 9
13 17
8 16
0 17
7 9
103 85

10 41
23
0 18
9 19
7 27
5 13
0 8
4 19
2 30
1 26
2 9
5 37
2 9
8 25
9 31
8 19
9 17
7 1
6 23
4 33
6 38
6 27
8 32
7 8
0 11
116 22

35 14
16
18 7
30 4
29 6
9 12
0 11
15 9
22 2
3 12
4 4
11 0
25 10
12 9
4 9
17 11
4 12
21 3
173 37

32 42
14
12 39
25 5
14 21
18 7
26 6
2 10
29 28
19 7
19 33
5 5
25 37
5 31
31 39
5 21
64 63
