{
  "users": {
    "alice": {
      "roles": ["admin"],
      "location": {
        "country": "US",
        "ip": "8.8.8.8"
      }
    },
    "carol": {
      "roles": ["employee", "billing"],
      "location": {
        "country": "US",
        "ip": "8.8.8.8"
      }
    },
     "sunil": {
      "roles": ["guest"],
      "location": {
        "country": "US",
        "ip": "8.8.8.8"
      }
    },
    "eve": {
      "roles": ["customer"],
      "location": {
        "country": "US",
        "ip": "8.8.8.8"
      }
    }
  },
  "role_permissions": {
    "customer": [
      {
        "action": "read",
        "type": "dog"
      },
      {
        "action": "read",
        "type": "cat"
      },
      {
        "action": "adopt",
        "type": "dog"
      },
      {
        "action": "adopt",
        "type": "cat"
      }
    ],
    "employee": [
      {
        "action": "read",
        "type": "dog"
      },
      {
        "action": "read",
        "type": "cat"
      },
      {
        "action": "update",
        "type": "dog"
      },
      {
        "action": "update",
        "type": "cat"
      }
    ],
    "billing": [
      {
        "action": "read",
        "type": "finance"
      },
      {
        "action": "update",
        "type": "finance"
      }
    ],
    "guest": [
     {
       "action": "read",
       "type": "cat"
     },
     {
       "action": "read",
       "type": "finance"
     }
    ]
  }
}
