,BLOCK_ID,DATA_DATETIME,GHI,WIND_SPEED,DNI,DHI,TEMPERATURE,ZENITH,AZIMUTH,CLOUD_OPACITY,ENTRY_TIME
0,1,2019-05-26 00:00:00,0,3.4,0,0,27.6,158,-11,0.0,2019-05-25 20:00:00.000
1,2,2019-05-26 00:15:00,0,3.5,0,0,27.6,157,-20,0.0,2019-05-25 20:15:00.000
2,3,2019-05-26 00:30:00,0,3.5,0,0,27.5,156,-28,0.0,2019-05-25 20:30:00.000
3,4,2019-05-26 00:45:00,0,3.6,0,0,27.4,154,-35,0.0,2019-05-25 20:45:00.000
4,5,2019-05-26 01:00:00,0,3.7,0,0,27.4,151,-41,0.0,2019-05-25 21:00:00.000
5,6,2019-05-26 01:15:00,0,3.7,0,0,27.3,149,-45,0.0,2019-05-25 21:15:00.000
6,7,2019-05-26 01:30:00,0,3.8,0,0,27.2,146,-49,0.0,2019-05-25 21:30:00.000
7,8,2019-05-26 01:45:00,0,3.8,0,0,27.2,143,-53,0.0,2019-05-25 21:45:00.000
8,9,2019-05-26 02:00:00,0,3.9,0,0,27.1,140,-56,0.0,2019-05-25 22:00:00.000
9,10,2019-05-26 02:15:00,0,4.0,0,0,27.0,137,-58,0.0,2019-05-25 22:15:00.000
10,11,2019-05-26 02:30:00,0,4.0,0,0,26.9,134,-60,0.0,2019-05-25 22:30:00.000
11,12,2019-05-26 02:45:00,0,4.1,0,0,26.8,130,-62,0.0,2019-05-25 22:45:00.000
12,13,2019-05-26 03:00:00,0,4.2,0,0,26.8,127,-63,0.0,2019-05-25 23:00:00.000
13,14,2019-05-26 03:15:00,0,4.2,0,0,26.7,124,-64,0.0,2019-05-25 23:15:00.000
14,15,2019-05-26 03:30:00,0,4.3,0,0,26.6,120,-65,0.0,2019-05-25 23:30:00.000
15,16,2019-05-26 03:45:00,0,4.4,0,0,26.5,117,-66,0.0,2019-05-25 23:45:00.000
16,17,2019-05-26 04:00:00,0,4.4,0,0,26.4,114,-67,0.0,2019-05-26 00:00:00.000
17,18,2019-05-26 04:15:00,0,4.5,0,0,26.3,110,-68,0.0,2019-05-26 00:15:00.000
18,19,2019-05-26 04:30:00,0,4.5,0,0,26.3,107,-68,0.0,2019-05-26 00:30:00.000
19,20,2019-05-26 04:45:00,0,4.6,0,0,26.2,103,-68,0.0,2019-05-26 00:45:00.000
20,21,2019-05-26 05:00:00,0,4.7,0,0,26.1,100,-69,0.0,2019-05-26 01:00:00.000
21,22,2019-05-26 05:15:00,0,4.6,0,0,26.2,96,-69,0.0,2019-05-26 01:15:00.000
22,23,2019-05-26 05:30:00,0,4.6,0,0,26.3,93,-69,0.0,2019-05-26 01:30:00.000
23,24,2019-05-26 05:45:00,6,4.6,17,5,26.4,89,-69,0.0,2019-05-26 01:45:00.000
24,25,2019-05-26 06:00:00,39,4.6,175,23,26.6,86,-69,0.0,2019-05-26 02:00:00.000
25,26,2019-05-26 06:15:00,82,4.6,309,39,26.7,82,-69,0.9,2019-05-26 02:15:00.000
26,27,2019-05-26 06:30:00,134,4.6,426,50,26.8,79,-69,0.0,2019-05-26 02:30:00.000
27,28,2019-05-26 06:45:00,189,4.5,505,59,26.9,75,-69,0.0,2019-05-26 02:45:00.000
28,29,2019-05-26 07:00:00,246,4.5,567,67,27.0,72,-68,0.0,2019-05-26 03:00:00.000
29,30,2019-05-26 07:15:00,303,4.5,617,73,27.1,68,-68,0.0,2019-05-26 03:15:00.000
30,31,2019-05-26 07:30:00,360,4.5,658,79,27.2,65,-67,0.0,2019-05-26 03:30:00.000
31,32,2019-05-26 07:45:00,347,4.5,296,204,27.3,61,-66,16.7,2019-05-26 03:45:00.000
32,33,2019-05-26 08:00:00,386,4.5,286,234,27.4,58,-66,18.0,2019-05-26 04:00:00.000
33,34,2019-05-26 08:15:00,480,4.4,522,174,27.4,54,-65,8.6,2019-05-26 04:15:00.000
34,35,2019-05-26 08:30:00,574,4.3,762,95,27.4,51,-63,0.0,2019-05-26 04:30:00.000
35,36,2019-05-26 08:45:00,622,4.2,779,98,27.5,48,-62,0.0,2019-05-26 04:45:00.000
36,37,2019-05-26 09:00:00,668,4.1,794,101,27.5,44,-60,0.0,2019-05-26 05:00:00.000
37,38,2019-05-26 09:15:00,710,4.0,806,104,27.5,41,-58,0.0,2019-05-26 05:15:00.000
38,39,2019-05-26 09:30:00,749,3.9,816,106,27.5,38,-56,0.0,2019-05-26 05:30:00.000
39,40,2019-05-26 09:45:00,784,3.9,825,108,27.5,35,-53,0.0,2019-05-26 05:45:00.000
40,41,2019-05-26 10:00:00,809,3.8,810,123,27.5,32,-49,0.7,2019-05-26 06:00:00.000
41,42,2019-05-26 10:15:00,760,3.7,560,272,27.6,29,-45,9.8,2019-05-26 06:15:00.000
42,43,2019-05-26 10:30:00,686,3.6,297,421,27.6,27,-40,20.8,2019-05-26 06:30:00.000
43,44,2019-05-26 10:45:00,632,3.5,144,501,27.6,25,-34,28.6,2019-05-26 06:45:00.000
44,45,2019-05-26 11:00:00,805,3.4,572,276,27.6,23,-26,10.6,2019-05-26 07:00:00.000
45,46,2019-05-26 11:15:00,793,3.4,487,339,27.6,21,-18,12.8,2019-05-26 07:15:00.000
46,47,2019-05-26 11:30:00,785,3.3,452,362,27.6,20,-8,14.2,2019-05-26 07:30:00.000
47,48,2019-05-26 11:45:00,854,3.3,654,241,27.6,20,2,6.8,2019-05-26 07:45:00.000
48,49,2019-05-26 12:00:00,914,3.3,850,118,27.6,21,12,0.0,2019-05-26 08:00:00.000
49,50,2019-05-26 12:15:00,906,3.2,849,118,27.6,22,21,0.0,2019-05-26 08:15:00.000
50,51,2019-05-26 12:30:00,894,3.2,847,117,27.5,23,29,0.0,2019-05-26 08:30:00.000
51,52,2019-05-26 12:45:00,818,3.1,643,237,27.5,25,36,6.8,2019-05-26 08:45:00.000
52,53,2019-05-26 13:00:00,805,3.1,661,221,27.5,28,42,6.0,2019-05-26 09:00:00.000
53,54,2019-05-26 13:15:00,832,3.0,834,113,27.5,30,47,0.0,2019-05-26 09:15:00.000
54,55,2019-05-26 13:30:00,803,3.0,827,111,27.5,33,51,0.0,2019-05-26 09:30:00.000
55,56,2019-05-26 13:45:00,771,2.9,819,109,27.5,36,54,0.0,2019-05-26 09:45:00.000
56,57,2019-05-26 14:00:00,734,2.9,810,107,27.5,39,57,0.0,2019-05-26 10:00:00.000
57,58,2019-05-26 14:15:00,694,2.9,799,104,27.5,42,59,0.0,2019-05-26 10:15:00.000
58,59,2019-05-26 14:30:00,651,2.9,786,101,27.4,46,61,0.0,2019-05-26 10:30:00.000
59,60,2019-05-26 14:45:00,605,2.9,772,98,27.4,49,62,0.0,2019-05-26 10:45:00.000
60,61,2019-05-26 15:00:00,556,2.9,755,94,27.4,52,64,0.0,2019-05-26 11:00:00.000
61,62,2019-05-26 15:15:00,504,2.9,735,90,27.4,56,65,0.0,2019-05-26 11:15:00.000
62,63,2019-05-26 15:30:00,451,2.9,711,86,27.3,59,66,0.0,2019-05-26 11:30:00.000
63,64,2019-05-26 15:45:00,389,2.9,639,93,27.3,63,67,1.8,2019-05-26 11:45:00.000
64,65,2019-05-26 16:00:00,335,2.9,620,83,27.3,66,67,1.2,2019-05-26 12:00:00.000
65,66,2019-05-26 16:15:00,276,2.9,552,81,27.3,69,68,2.5,2019-05-26 12:15:00.000
66,67,2019-05-26 16:30:00,209,2.9,393,93,27.2,73,68,7.5,2019-05-26 12:30:00.000
67,68,2019-05-26 16:45:00,132,2.9,87,110,27.2,76,69,23.0,2019-05-26 12:45:00.000
68,69,2019-05-26 17:00:00,95,2.9,108,76,27.2,80,69,18.4,2019-05-26 13:00:00.000
69,70,2019-05-26 17:15:00,48,2.8,0,48,27.1,83,69,28.3,2019-05-26 13:15:00.000
70,71,2019-05-26 17:30:00,24,2.8,60,18,27.1,87,69,5.6,2019-05-26 13:30:00.000
71,72,2019-05-26 17:45:00,1,2.7,1,1,27.0,90,69,0.0,2019-05-26 13:45:00.000
72,73,2019-05-26 18:00:00,0,2.7,0,0,26.9,94,69,0.0,2019-05-26 14:00:00.000
73,74,2019-05-26 18:15:00,0,2.6,0,0,26.9,97,69,0.0,2019-05-26 14:15:00.000
74,75,2019-05-26 18:30:00,0,2.6,0,0,26.8,101,69,0.0,2019-05-26 14:30:00.000
75,76,2019-05-26 18:45:00,0,2.5,0,0,26.7,104,68,0.0,2019-05-26 14:45:00.000
76,77,2019-05-26 19:00:00,0,2.5,0,0,26.7,108,68,0.0,2019-05-26 15:00:00.000
77,78,2019-05-26 19:15:00,0,2.4,0,0,26.6,111,67,0.0,2019-05-26 15:15:00.000
78,79,2019-05-26 19:30:00,0,2.4,0,0,26.5,115,67,0.0,2019-05-26 15:30:00.000
79,80,2019-05-26 19:45:00,0,2.3,0,0,26.5,118,66,0.0,2019-05-26 15:45:00.000
80,81,2019-05-26 20:00:00,0,2.3,0,0,26.4,122,65,0.0,2019-05-26 16:00:00.000
81,82,2019-05-26 20:15:00,0,2.3,0,0,26.5,125,64,0.0,2019-05-26 16:15:00.000
82,83,2019-05-26 20:30:00,0,2.3,0,0,26.5,128,62,0.0,2019-05-26 16:30:00.000
83,84,2019-05-26 20:45:00,0,2.3,0,0,26.6,132,61,0.0,2019-05-26 16:45:00.000
84,85,2019-05-26 21:00:00,0,2.4,0,0,26.7,135,59,0.0,2019-05-26 17:00:00.000
85,86,2019-05-26 21:15:00,0,2.4,0,0,26.7,138,57,0.0,2019-05-26 17:15:00.000
86,87,2019-05-26 21:30:00,0,2.4,0,0,26.8,141,54,0.0,2019-05-26 17:30:00.000
87,88,2019-05-26 21:45:00,0,2.5,0,0,26.9,144,51,0.0,2019-05-26 17:45:00.000
88,89,2019-05-26 22:00:00,0,2.5,0,0,26.9,147,48,0.0,2019-05-26 18:00:00.000
89,90,2019-05-26 22:15:00,0,2.5,0,0,27.0,150,43,0.0,2019-05-26 18:15:00.000
90,91,2019-05-26 22:30:00,0,2.6,0,0,27.1,152,38,0.0,2019-05-26 18:30:00.000
91,92,2019-05-26 22:45:00,0,2.6,0,0,27.1,154,32,0.0,2019-05-26 18:45:00.000
92,93,2019-05-26 23:00:00,0,2.7,0,0,27.2,156,25,0.0,2019-05-26 19:00:00.000
93,94,2019-05-26 23:15:00,0,2.7,0,0,27.1,157,17,0.0,2019-05-26 19:15:00.000
94,95,2019-05-26 23:30:00,0,2.7,0,0,27.0,158,8,0.0,2019-05-26 19:30:00.000
95,96,2019-05-26 23:45:00,0,2.7,0,0,26.9,158,-2,0.0,2019-05-26 19:45:00.000
