,BLOCK_ID,DATA_DATETIME,GHI,WIND_SPEED,DNI,DHI,TEMPERATURE,ZENITH,AZIMUTH,CLOUD_OPACITY,ENTRY_TIME
0,1,2019-08-28 00:00:00,0,2.9,0,0,22.7,168,-15,0.0,2019-08-27 20:00:00.000
1,2,2019-08-28 00:15:00,0,2.9,0,0,22.7,167,-31,0.0,2019-08-27 20:15:00.000
2,3,2019-08-28 00:30:00,0,2.9,0,0,22.6,165,-43,0.0,2019-08-27 20:30:00.000
3,4,2019-08-28 00:45:00,0,2.8,0,0,22.6,162,-52,0.0,2019-08-27 20:45:00.000
4,5,2019-08-28 01:00:00,0,2.8,0,0,22.5,159,-58,0.0,2019-08-27 21:00:00.000
5,6,2019-08-28 01:15:00,0,2.8,0,0,22.5,156,-62,0.0,2019-08-27 21:15:00.000
6,7,2019-08-28 01:30:00,0,2.7,0,0,22.5,152,-66,0.0,2019-08-27 21:30:00.000
7,8,2019-08-28 01:45:00,0,2.7,0,0,22.4,149,-68,0.0,2019-08-27 21:45:00.000
8,9,2019-08-28 02:00:00,0,2.6,0,0,22.4,145,-71,0.0,2019-08-27 22:00:00.000
9,10,2019-08-28 02:15:00,0,2.6,0,0,22.4,142,-72,0.0,2019-08-27 22:15:00.000
10,11,2019-08-28 02:30:00,0,2.6,0,0,22.4,138,-74,0.0,2019-08-27 22:30:00.000
11,12,2019-08-28 02:45:00,0,2.6,0,0,22.3,135,-75,0.0,2019-08-27 22:45:00.000
12,13,2019-08-28 03:00:00,0,2.6,0,0,22.3,131,-76,0.0,2019-08-27 23:00:00.000
13,14,2019-08-28 03:15:00,0,2.6,0,0,22.3,127,-76,0.0,2019-08-27 23:15:00.000
14,15,2019-08-28 03:30:00,0,2.6,0,0,22.3,124,-77,0.0,2019-08-27 23:30:00.000
15,16,2019-08-28 03:45:00,0,2.7,0,0,22.3,120,-78,0.0,2019-08-27 23:45:00.000
16,17,2019-08-28 04:00:00,0,2.7,0,0,22.3,116,-78,0.0,2019-08-28 00:00:00.000
17,18,2019-08-28 04:15:00,0,2.7,0,0,22.3,113,-78,0.0,2019-08-28 00:15:00.000
18,19,2019-08-28 04:30:00,0,2.8,0,0,22.4,109,-79,0.0,2019-08-28 00:30:00.000
19,20,2019-08-28 04:45:00,0,2.9,0,0,22.4,105,-79,0.0,2019-08-28 00:45:00.000
20,21,2019-08-28 05:00:00,0,2.9,0,0,22.4,102,-79,0.0,2019-08-28 01:00:00.000
21,22,2019-08-28 05:15:00,0,3.0,0,0,22.4,98,-79,0.0,2019-08-28 01:15:00.000
22,23,2019-08-28 05:30:00,0,3.0,0,0,22.4,94,-80,0.0,2019-08-28 01:30:00.000
23,24,2019-08-28 05:45:00,2,3.0,4,2,22.4,91,-80,0.0,2019-08-28 01:45:00.000
24,25,2019-08-28 06:00:00,26,3.1,98,18,22.5,87,-80,0.0,2019-08-28 02:00:00.000
25,26,2019-08-28 06:15:00,66,3.2,216,41,22.8,83,-80,4.6,2019-08-28 02:15:00.000
26,27,2019-08-28 06:30:00,106,3.3,177,74,23.2,79,-80,13.2,2019-08-28 02:30:00.000
27,28,2019-08-28 06:45:00,155,3.4,221,99,23.6,76,-79,14.3,2019-08-28 02:45:00.000
28,29,2019-08-28 07:00:00,210,3.6,300,119,24.0,72,-79,12.2,2019-08-28 03:00:00.000
29,30,2019-08-28 07:15:00,236,3.7,167,175,24.5,68,-79,21.3,2019-08-28 03:15:00.000
30,31,2019-08-28 07:30:00,257,3.8,62,230,25.0,65,-79,29.0,2019-08-28 03:30:00.000
31,32,2019-08-28 07:45:00,323,3.9,169,240,25.4,61,-79,23.7,2019-08-28 03:45:00.000
32,33,2019-08-28 08:00:00,348,3.9,115,287,25.8,57,-78,27.7,2019-08-28 04:00:00.000
33,34,2019-08-28 08:15:00,362,4.0,64,322,26.0,54,-78,33.1,2019-08-28 04:15:00.000
34,35,2019-08-28 08:30:00,423,4.0,112,352,26.1,50,-77,28.8,2019-08-28 04:30:00.000
35,36,2019-08-28 08:45:00,411,4.0,60,368,26.3,46,-76,36.7,2019-08-28 04:45:00.000
36,37,2019-08-28 09:00:00,445,4.0,40,417,26.5,43,-75,36.0,2019-08-28 05:00:00.000
37,38,2019-08-28 09:15:00,500,4.2,65,450,26.9,39,-74,32.7,2019-08-28 05:15:00.000
38,39,2019-08-28 09:30:00,522,4.3,55,478,27.3,35,-73,33.5,2019-08-28 05:30:00.000
39,40,2019-08-28 09:45:00,622,4.4,219,435,27.7,32,-71,24.6,2019-08-28 05:45:00.000
40,41,2019-08-28 10:00:00,644,4.6,212,458,28.1,28,-69,25.2,2019-08-28 06:00:00.000
41,42,2019-08-28 10:15:00,499,4.6,0,499,28.4,25,-66,44.1,2019-08-28 06:15:00.000
42,43,2019-08-28 10:30:00,658,4.7,184,487,28.6,22,-63,28.3,2019-08-28 06:30:00.000
43,44,2019-08-28 10:45:00,735,4.8,285,464,28.9,18,-57,21.8,2019-08-28 06:45:00.000
44,45,2019-08-28 11:00:00,780,4.9,359,434,29.1,15,-50,18.5,2019-08-28 07:00:00.000
45,46,2019-08-28 11:15:00,824,4.9,442,392,29.2,13,-39,15.0,2019-08-28 07:15:00.000
46,47,2019-08-28 11:30:00,854,4.8,504,359,29.3,11,-24,12.5,2019-08-28 07:30:00.000
47,48,2019-08-28 11:45:00,918,4.8,675,252,29.4,10,-3,6.3,2019-08-28 07:45:00.000
48,49,2019-08-28 12:00:00,915,4.8,669,256,29.5,10,18,6.5,2019-08-28 08:00:00.000
49,50,2019-08-28 12:15:00,816,4.8,411,413,29.5,12,35,16.1,2019-08-28 08:15:00.000
50,51,2019-08-28 12:30:00,778,4.8,342,447,29.6,14,47,19.0,2019-08-28 08:30:00.000
51,52,2019-08-28 12:45:00,753,4.7,309,458,29.7,17,55,20.3,2019-08-28 08:45:00.000
52,53,2019-08-28 13:00:00,728,4.7,286,460,29.7,20,61,21.3,2019-08-28 09:00:00.000
53,54,2019-08-28 13:15:00,812,4.5,563,297,29.7,24,65,9.6,2019-08-28 09:15:00.000
54,55,2019-08-28 13:30:00,835,4.3,725,191,29.6,27,68,3.6,2019-08-28 09:30:00.000
55,56,2019-08-28 13:45:00,659,4.2,280,418,29.6,31,71,20.9,2019-08-28 09:45:00.000
56,57,2019-08-28 14:00:00,613,4.1,234,419,29.6,34,73,22.9,2019-08-28 10:00:00.000
57,58,2019-08-28 14:15:00,585,4.1,242,394,29.5,38,74,22.4,2019-08-28 10:15:00.000
58,59,2019-08-28 14:30:00,475,4.2,49,437,29.4,42,75,33.1,2019-08-28 10:30:00.000
59,60,2019-08-28 14:45:00,397,4.3,9,391,29.3,45,76,39.9,2019-08-28 10:45:00.000
60,61,2019-08-28 15:00:00,348,4.3,6,344,29.2,49,77,42.9,2019-08-28 11:00:00.000
61,62,2019-08-28 15:15:00,370,4.4,55,338,29.0,53,78,33.1,2019-08-28 11:15:00.000
62,63,2019-08-28 15:30:00,341,4.5,47,314,28.8,56,78,31.6,2019-08-28 11:30:00.000
63,64,2019-08-28 15:45:00,262,4.6,0,262,28.6,60,79,40.3,2019-08-28 11:45:00.000
64,65,2019-08-28 16:00:00,222,4.6,0,222,28.3,64,79,41.7,2019-08-28 12:00:00.000
65,66,2019-08-28 16:15:00,180,4.6,0,180,28.0,67,79,43.2,2019-08-28 12:15:00.000
66,67,2019-08-28 16:30:00,220,4.6,273,133,27.6,71,79,14.2,2019-08-28 12:30:00.000
67,68,2019-08-28 16:45:00,188,4.6,401,82,27.3,75,80,4.6,2019-08-28 12:45:00.000
68,69,2019-08-28 17:00:00,128,4.5,271,72,26.9,78,80,8.0,2019-08-28 13:00:00.000
69,70,2019-08-28 17:15:00,75,4.3,125,56,26.4,82,80,12.4,2019-08-28 13:15:00.000
70,71,2019-08-28 17:30:00,35,4.1,92,27,25.9,86,80,3.8,2019-08-28 13:30:00.000
71,72,2019-08-28 17:45:00,6,3.9,10,6,25.5,89,80,0.0,2019-08-28 13:45:00.000
72,73,2019-08-28 18:00:00,0,3.7,0,0,25.1,93,80,0.0,2019-08-28 14:00:00.000
73,74,2019-08-28 18:15:00,0,3.7,0,0,24.8,97,80,0.0,2019-08-28 14:15:00.000
74,75,2019-08-28 18:30:00,0,3.6,0,0,24.6,100,80,0.0,2019-08-28 14:30:00.000
75,76,2019-08-28 18:45:00,0,3.5,0,0,24.3,104,79,0.0,2019-08-28 14:45:00.000
76,77,2019-08-28 19:00:00,0,3.5,0,0,24.1,108,79,0.0,2019-08-28 15:00:00.000
77,78,2019-08-28 19:15:00,0,3.4,0,0,24.0,111,79,0.0,2019-08-28 15:15:00.000
78,79,2019-08-28 19:30:00,0,3.3,0,0,23.8,115,78,0.0,2019-08-28 15:30:00.000
79,80,2019-08-28 19:45:00,0,3.3,0,0,23.7,119,78,0.0,2019-08-28 15:45:00.000
80,81,2019-08-28 20:00:00,0,3.2,0,0,23.6,122,78,0.0,2019-08-28 16:00:00.000
81,82,2019-08-28 20:15:00,0,3.2,0,0,23.4,126,77,0.0,2019-08-28 16:15:00.000
82,83,2019-08-28 20:30:00,0,3.1,0,0,23.3,130,76,0.0,2019-08-28 16:30:00.000
83,84,2019-08-28 20:45:00,0,3.0,0,0,23.1,133,75,0.0,2019-08-28 16:45:00.000
84,85,2019-08-28 21:00:00,0,2.9,0,0,23.0,137,74,0.0,2019-08-28 17:00:00.000
85,86,2019-08-28 21:15:00,0,2.9,0,0,22.9,141,73,0.0,2019-08-28 17:15:00.000
86,87,2019-08-28 21:30:00,0,2.8,0,0,22.7,144,72,0.0,2019-08-28 17:30:00.000
87,88,2019-08-28 21:45:00,0,2.8,0,0,22.6,148,70,0.0,2019-08-28 17:45:00.000
88,89,2019-08-28 22:00:00,0,2.7,0,0,22.5,151,67,0.0,2019-08-28 18:00:00.000
89,90,2019-08-28 22:15:00,0,2.7,0,0,22.3,155,64,0.0,2019-08-28 18:15:00.000
90,91,2019-08-28 22:30:00,0,2.6,0,0,22.2,158,60,0.0,2019-08-28 18:30:00.000
91,92,2019-08-28 22:45:00,0,2.6,0,0,22.1,161,55,0.0,2019-08-28 18:45:00.000
92,93,2019-08-28 23:00:00,0,2.5,0,0,22.0,164,47,0.0,2019-08-28 19:00:00.000
93,94,2019-08-28 23:15:00,0,2.5,0,0,21.9,167,36,0.0,2019-08-28 19:15:00.000
94,95,2019-08-28 23:30:00,0,2.5,0,0,21.8,168,22,0.0,2019-08-28 19:30:00.000
95,96,2019-08-28 23:45:00,0,2.5,0,0,21.7,169,3,0.0,2019-08-28 19:45:00.000
