,BLOCK_ID,DATA_DATETIME,GHI,WIND_SPEED,DNI,DHI,TEMPERATURE,ZENITH,AZIMUTH,CLOUD_OPACITY,ENTRY_TIME
0,1,2019-01-02 00:00:00,0,5.1,0,0,26.8,157,-173,36.7,2019-01-01 20:00:00.000
1,2,2019-01-02 00:15:00,0,5.1,0,0,26.7,157,-165,36.8,2019-01-01 20:15:00.000
2,3,2019-01-02 00:30:00,0,5.0,0,0,26.6,155,-157,36.8,2019-01-01 20:30:00.000
3,4,2019-01-02 00:45:00,0,5.0,0,0,26.6,154,-150,36.8,2019-01-01 20:45:00.000
4,5,2019-01-02 01:00:00,0,5.0,0,0,26.5,152,-144,36.8,2019-01-01 21:00:00.000
5,6,2019-01-02 01:15:00,0,5.0,0,0,26.5,149,-139,36.8,2019-01-01 21:15:00.000
6,7,2019-01-02 01:30:00,0,4.9,0,0,26.4,147,-134,36.8,2019-01-01 21:30:00.000
7,8,2019-01-02 01:45:00,0,4.9,0,0,26.3,144,-131,55.8,2019-01-01 21:45:00.000
8,9,2019-01-02 02:00:00,0,4.9,0,0,26.3,141,-128,56.1,2019-01-01 22:00:00.000
9,10,2019-01-02 02:15:00,0,4.9,0,0,26.3,138,-125,37.0,2019-01-01 22:15:00.000
10,11,2019-01-02 02:30:00,0,4.9,0,0,26.3,135,-123,37.0,2019-01-01 22:30:00.000
11,12,2019-01-02 02:45:00,0,4.9,0,0,26.2,132,-121,50.8,2019-01-01 22:45:00.000
12,13,2019-01-02 03:00:00,0,4.9,0,0,26.2,128,-119,36.8,2019-01-01 23:00:00.000
13,14,2019-01-02 03:15:00,0,4.9,0,0,26.2,125,-118,36.8,2019-01-01 23:15:00.000
14,15,2019-01-02 03:30:00,0,4.9,0,0,26.2,122,-117,53.5,2019-01-01 23:30:00.000
15,16,2019-01-02 03:45:00,0,4.8,0,0,26.2,118,-116,38.7,2019-01-01 23:45:00.000
16,17,2019-01-02 04:00:00,0,4.8,0,0,26.2,115,-115,38.7,2019-01-02 00:00:00.000
17,18,2019-01-02 04:15:00,0,4.8,0,0,26.1,112,-115,35.6,2019-01-02 00:15:00.000
18,19,2019-01-02 04:30:00,0,4.8,0,0,26.1,108,-114,52.8,2019-01-02 00:30:00.000
19,20,2019-01-02 04:45:00,0,4.8,0,0,26.1,105,-114,39.0,2019-01-02 00:45:00.000
20,21,2019-01-02 05:00:00,0,4.8,0,0,26.1,101,-113,39.0,2019-01-02 01:00:00.000
21,22,2019-01-02 05:15:00,0,4.7,0,0,26.1,98,-113,39.1,2019-01-02 01:15:00.000
22,23,2019-01-02 05:30:00,0,4.6,0,0,26.2,95,-113,39.0,2019-01-02 01:30:00.000
23,24,2019-01-02 05:45:00,1,4.5,0,1,26.2,91,-113,37.0,2019-01-02 01:45:00.000
24,25,2019-01-02 06:00:00,14,4.4,0,14,26.2,88,-113,36.2,2019-01-02 02:00:00.000
25,26,2019-01-02 06:15:00,45,4.4,0,45,26.3,84,-113,28.9,2019-01-02 02:15:00.000
26,27,2019-01-02 06:30:00,88,4.3,51,80,26.3,81,-114,23.0,2019-01-02 02:30:00.000
27,28,2019-01-02 06:45:00,98,4.2,0,98,26.3,77,-114,42.8,2019-01-02 02:45:00.000
28,29,2019-01-02 07:00:00,149,4.1,0,149,26.4,74,-114,35.4,2019-01-02 03:00:00.000
29,30,2019-01-02 07:15:00,158,4.0,0,158,26.4,70,-115,45.1,2019-01-02 03:15:00.000
30,31,2019-01-02 07:30:00,148,3.9,0,148,26.4,67,-115,57.6,2019-01-02 03:30:00.000
31,32,2019-01-02 07:45:00,227,3.8,5,224,26.5,64,-116,45.0,2019-01-02 03:45:00.000
32,33,2019-01-02 08:00:00,365,3.8,227,252,26.5,60,-117,21.9,2019-01-02 04:00:00.000
33,34,2019-01-02 08:15:00,460,3.6,465,205,26.5,57,-118,12.3,2019-01-02 04:15:00.000
34,35,2019-01-02 08:30:00,578,3.5,809,100,26.5,54,-120,0.0,2019-01-02 04:30:00.000
35,36,2019-01-02 08:45:00,630,3.4,827,105,26.5,51,-121,0.0,2019-01-02 04:45:00.000
36,37,2019-01-02 09:00:00,679,3.3,842,109,26.5,47,-123,0.0,2019-01-02 05:00:00.000
37,38,2019-01-02 09:15:00,702,3.2,755,162,26.5,44,-125,3.2,2019-01-02 05:15:00.000
38,39,2019-01-02 09:30:00,704,3.1,614,243,26.6,41,-127,8.3,2019-01-02 05:30:00.000
39,40,2019-01-02 09:45:00,723,3.0,563,282,26.6,38,-130,10.3,2019-01-02 05:45:00.000
40,41,2019-01-02 10:00:00,730,2.9,488,332,26.6,36,-134,13.3,2019-01-02 06:00:00.000
41,42,2019-01-02 10:15:00,742,2.9,452,363,26.6,33,-138,14.9,2019-01-02 06:15:00.000
42,43,2019-01-02 10:30:00,625,2.8,115,526,26.6,31,-142,30.4,2019-01-02 06:30:00.000
43,44,2019-01-02 10:45:00,581,2.7,8,574,26.6,28,-148,36.8,2019-01-02 06:45:00.000
44,45,2019-01-02 11:00:00,685,2.7,188,516,26.6,27,-154,26.8,2019-01-02 07:00:00.000
45,46,2019-01-02 11:15:00,836,2.7,532,355,26.6,25,-161,11.7,2019-01-02 07:15:00.000
46,47,2019-01-02 11:30:00,879,2.7,638,297,26.5,24,-169,7.8,2019-01-02 07:30:00.000
47,48,2019-01-02 11:45:00,747,2.7,271,499,26.5,24,-178,22.0,2019-01-02 07:45:00.000
48,49,2019-01-02 12:00:00,690,2.7,148,555,26.5,24,174,27.9,2019-01-02 08:00:00.000
49,50,2019-01-02 12:15:00,567,2.7,0,567,26.5,25,166,40.4,2019-01-02 08:15:00.000
50,51,2019-01-02 12:30:00,516,2.7,0,516,26.5,26,158,45.1,2019-01-02 08:30:00.000
51,52,2019-01-02 12:45:00,488,2.8,0,488,26.4,27,151,47.3,2019-01-02 08:45:00.000
52,53,2019-01-02 13:00:00,532,2.8,0,532,26.4,29,145,41.2,2019-01-02 09:00:00.000
53,54,2019-01-02 13:15:00,589,2.8,49,548,26.4,32,140,33.1,2019-01-02 09:15:00.000
54,55,2019-01-02 13:30:00,706,2.8,376,395,26.4,34,136,17.1,2019-01-02 09:30:00.000
55,56,2019-01-02 13:45:00,773,2.9,678,231,26.3,37,132,5.6,2019-01-02 09:45:00.000
56,57,2019-01-02 14:00:00,778,2.9,821,146,26.3,40,129,0.5,2019-01-02 10:00:00.000
57,58,2019-01-02 14:15:00,736,3.0,804,145,26.3,43,126,0.7,2019-01-02 10:15:00.000
58,59,2019-01-02 14:30:00,696,3.0,809,132,26.3,46,124,0.1,2019-01-02 10:30:00.000
59,60,2019-01-02 14:45:00,643,3.0,768,138,26.3,49,122,0.9,2019-01-02 10:45:00.000
60,61,2019-01-02 15:00:00,591,3.1,739,137,26.3,52,120,1.2,2019-01-02 11:00:00.000
61,62,2019-01-02 15:15:00,536,3.1,706,135,26.4,55,119,1.6,2019-01-02 11:15:00.000
62,63,2019-01-02 15:30:00,438,3.2,450,203,26.4,59,118,10.5,2019-01-02 11:30:00.000
63,64,2019-01-02 15:45:00,355,3.2,260,232,26.4,62,117,17.8,2019-01-02 11:45:00.000
64,65,2019-01-02 16:00:00,278,3.2,97,236,26.4,65,116,25.5,2019-01-02 12:00:00.000
65,66,2019-01-02 16:15:00,86,3.3,0,86,26.4,69,115,73.0,2019-01-02 12:15:00.000
66,67,2019-01-02 16:30:00,17,3.3,0,17,26.4,72,114,93.4,2019-01-02 12:30:00.000
67,68,2019-01-02 16:45:00,8,3.4,0,8,26.4,76,114,96.3,2019-01-02 12:45:00.000
68,69,2019-01-02 17:00:00,21,3.4,0,21,26.4,79,114,83.6,2019-01-02 13:00:00.000
69,70,2019-01-02 17:15:00,39,3.3,0,39,26.3,82,113,52.3,2019-01-02 13:15:00.000
70,71,2019-01-02 17:30:00,16,3.2,0,16,26.2,86,113,57.3,2019-01-02 13:30:00.000
71,72,2019-01-02 17:45:00,4,3.1,0,4,26.1,89,113,43.5,2019-01-02 13:45:00.000
72,73,2019-01-02 18:00:00,0,3.0,0,0,26.0,93,113,44.2,2019-01-02 14:00:00.000
73,74,2019-01-02 18:15:00,0,2.9,0,0,26.0,96,113,44.3,2019-01-02 14:15:00.000
74,75,2019-01-02 18:30:00,0,2.8,0,0,25.9,100,113,51.8,2019-01-02 14:30:00.000
75,76,2019-01-02 18:45:00,0,2.7,0,0,25.8,103,114,44.7,2019-01-02 14:45:00.000
76,77,2019-01-02 19:00:00,0,2.6,0,0,25.7,107,114,50.4,2019-01-02 15:00:00.000
77,78,2019-01-02 19:15:00,0,2.6,0,0,25.6,110,114,52.8,2019-01-02 15:15:00.000
78,79,2019-01-02 19:30:00,0,2.5,0,0,25.6,113,115,53.0,2019-01-02 15:30:00.000
79,80,2019-01-02 19:45:00,0,2.4,0,0,25.5,117,116,53.0,2019-01-02 15:45:00.000
80,81,2019-01-02 20:00:00,0,2.3,0,0,25.4,120,116,39.4,2019-01-02 16:00:00.000
81,82,2019-01-02 20:15:00,0,2.4,0,0,25.5,123,118,36.0,2019-01-02 16:15:00.000
82,83,2019-01-02 20:30:00,0,2.4,0,0,25.7,127,119,36.0,2019-01-02 16:30:00.000
83,84,2019-01-02 20:45:00,0,2.4,0,0,25.8,130,120,36.3,2019-01-02 16:45:00.000
84,85,2019-01-02 21:00:00,0,2.5,0,0,25.9,133,122,36.8,2019-01-02 17:00:00.000
85,86,2019-01-02 21:15:00,0,2.5,0,0,26.0,136,124,36.9,2019-01-02 17:15:00.000
86,87,2019-01-02 21:30:00,0,2.6,0,0,26.1,139,126,37.0,2019-01-02 17:30:00.000
87,88,2019-01-02 21:45:00,0,2.7,0,0,26.2,142,129,37.0,2019-01-02 17:45:00.000
88,89,2019-01-02 22:00:00,0,2.7,0,0,26.4,145,132,37.0,2019-01-02 18:00:00.000
89,90,2019-01-02 22:15:00,0,2.8,0,0,26.5,148,136,36.7,2019-01-02 18:15:00.000
90,91,2019-01-02 22:30:00,0,2.9,0,0,26.6,151,141,48.7,2019-01-02 18:30:00.000
91,92,2019-01-02 22:45:00,0,2.9,0,0,26.7,153,146,42.9,2019-01-02 18:45:00.000
92,93,2019-01-02 23:00:00,0,3.0,0,0,26.8,155,153,71.4,2019-01-02 19:00:00.000
93,94,2019-01-02 23:15:00,0,2.9,0,0,26.8,156,160,62.1,2019-01-02 19:15:00.000
94,95,2019-01-02 23:30:00,0,2.8,0,0,26.8,157,169,75.7,2019-01-02 19:30:00.000
95,96,2019-01-02 23:45:00,0,2.7,0,0,26.8,158,178,52.0,2019-01-02 19:45:00.000
