,BLOCK_ID,DATA_DATETIME,GHI,WIND_SPEED,DNI,DHI,TEMPERATURE,ZENITH,AZIMUTH,CLOUD_OPACITY,ENTRY_TIME
0,1,2020-07-15 00:00:00,0,0.5,0,0,22.6,158,-5,52.4,2020-07-14 20:00:00.000
1,2,2020-07-15 00:15:00,0,0.5,0,0,22.6,157,-14,61.4,2020-07-14 20:15:00.000
2,3,2020-07-15 00:30:00,0,0.5,0,0,22.5,156,-22,49.8,2020-07-14 20:30:00.000
3,4,2020-07-15 00:45:00,0,0.5,0,0,22.5,154,-30,39.6,2020-07-14 20:45:00.000
4,5,2020-07-15 01:00:00,0,0.5,0,0,22.4,152,-36,30.8,2020-07-14 21:00:00.000
5,6,2020-07-15 01:15:00,0,0.4,0,0,22.4,150,-41,47.0,2020-07-14 21:15:00.000
6,7,2020-07-15 01:30:00,0,0.4,0,0,22.4,147,-46,39.0,2020-07-14 21:30:00.000
7,8,2020-07-15 01:45:00,0,0.4,0,0,22.4,144,-49,29.5,2020-07-14 21:45:00.000
8,9,2020-07-15 02:00:00,0,0.4,0,0,22.3,141,-53,26.0,2020-07-14 22:00:00.000
9,10,2020-07-15 02:15:00,0,0.4,0,0,22.3,138,-55,22.8,2020-07-14 22:15:00.000
10,11,2020-07-15 02:30:00,0,0.4,0,0,22.3,135,-58,20.0,2020-07-14 22:30:00.000
11,12,2020-07-15 02:45:00,0,0.4,0,0,22.3,132,-59,16.8,2020-07-14 22:45:00.000
12,13,2020-07-15 03:00:00,0,0.5,0,0,22.2,129,-61,0.0,2020-07-14 23:00:00.000
13,14,2020-07-15 03:15:00,0,0.5,0,0,22.2,126,-62,7.5,2020-07-14 23:15:00.000
14,15,2020-07-15 03:30:00,0,0.5,0,0,22.2,122,-64,25.0,2020-07-14 23:30:00.000
15,16,2020-07-15 03:45:00,0,0.5,0,0,22.2,119,-65,28.9,2020-07-14 23:45:00.000
16,17,2020-07-15 04:00:00,0,0.5,0,0,22.2,115,-66,26.4,2020-07-15 00:00:00.000
17,18,2020-07-15 04:15:00,0,0.4,0,0,22.2,112,-66,32.3,2020-07-15 00:15:00.000
18,19,2020-07-15 04:30:00,0,0.4,0,0,22.2,109,-67,26.0,2020-07-15 00:30:00.000
19,20,2020-07-15 04:45:00,0,0.4,0,0,22.2,105,-67,30.0,2020-07-15 00:45:00.000
20,21,2020-07-15 05:00:00,0,0.4,0,0,22.2,102,-68,70.6,2020-07-15 01:00:00.000
21,22,2020-07-15 05:15:00,0,0.3,0,0,22.2,98,-68,87.2,2020-07-15 01:15:00.000
22,23,2020-07-15 05:30:00,0,0.3,0,0,22.2,95,-68,97.0,2020-07-15 01:30:00.000
23,24,2020-07-15 05:45:00,0,0.2,0,0,22.2,91,-68,97.0,2020-07-15 01:45:00.000
24,25,2020-07-15 06:00:00,1,0.2,0,1,22.3,88,-68,97.0,2020-07-15 02:00:00.000
25,26,2020-07-15 06:15:00,24,0.2,0,24,22.6,84,-68,63.1,2020-07-15 02:15:00.000
26,27,2020-07-15 06:30:00,67,0.2,0,67,23.0,81,-68,36.2,2020-07-15 02:30:00.000
27,28,2020-07-15 06:45:00,105,0.2,27,100,23.3,77,-68,32.1,2020-07-15 02:45:00.000
28,29,2020-07-15 07:00:00,145,0.2,36,135,23.7,74,-68,32.0,2020-07-15 03:00:00.000
29,30,2020-07-15 07:15:00,166,0.3,21,159,24.2,70,-67,37.3,2020-07-15 03:15:00.000
30,31,2020-07-15 07:30:00,161,0.4,0,161,24.7,67,-67,50.4,2020-07-15 03:30:00.000
31,32,2020-07-15 07:45:00,189,0.6,0,189,25.1,64,-66,50.0,2020-07-15 03:45:00.000
32,33,2020-07-15 08:00:00,266,0.7,0,266,25.6,60,-65,38.8,2020-07-15 04:00:00.000
33,34,2020-07-15 08:15:00,342,0.9,96,288,25.8,57,-64,29.8,2020-07-15 04:15:00.000
34,35,2020-07-15 08:30:00,487,1.0,524,172,26.1,53,-63,9.4,2020-07-15 04:30:00.000
35,36,2020-07-15 08:45:00,573,1.2,720,110,26.3,50,-62,2.1,2020-07-15 04:45:00.000
36,37,2020-07-15 09:00:00,590,1.3,616,169,26.5,47,-60,6.4,2020-07-15 05:00:00.000
37,38,2020-07-15 09:15:00,674,1.4,805,90,26.7,44,-58,0.0,2020-07-15 05:15:00.000
38,39,2020-07-15 09:30:00,673,1.5,655,175,26.8,40,-56,5.6,2020-07-15 05:30:00.000
39,40,2020-07-15 09:45:00,679,1.6,557,236,27.0,37,-53,9.5,2020-07-15 05:45:00.000
40,41,2020-07-15 10:00:00,643,1.7,360,347,27.1,34,-50,17.8,2020-07-15 06:00:00.000
41,42,2020-07-15 10:15:00,642,1.8,294,391,27.2,32,-47,20.9,2020-07-15 06:15:00.000
42,43,2020-07-15 10:30:00,584,1.8,119,480,27.2,29,-42,30.2,2020-07-15 06:30:00.000
43,44,2020-07-15 10:45:00,537,1.9,15,524,27.3,27,-36,37.3,2020-07-15 06:45:00.000
44,45,2020-07-15 11:00:00,559,2.0,29,532,27.2,24,-30,36.0,2020-07-15 07:00:00.000
45,46,2020-07-15 11:15:00,674,2.0,233,459,27.1,23,-22,23.9,2020-07-15 07:15:00.000
46,47,2020-07-15 11:30:00,666,1.9,203,478,26.9,22,-14,25.4,2020-07-15 07:30:00.000
47,48,2020-07-15 11:45:00,389,1.9,0,389,26.7,21,-4,56.6,2020-07-15 07:45:00.000
48,49,2020-07-15 12:00:00,321,1.8,0,321,26.5,21,6,64.2,2020-07-15 08:00:00.000
49,50,2020-07-15 12:15:00,529,1.8,56,477,26.3,22,15,40.7,2020-07-15 08:15:00.000
50,51,2020-07-15 12:30:00,710,1.7,321,415,26.0,23,23,19.6,2020-07-15 08:30:00.000
51,52,2020-07-15 12:45:00,870,1.7,832,114,25.8,25,31,0.0,2020-07-15 08:45:00.000
52,53,2020-07-15 13:00:00,853,1.6,829,113,25.6,27,37,0.0,2020-07-15 09:00:00.000
53,54,2020-07-15 13:15:00,784,1.6,659,209,25.6,29,43,5.7,2020-07-15 09:15:00.000
54,55,2020-07-15 13:30:00,726,1.5,544,264,25.7,32,47,9.8,2020-07-15 09:30:00.000
55,56,2020-07-15 13:45:00,650,1.4,392,327,25.7,35,51,16.1,2020-07-15 09:45:00.000
56,57,2020-07-15 14:00:00,415,1.4,27,393,25.7,38,54,44.0,2020-07-15 10:00:00.000
57,58,2020-07-15 14:15:00,433,1.3,0,433,25.7,41,57,38.2,2020-07-15 10:15:00.000
58,59,2020-07-15 14:30:00,279,1.3,0,279,25.6,44,59,57.8,2020-07-15 10:30:00.000
59,60,2020-07-15 14:45:00,482,1.3,223,330,25.6,47,61,21.7,2020-07-15 10:45:00.000
60,61,2020-07-15 15:00:00,435,1.2,179,322,25.5,50,62,23.5,2020-07-15 11:00:00.000
61,62,2020-07-15 15:15:00,374,1.2,101,313,25.3,54,63,28.3,2020-07-15 11:15:00.000
62,63,2020-07-15 15:30:00,197,1.2,0,197,25.1,57,64,58.4,2020-07-15 11:30:00.000
63,64,2020-07-15 15:45:00,86,1.2,0,86,24.9,61,65,79.5,2020-07-15 11:45:00.000
64,65,2020-07-15 16:00:00,39,1.2,0,39,24.7,64,66,89.4,2020-07-15 12:00:00.000
65,66,2020-07-15 16:15:00,33,1.2,0,33,24.7,67,67,89.2,2020-07-15 12:15:00.000
66,67,2020-07-15 16:30:00,40,1.3,0,40,24.6,71,67,84.2,2020-07-15 12:30:00.000
67,68,2020-07-15 16:45:00,56,1.3,0,56,24.6,74,68,71.3,2020-07-15 12:45:00.000
68,69,2020-07-15 17:00:00,59,1.3,0,59,24.5,78,68,57.6,2020-07-15 13:00:00.000
69,70,2020-07-15 17:15:00,25,1.4,0,25,24.3,81,68,72.1,2020-07-15 13:15:00.000
70,71,2020-07-15 17:30:00,23,1.5,0,23,24.1,85,68,48.6,2020-07-15 13:30:00.000
71,72,2020-07-15 17:45:00,3,1.5,0,3,23.9,88,68,76.6,2020-07-15 13:45:00.000
72,73,2020-07-15 18:00:00,0,1.5,0,0,23.7,92,68,79.6,2020-07-15 14:00:00.000
73,74,2020-07-15 18:15:00,0,1.4,0,0,23.6,95,68,87.3,2020-07-15 14:15:00.000
74,75,2020-07-15 18:30:00,0,1.3,0,0,23.5,99,68,91.3,2020-07-15 14:30:00.000
75,76,2020-07-15 18:45:00,0,1.2,0,0,23.4,102,68,84.2,2020-07-15 14:45:00.000
76,77,2020-07-15 19:00:00,0,1.2,0,0,23.3,106,67,73.0,2020-07-15 15:00:00.000
77,78,2020-07-15 19:15:00,0,1.1,0,0,23.3,109,67,97.0,2020-07-15 15:15:00.000
78,79,2020-07-15 19:30:00,0,1.1,0,0,23.4,113,66,97.0,2020-07-15 15:30:00.000
79,80,2020-07-15 19:45:00,0,1.1,0,0,23.4,116,65,97.0,2020-07-15 15:45:00.000
80,81,2020-07-15 20:00:00,0,1.1,0,0,23.4,119,65,97.0,2020-07-15 16:00:00.000
81,82,2020-07-15 20:15:00,0,1.0,0,0,23.4,123,64,97.0,2020-07-15 16:15:00.000
82,83,2020-07-15 20:30:00,0,0.9,0,0,23.4,126,62,97.0,2020-07-15 16:30:00.000
83,84,2020-07-15 20:45:00,0,0.9,0,0,23.4,129,61,97.0,2020-07-15 16:45:00.000
84,85,2020-07-15 21:00:00,0,0.8,0,0,23.4,133,59,96.2,2020-07-15 17:00:00.000
85,86,2020-07-15 21:15:00,0,0.8,0,0,23.4,136,57,92.6,2020-07-15 17:15:00.000
86,87,2020-07-15 21:30:00,0,0.8,0,0,23.3,139,55,96.4,2020-07-15 17:30:00.000
87,88,2020-07-15 21:45:00,0,0.8,0,0,23.3,142,52,91.5,2020-07-15 17:45:00.000
88,89,2020-07-15 22:00:00,0,0.9,0,0,23.3,145,49,90.4,2020-07-15 18:00:00.000
89,90,2020-07-15 22:15:00,0,0.8,0,0,23.3,148,45,89.7,2020-07-15 18:15:00.000
90,91,2020-07-15 22:30:00,0,0.7,0,0,23.3,150,41,93.0,2020-07-15 18:30:00.000
91,92,2020-07-15 22:45:00,0,0.7,0,0,23.3,152,35,70.6,2020-07-15 18:45:00.000
92,93,2020-07-15 23:00:00,0,0.7,0,0,23.3,154,29,81.2,2020-07-15 19:00:00.000
93,94,2020-07-15 23:15:00,0,0.6,0,0,23.3,156,21,92.0,2020-07-15 19:15:00.000
94,95,2020-07-15 23:30:00,0,0.5,0,0,23.3,157,13,89.6,2020-07-15 19:30:00.000
95,96,2020-07-15 23:45:00,0,0.4,0,0,23.2,158,4,89.5,2020-07-15 19:45:00.000
