,BLOCK_ID,DATA_DATETIME,GHI,WIND_SPEED,DNI,DHI,TEMPERATURE,ZENITH,AZIMUTH,CLOUD_OPACITY,ENTRY_TIME
0,1,2019-05-17 00:00:00,0,3.1,0,0,27.2,160,-13,7.2,2019-05-16 20:00:00.000
1,2,2019-05-17 00:15:00,0,3.2,0,0,27.1,159,-22,0.0,2019-05-16 20:15:00.000
2,3,2019-05-17 00:30:00,0,3.2,0,0,27.0,157,-31,0.0,2019-05-16 20:30:00.000
3,4,2019-05-17 00:45:00,0,3.3,0,0,27.0,155,-38,0.0,2019-05-16 20:45:00.000
4,5,2019-05-17 01:00:00,0,3.3,0,0,26.9,153,-44,4.5,2019-05-16 21:00:00.000
5,6,2019-05-17 01:15:00,0,3.4,0,0,26.9,150,-48,5.6,2019-05-16 21:15:00.000
6,7,2019-05-17 01:30:00,0,3.4,0,0,26.8,147,-52,30.7,2019-05-16 21:30:00.000
7,8,2019-05-17 01:45:00,0,3.5,0,0,26.8,144,-56,11.1,2019-05-16 21:45:00.000
8,9,2019-05-17 02:00:00,0,3.5,0,0,26.7,141,-58,7.4,2019-05-16 22:00:00.000
9,10,2019-05-17 02:15:00,0,3.5,0,0,26.6,138,-61,0.0,2019-05-16 22:15:00.000
10,11,2019-05-17 02:30:00,0,3.4,0,0,26.6,134,-62,0.0,2019-05-16 22:30:00.000
11,12,2019-05-17 02:45:00,0,3.3,0,0,26.5,131,-64,0.0,2019-05-16 22:45:00.000
12,13,2019-05-17 03:00:00,0,3.3,0,0,26.4,128,-65,0.0,2019-05-16 23:00:00.000
13,14,2019-05-17 03:15:00,0,3.2,0,0,26.4,124,-67,0.0,2019-05-16 23:15:00.000
14,15,2019-05-17 03:30:00,0,3.2,0,0,26.3,121,-67,0.0,2019-05-16 23:30:00.000
15,16,2019-05-17 03:45:00,0,3.1,0,0,26.2,117,-68,0.0,2019-05-16 23:45:00.000
16,17,2019-05-17 04:00:00,0,3.1,0,0,26.2,114,-69,0.0,2019-05-17 00:00:00.000
17,18,2019-05-17 04:15:00,0,3.0,0,0,26.1,110,-70,0.0,2019-05-17 00:15:00.000
18,19,2019-05-17 04:30:00,0,3.0,0,0,26.0,107,-70,0.0,2019-05-17 00:30:00.000
19,20,2019-05-17 04:45:00,0,2.9,0,0,26.0,103,-70,0.0,2019-05-17 00:45:00.000
20,21,2019-05-17 05:00:00,0,2.9,0,0,26.0,100,-71,0.0,2019-05-17 01:00:00.000
21,22,2019-05-17 05:15:00,0,2.9,0,0,26.1,96,-71,0.0,2019-05-17 01:15:00.000
22,23,2019-05-17 05:30:00,0,2.8,0,0,26.3,93,-71,0.0,2019-05-17 01:30:00.000
23,24,2019-05-17 05:45:00,7,2.8,13,5,26.5,89,-71,0.0,2019-05-17 01:45:00.000
24,25,2019-05-17 06:00:00,38,2.8,147,26,26.6,85,-71,0.0,2019-05-17 02:00:00.000
25,26,2019-05-17 06:15:00,82,2.7,285,42,26.8,82,-71,0.0,2019-05-17 02:15:00.000
26,27,2019-05-17 06:30:00,134,2.7,390,55,27.0,78,-71,0.0,2019-05-17 02:30:00.000
27,28,2019-05-17 06:45:00,189,2.7,471,66,27.2,75,-71,0.0,2019-05-17 02:45:00.000
28,29,2019-05-17 07:00:00,247,2.7,536,75,27.3,71,-70,0.0,2019-05-17 03:00:00.000
29,30,2019-05-17 07:15:00,305,2.7,587,83,27.5,68,-70,0.0,2019-05-17 03:15:00.000
30,31,2019-05-17 07:30:00,362,2.6,629,89,27.7,64,-69,0.0,2019-05-17 03:30:00.000
31,32,2019-05-17 07:45:00,419,2.6,664,95,27.9,61,-69,0.0,2019-05-17 03:45:00.000
32,33,2019-05-17 08:00:00,475,2.6,692,101,28.0,57,-68,0.0,2019-05-17 04:00:00.000
33,34,2019-05-17 08:15:00,528,2.6,717,105,27.9,54,-67,0.0,2019-05-17 04:15:00.000
34,35,2019-05-17 08:30:00,580,2.5,738,110,27.8,50,-66,0.0,2019-05-17 04:30:00.000
35,36,2019-05-17 08:45:00,629,2.5,755,114,27.7,47,-64,0.0,2019-05-17 04:45:00.000
36,37,2019-05-17 09:00:00,675,2.5,771,117,27.6,44,-63,0.0,2019-05-17 05:00:00.000
37,38,2019-05-17 09:15:00,717,2.4,783,120,27.6,40,-61,0.0,2019-05-17 05:15:00.000
38,39,2019-05-17 09:30:00,757,2.4,795,123,27.5,37,-58,0.0,2019-05-17 05:30:00.000
39,40,2019-05-17 09:45:00,790,2.4,798,129,27.4,34,-56,0.2,2019-05-17 05:45:00.000
40,41,2019-05-17 10:00:00,818,2.4,790,141,27.3,31,-52,0.8,2019-05-17 06:00:00.000
41,42,2019-05-17 10:15:00,841,2.4,780,153,27.2,28,-48,1.3,2019-05-17 06:15:00.000
42,43,2019-05-17 10:30:00,861,2.3,776,160,27.2,25,-43,1.6,2019-05-17 06:30:00.000
43,44,2019-05-17 10:45:00,828,2.3,614,264,27.1,23,-36,7.5,2019-05-17 06:45:00.000
44,45,2019-05-17 11:00:00,774,2.3,425,378,27.0,21,-29,15.0,2019-05-17 07:00:00.000
45,46,2019-05-17 11:15:00,808,2.2,494,341,27.0,19,-19,12.4,2019-05-17 07:15:00.000
46,47,2019-05-17 11:30:00,887,2.1,713,211,27.0,19,-9,4.5,2019-05-17 07:30:00.000
47,48,2019-05-17 11:45:00,904,2.0,765,177,27.0,18,2,2.8,2019-05-17 07:45:00.000
48,49,2019-05-17 12:00:00,828,1.9,542,315,27.0,19,13,10.6,2019-05-17 08:00:00.000
49,50,2019-05-17 12:15:00,797,1.8,473,353,27.0,20,23,13.3,2019-05-17 08:15:00.000
50,51,2019-05-17 12:30:00,811,1.8,541,309,26.9,22,32,10.6,2019-05-17 08:30:00.000
51,52,2019-05-17 12:45:00,834,1.7,656,235,26.9,24,39,6.2,2019-05-17 08:45:00.000
52,53,2019-05-17 13:00:00,825,1.6,684,213,26.9,27,45,5.1,2019-05-17 09:00:00.000
53,54,2019-05-17 13:15:00,793,1.5,657,221,26.9,29,50,6.0,2019-05-17 09:15:00.000
54,55,2019-05-17 13:30:00,804,1.4,786,139,26.9,32,54,1.2,2019-05-17 09:30:00.000
55,56,2019-05-17 13:45:00,768,1.3,764,145,26.9,35,57,1.4,2019-05-17 09:45:00.000
56,57,2019-05-17 14:00:00,717,1.3,695,173,26.9,39,59,3.2,2019-05-17 10:00:00.000
57,58,2019-05-17 14:15:00,647,1.3,564,227,26.9,42,62,7.3,2019-05-17 10:15:00.000
58,59,2019-05-17 14:30:00,538,1.3,308,319,26.9,45,63,17.7,2019-05-17 10:30:00.000
59,60,2019-05-17 14:45:00,424,1.4,64,381,26.9,48,65,30.1,2019-05-17 10:45:00.000
60,61,2019-05-17 15:00:00,429,1.4,187,315,26.9,52,66,22.7,2019-05-17 11:00:00.000
61,62,2019-05-17 15:15:00,342,1.5,30,324,26.9,55,67,32.3,2019-05-17 11:15:00.000
62,63,2019-05-17 15:30:00,213,1.5,0,213,27.0,59,68,52.9,2019-05-17 11:30:00.000
63,64,2019-05-17 15:45:00,124,1.6,0,124,27.0,62,69,68.8,2019-05-17 11:45:00.000
64,65,2019-05-17 16:00:00,82,1.6,0,82,27.0,66,69,75.6,2019-05-17 12:00:00.000
65,66,2019-05-17 16:15:00,152,1.7,0,152,27.0,69,70,45.4,2019-05-17 12:15:00.000
66,67,2019-05-17 16:30:00,143,1.7,0,143,27.0,73,70,35.5,2019-05-17 12:30:00.000
67,68,2019-05-17 16:45:00,119,1.8,54,106,27.0,76,71,29.0,2019-05-17 12:45:00.000
68,69,2019-05-17 17:00:00,55,1.8,0,55,27.0,80,71,51.3,2019-05-17 13:00:00.000
69,70,2019-05-17 17:15:00,23,1.7,0,23,27.0,83,71,58.8,2019-05-17 13:15:00.000
70,71,2019-05-17 17:30:00,19,1.6,0,19,27.0,87,71,15.8,2019-05-17 13:30:00.000
71,72,2019-05-17 17:45:00,0,1.4,0,0,26.9,91,71,8.5,2019-05-17 13:45:00.000
72,73,2019-05-17 18:00:00,0,1.3,0,0,26.9,94,71,14.9,2019-05-17 14:00:00.000
73,74,2019-05-17 18:15:00,0,1.2,0,0,26.9,98,71,15.4,2019-05-17 14:15:00.000
74,75,2019-05-17 18:30:00,0,1.1,0,0,26.9,101,70,25.0,2019-05-17 14:30:00.000
75,76,2019-05-17 18:45:00,0,1.0,0,0,26.9,105,70,16.5,2019-05-17 14:45:00.000
76,77,2019-05-17 19:00:00,0,0.9,0,0,26.9,108,70,20.9,2019-05-17 15:00:00.000
77,78,2019-05-17 19:15:00,0,0.7,0,0,26.8,112,69,18.0,2019-05-17 15:15:00.000
78,79,2019-05-17 19:30:00,0,0.6,0,0,26.8,115,69,4.5,2019-05-17 15:30:00.000
79,80,2019-05-17 19:45:00,0,0.6,0,0,26.8,119,68,2.1,2019-05-17 15:45:00.000
80,81,2019-05-17 20:00:00,0,0.5,0,0,26.8,122,67,0.4,2019-05-17 16:00:00.000
81,82,2019-05-17 20:15:00,0,0.6,0,0,26.9,126,66,0.0,2019-05-17 16:15:00.000
82,83,2019-05-17 20:30:00,0,0.7,0,0,26.9,129,65,0.0,2019-05-17 16:30:00.000
83,84,2019-05-17 20:45:00,0,0.9,0,0,26.9,132,63,0.0,2019-05-17 16:45:00.000
84,85,2019-05-17 21:00:00,0,1.0,0,0,27.0,136,61,0.0,2019-05-17 17:00:00.000
85,86,2019-05-17 21:15:00,0,1.2,0,0,27.0,139,59,0.0,2019-05-17 17:15:00.000
86,87,2019-05-17 21:30:00,0,1.3,0,0,27.1,142,57,0.0,2019-05-17 17:30:00.000
87,88,2019-05-17 21:45:00,0,1.5,0,0,27.1,145,54,0.0,2019-05-17 17:45:00.000
88,89,2019-05-17 22:00:00,0,1.6,0,0,27.2,148,50,0.0,2019-05-17 18:00:00.000
89,90,2019-05-17 22:15:00,0,1.8,0,0,27.2,151,46,0.0,2019-05-17 18:15:00.000
90,91,2019-05-17 22:30:00,0,2.0,0,0,27.2,154,41,0.0,2019-05-17 18:30:00.000
91,92,2019-05-17 22:45:00,0,2.1,0,0,27.3,156,35,0.0,2019-05-17 18:45:00.000
92,93,2019-05-17 23:00:00,0,2.3,0,0,27.3,158,27,0.0,2019-05-17 19:00:00.000
93,94,2019-05-17 23:15:00,0,2.4,0,0,27.3,159,18,0.0,2019-05-17 19:15:00.000
94,95,2019-05-17 23:30:00,0,2.5,0,0,27.2,160,8,0.0,2019-05-17 19:30:00.000
95,96,2019-05-17 23:45:00,0,2.6,0,0,27.2,160,-2,0.0,2019-05-17 19:45:00.000
