,BLOCK_ID,DATA_DATETIME,GHI,WIND_SPEED,DNI,DHI,TEMPERATURE,ZENITH,AZIMUTH,CLOUD_OPACITY,ENTRY_TIME
0,1,2018-10-21 00:00:00,0,1.3,0,0,26.7,168,-142,0.0,2018-10-20 20:00:00.000
1,2,2018-10-21 00:15:00,0,1.3,0,0,26.7,165,-131,0.0,2018-10-20 20:15:00.000
2,3,2018-10-21 00:30:00,0,1.3,0,0,26.6,162,-123,29.6,2018-10-20 20:30:00.000
3,4,2018-10-21 00:45:00,0,1.4,0,0,26.6,159,-117,36.7,2018-10-20 20:45:00.000
4,5,2018-10-21 01:00:00,0,1.5,0,0,26.6,156,-113,36.1,2018-10-20 21:00:00.000
5,6,2018-10-21 01:15:00,0,1.6,0,0,26.6,152,-111,36.0,2018-10-20 21:15:00.000
6,7,2018-10-21 01:30:00,0,1.7,0,0,26.5,149,-108,36.0,2018-10-20 21:30:00.000
7,8,2018-10-21 01:45:00,0,1.8,0,0,26.5,145,-107,32.2,2018-10-20 21:45:00.000
8,9,2018-10-21 02:00:00,0,1.9,0,0,26.5,142,-105,21.5,2018-10-20 22:00:00.000
9,10,2018-10-21 02:15:00,0,2.1,0,0,26.5,138,-104,38.7,2018-10-20 22:15:00.000
10,11,2018-10-21 02:30:00,0,2.2,0,0,26.5,134,-103,49.9,2018-10-20 22:30:00.000
11,12,2018-10-21 02:45:00,0,2.4,0,0,26.5,131,-103,48.6,2018-10-20 22:45:00.000
12,13,2018-10-21 03:00:00,0,2.5,0,0,26.5,127,-102,26.8,2018-10-20 23:00:00.000
13,14,2018-10-21 03:15:00,0,2.7,0,0,26.5,123,-102,44.2,2018-10-20 23:15:00.000
14,15,2018-10-21 03:30:00,0,2.9,0,0,26.5,120,-101,8.0,2018-10-20 23:30:00.000
15,16,2018-10-21 03:45:00,0,3.0,0,0,26.5,116,-101,0.0,2018-10-20 23:45:00.000
16,17,2018-10-21 04:00:00,0,3.2,0,0,26.5,112,-101,0.0,2018-10-21 00:00:00.000
17,18,2018-10-21 04:15:00,0,3.4,0,0,26.5,109,-100,0.0,2018-10-21 00:15:00.000
18,19,2018-10-21 04:30:00,0,3.5,0,0,26.5,105,-100,0.0,2018-10-21 00:30:00.000
19,20,2018-10-21 04:45:00,0,3.7,0,0,26.5,101,-100,0.0,2018-10-21 00:45:00.000
20,21,2018-10-21 05:00:00,0,3.8,0,0,26.5,98,-100,0.0,2018-10-21 01:00:00.000
21,22,2018-10-21 05:15:00,0,3.9,0,0,26.5,94,-100,0.0,2018-10-21 01:15:00.000
22,23,2018-10-21 05:30:00,1,3.9,1,1,26.6,90,-100,0.0,2018-10-21 01:30:00.000
23,24,2018-10-21 05:45:00,24,4.0,41,20,26.6,86,-100,11.0,2018-10-21 01:45:00.000
24,25,2018-10-21 06:00:00,59,4.0,47,53,26.7,83,-100,20.0,2018-10-21 02:00:00.000
25,26,2018-10-21 06:15:00,94,4.0,29,88,26.7,79,-100,25.8,2018-10-21 02:15:00.000
26,27,2018-10-21 06:30:00,150,4.1,123,119,26.8,75,-101,18.6,2018-10-21 02:30:00.000
27,28,2018-10-21 06:45:00,196,4.1,134,153,26.8,72,-101,20.2,2018-10-21 02:45:00.000
28,29,2018-10-21 07:00:00,293,4.2,485,109,26.8,68,-101,4.8,2018-10-21 03:00:00.000
29,30,2018-10-21 07:15:00,367,4.2,622,98,26.9,64,-101,0.5,2018-10-21 03:15:00.000
30,31,2018-10-21 07:30:00,415,4.3,585,129,26.9,61,-102,3.2,2018-10-21 03:30:00.000
31,32,2018-10-21 07:45:00,470,4.3,603,143,27.0,57,-102,3.7,2018-10-21 03:45:00.000
32,33,2018-10-21 08:00:00,477,4.4,398,240,27.0,53,-103,12.8,2018-10-21 04:00:00.000
33,34,2018-10-21 08:15:00,491,4.4,522,158,27.0,50,-104,17.8,2018-10-21 04:15:00.000
34,35,2018-10-21 08:30:00,436,4.4,98,367,26.9,46,-105,33.7,2018-10-21 04:30:00.000
35,36,2018-10-21 08:45:00,681,4.4,694,171,26.9,42,-106,3.2,2018-10-21 04:45:00.000
36,37,2018-10-21 09:00:00,735,4.4,738,159,26.9,39,-107,2.2,2018-10-21 05:00:00.000
37,38,2018-10-21 09:15:00,698,4.5,565,241,26.9,35,-109,11.7,2018-10-21 05:15:00.000
38,39,2018-10-21 09:30:00,538,4.5,17,523,26.8,32,-111,35.4,2018-10-21 05:30:00.000
39,40,2018-10-21 09:45:00,693,4.5,294,434,26.8,28,-113,20.1,2018-10-21 05:45:00.000
40,41,2018-10-21 10:00:00,777,4.5,460,359,26.8,25,-116,13.4,2018-10-21 06:00:00.000
41,42,2018-10-21 10:15:00,487,4.5,0,487,26.8,22,-120,47.2,2018-10-21 06:15:00.000
42,43,2018-10-21 10:30:00,510,4.6,0,510,26.7,18,-126,46.0,2018-10-21 06:30:00.000
43,44,2018-10-21 10:45:00,575,4.6,0,575,26.7,16,-134,40.1,2018-10-21 06:45:00.000
44,45,2018-10-21 11:00:00,475,4.6,0,475,26.7,13,-145,51.0,2018-10-21 07:00:00.000
45,46,2018-10-21 11:15:00,432,4.6,0,432,26.7,11,-161,55.7,2018-10-21 07:15:00.000
46,47,2018-10-21 11:30:00,230,4.6,0,230,26.7,11,-180,76.5,2018-10-21 07:30:00.000
47,48,2018-10-21 11:45:00,168,4.6,0,168,26.6,11,161,82.7,2018-10-21 07:45:00.000
48,49,2018-10-21 12:00:00,395,4.6,0,395,26.6,13,146,59.2,2018-10-21 08:00:00.000
49,50,2018-10-21 12:15:00,488,4.6,0,488,26.6,16,134,48.9,2018-10-21 08:15:00.000
50,51,2018-10-21 12:30:00,705,4.6,213,503,26.6,18,126,24.9,2018-10-21 08:30:00.000
51,52,2018-10-21 12:45:00,845,4.6,578,308,26.6,22,121,7.8,2018-10-21 08:45:00.000
52,53,2018-10-21 13:00:00,878,4.6,757,191,26.6,25,116,1.4,2018-10-21 09:00:00.000
53,54,2018-10-21 13:15:00,860,4.6,791,163,26.5,28,113,0.0,2018-10-21 09:15:00.000
54,55,2018-10-21 13:30:00,825,4.6,782,160,26.5,32,111,0.0,2018-10-21 09:30:00.000
55,56,2018-10-21 13:45:00,787,4.6,773,156,26.5,35,109,0.0,2018-10-21 09:45:00.000
56,57,2018-10-21 14:00:00,745,4.6,763,150,26.5,39,107,0.0,2018-10-21 10:00:00.000
57,58,2018-10-21 14:15:00,699,4.6,751,145,26.5,42,106,0.0,2018-10-21 10:15:00.000
58,59,2018-10-21 14:30:00,650,4.5,736,139,26.5,46,105,0.0,2018-10-21 10:30:00.000
59,60,2018-10-21 14:45:00,598,4.5,717,133,26.5,50,104,0.0,2018-10-21 10:45:00.000
60,61,2018-10-21 15:00:00,543,4.5,695,127,26.5,53,103,0.0,2018-10-21 11:00:00.000
61,62,2018-10-21 15:15:00,485,4.5,669,120,26.5,57,103,0.0,2018-10-21 11:15:00.000
62,63,2018-10-21 15:30:00,426,4.5,638,112,26.6,61,102,0.0,2018-10-21 11:30:00.000
63,64,2018-10-21 15:45:00,361,4.5,570,113,26.6,64,102,1.3,2018-10-21 11:45:00.000
64,65,2018-10-21 16:00:00,299,4.5,517,105,26.6,68,101,1.7,2018-10-21 12:00:00.000
65,66,2018-10-21 16:15:00,223,4.5,326,119,26.6,72,101,8.5,2018-10-21 12:15:00.000
66,67,2018-10-21 16:30:00,153,4.5,136,117,26.6,75,101,16.6,2018-10-21 12:30:00.000
67,68,2018-10-21 16:45:00,96,4.5,20,93,26.6,79,101,22.8,2018-10-21 12:45:00.000
68,69,2018-10-21 17:00:00,59,4.4,14,57,26.6,83,100,18.5,2018-10-21 13:00:00.000
69,70,2018-10-21 17:15:00,26,4.3,7,26,26.6,86,100,9.6,2018-10-21 13:15:00.000
70,71,2018-10-21 17:30:00,3,4.2,5,2,26.6,90,100,0.0,2018-10-21 13:30:00.000
71,72,2018-10-21 17:45:00,0,4.1,0,0,26.5,94,100,0.0,2018-10-21 13:45:00.000
72,73,2018-10-21 18:00:00,0,3.9,0,0,26.5,97,100,0.0,2018-10-21 14:00:00.000
73,74,2018-10-21 18:15:00,0,3.8,0,0,26.5,101,100,0.0,2018-10-21 14:15:00.000
74,75,2018-10-21 18:30:00,0,3.7,0,0,26.5,105,100,29.6,2018-10-21 14:30:00.000
75,76,2018-10-21 18:45:00,0,3.6,0,0,26.5,109,101,44.6,2018-10-21 14:45:00.000
76,77,2018-10-21 19:00:00,0,3.5,0,0,26.5,112,101,44.3,2018-10-21 15:00:00.000
77,78,2018-10-21 19:15:00,0,3.4,0,0,26.4,116,101,36.2,2018-10-21 15:15:00.000
78,79,2018-10-21 19:30:00,0,3.3,0,0,26.4,120,101,36.2,2018-10-21 15:30:00.000
79,80,2018-10-21 19:45:00,0,3.2,0,0,26.4,123,102,36.2,2018-10-21 15:45:00.000
80,81,2018-10-21 20:00:00,0,3.1,0,0,26.4,127,102,36.8,2018-10-21 16:00:00.000
81,82,2018-10-21 20:15:00,0,3.1,0,0,26.5,131,103,37.0,2018-10-21 16:15:00.000
82,83,2018-10-21 20:30:00,0,3.1,0,0,26.5,134,104,37.0,2018-10-21 16:30:00.000
83,84,2018-10-21 20:45:00,0,3.1,0,0,26.5,138,105,37.0,2018-10-21 16:45:00.000
84,85,2018-10-21 21:00:00,0,3.1,0,0,26.6,141,106,45.1,2018-10-21 17:00:00.000
85,86,2018-10-21 21:15:00,0,3.1,0,0,26.6,145,107,40.4,2018-10-21 17:15:00.000
86,87,2018-10-21 21:30:00,0,3.1,0,0,26.7,149,109,5.3,2018-10-21 17:30:00.000
87,88,2018-10-21 21:45:00,0,3.1,0,0,26.7,152,111,0.0,2018-10-21 17:45:00.000
88,89,2018-10-21 22:00:00,0,3.1,0,0,26.7,156,114,0.0,2018-10-21 18:00:00.000
89,90,2018-10-21 22:15:00,0,3.1,0,0,26.8,159,118,0.0,2018-10-21 18:15:00.000
90,91,2018-10-21 22:30:00,0,3.1,0,0,26.8,162,123,0.0,2018-10-21 18:30:00.000
91,92,2018-10-21 22:45:00,0,3.2,0,0,26.9,165,131,0.0,2018-10-21 18:45:00.000
92,93,2018-10-21 23:00:00,0,3.2,0,0,26.9,168,143,0.0,2018-10-21 19:00:00.000
93,94,2018-10-21 23:15:00,0,3.2,0,0,26.8,170,159,0.0,2018-10-21 19:15:00.000
94,95,2018-10-21 23:30:00,0,3.3,0,0,26.8,170,180,0.0,2018-10-21 19:30:00.000
95,96,2018-10-21 23:45:00,0,3.3,0,0,26.8,170,-159,0.0,2018-10-21 19:45:00.000
