,BLOCK_ID,DATA_DATETIME,GHI,WIND_SPEED,DNI,DHI,TEMPERATURE,ZENITH,AZIMUTH,CLOUD_OPACITY,ENTRY_TIME
0,1,2019-05-14 00:00:00,0,3.6,0,0,27.3,161,-13,0.0,2019-05-13 20:00:00.000
1,2,2019-05-14 00:15:00,0,3.6,0,0,27.3,160,-23,0.0,2019-05-13 20:15:00.000
2,3,2019-05-14 00:30:00,0,3.7,0,0,27.2,158,-32,0.0,2019-05-13 20:30:00.000
3,4,2019-05-14 00:45:00,0,3.8,0,0,27.2,156,-39,0.0,2019-05-13 20:45:00.000
4,5,2019-05-14 01:00:00,0,3.9,0,0,27.2,153,-45,0.0,2019-05-13 21:00:00.000
5,6,2019-05-14 01:15:00,0,4.0,0,0,27.1,150,-50,0.0,2019-05-13 21:15:00.000
6,7,2019-05-14 01:30:00,0,4.1,0,0,27.1,147,-53,0.0,2019-05-13 21:30:00.000
7,8,2019-05-14 01:45:00,0,4.2,0,0,27.0,144,-57,0.0,2019-05-13 21:45:00.000
8,9,2019-05-14 02:00:00,0,4.2,0,0,27.0,141,-59,0.0,2019-05-13 22:00:00.000
9,10,2019-05-14 02:15:00,0,4.3,0,0,26.9,138,-62,0.0,2019-05-13 22:15:00.000
10,11,2019-05-14 02:30:00,0,4.3,0,0,26.9,135,-63,0.0,2019-05-13 22:30:00.000
11,12,2019-05-14 02:45:00,0,4.4,0,0,26.8,131,-65,0.0,2019-05-13 22:45:00.000
12,13,2019-05-14 03:00:00,0,4.4,0,0,26.8,128,-66,0.0,2019-05-13 23:00:00.000
13,14,2019-05-14 03:15:00,0,4.5,0,0,26.7,124,-67,0.0,2019-05-13 23:15:00.000
14,15,2019-05-14 03:30:00,0,4.5,0,0,26.7,121,-68,0.0,2019-05-13 23:30:00.000
15,16,2019-05-14 03:45:00,0,4.6,0,0,26.6,117,-69,0.0,2019-05-13 23:45:00.000
16,17,2019-05-14 04:00:00,0,4.6,0,0,26.6,114,-70,0.0,2019-05-14 00:00:00.000
17,18,2019-05-14 04:15:00,0,4.6,0,0,26.5,110,-70,0.0,2019-05-14 00:15:00.000
18,19,2019-05-14 04:30:00,0,4.7,0,0,26.5,107,-71,0.0,2019-05-14 00:30:00.000
19,20,2019-05-14 04:45:00,0,4.7,0,0,26.4,103,-71,0.0,2019-05-14 00:45:00.000
20,21,2019-05-14 05:00:00,0,4.8,0,0,26.4,100,-71,0.0,2019-05-14 01:00:00.000
21,22,2019-05-14 05:15:00,0,4.7,0,0,26.6,96,-72,0.0,2019-05-14 01:15:00.000
22,23,2019-05-14 05:30:00,0,4.7,0,0,26.7,93,-72,0.0,2019-05-14 01:30:00.000
23,24,2019-05-14 05:45:00,7,4.6,23,5,26.8,89,-72,0.0,2019-05-14 01:45:00.000
24,25,2019-05-14 06:00:00,39,4.5,128,28,27.0,85,-72,6.1,2019-05-14 02:00:00.000
25,26,2019-05-14 06:15:00,88,4.5,361,37,27.1,82,-72,0.0,2019-05-14 02:15:00.000
26,27,2019-05-14 06:30:00,140,4.4,438,51,27.3,78,-72,1.1,2019-05-14 02:30:00.000
27,28,2019-05-14 06:45:00,179,4.4,337,91,27.4,75,-71,9.4,2019-05-14 02:45:00.000
28,29,2019-05-14 07:00:00,232,4.3,388,107,27.5,71,-71,9.2,2019-05-14 03:00:00.000
29,30,2019-05-14 07:15:00,314,4.3,643,70,27.7,68,-71,0.0,2019-05-14 03:15:00.000
30,31,2019-05-14 07:30:00,372,4.2,681,76,27.8,64,-70,0.0,2019-05-14 03:30:00.000
31,32,2019-05-14 07:45:00,429,4.1,712,80,28.0,61,-69,0.0,2019-05-14 03:45:00.000
32,33,2019-05-14 08:00:00,485,4.1,739,85,28.1,57,-69,0.0,2019-05-14 04:00:00.000
33,34,2019-05-14 08:15:00,539,4.1,761,88,28.0,54,-68,0.0,2019-05-14 04:15:00.000
34,35,2019-05-14 08:30:00,591,4.0,780,92,28.0,50,-67,0.0,2019-05-14 04:30:00.000
35,36,2019-05-14 08:45:00,616,4.0,698,140,28.0,47,-65,3.6,2019-05-14 04:45:00.000
36,37,2019-05-14 09:00:00,670,4.0,744,128,28.0,43,-64,2.4,2019-05-14 05:00:00.000
37,38,2019-05-14 09:15:00,710,3.9,750,138,28.0,40,-62,2.5,2019-05-14 05:15:00.000
38,39,2019-05-14 09:30:00,702,3.9,583,236,27.9,37,-60,8.7,2019-05-14 05:30:00.000
39,40,2019-05-14 09:45:00,527,3.9,215,349,27.9,34,-57,34.2,2019-05-14 05:45:00.000
40,41,2019-05-14 10:00:00,532,3.9,111,437,27.9,31,-53,36.5,2019-05-14 06:00:00.000
41,42,2019-05-14 10:15:00,780,3.8,578,266,27.9,28,-49,9.8,2019-05-14 06:15:00.000
42,43,2019-05-14 10:30:00,823,3.8,646,238,27.9,25,-44,7.2,2019-05-14 06:30:00.000
43,44,2019-05-14 10:45:00,845,3.8,656,238,27.8,22,-38,6.8,2019-05-14 06:45:00.000
44,45,2019-05-14 11:00:00,911,3.7,829,134,27.8,20,-30,1.0,2019-05-14 07:00:00.000
45,46,2019-05-14 11:15:00,931,3.7,859,117,27.8,19,-20,0.0,2019-05-14 07:15:00.000
46,47,2019-05-14 11:30:00,936,3.7,859,118,27.9,18,-9,0.0,2019-05-14 07:30:00.000
47,48,2019-05-14 11:45:00,937,3.7,859,119,27.9,18,3,0.0,2019-05-14 07:45:00.000
48,49,2019-05-14 12:00:00,934,3.7,858,119,27.9,18,14,0.0,2019-05-14 08:00:00.000
49,50,2019-05-14 12:15:00,888,3.6,739,191,27.9,19,24,4.2,2019-05-14 08:15:00.000
50,51,2019-05-14 12:30:00,827,3.6,578,289,27.9,21,33,9.5,2019-05-14 08:30:00.000
51,52,2019-05-14 12:45:00,850,3.6,692,215,27.9,23,40,5.3,2019-05-14 08:45:00.000
52,53,2019-05-14 13:00:00,818,3.6,650,234,27.9,26,46,6.6,2019-05-14 09:00:00.000
53,54,2019-05-14 13:15:00,774,3.6,589,260,28.0,29,51,8.9,2019-05-14 09:15:00.000
54,55,2019-05-14 13:30:00,819,3.5,827,117,28.0,32,55,0.2,2019-05-14 09:30:00.000
55,56,2019-05-14 13:45:00,788,3.5,829,109,28.0,35,58,0.0,2019-05-14 09:45:00.000
56,57,2019-05-14 14:00:00,751,3.5,822,105,28.0,38,61,0.0,2019-05-14 10:00:00.000
57,58,2019-05-14 14:15:00,710,3.6,813,101,28.0,42,63,0.0,2019-05-14 10:15:00.000
58,59,2019-05-14 14:30:00,666,3.6,802,97,28.0,45,64,0.0,2019-05-14 10:30:00.000
59,60,2019-05-14 14:45:00,618,3.7,788,94,28.0,48,66,0.0,2019-05-14 10:45:00.000
60,61,2019-05-14 15:00:00,568,3.7,771,91,28.0,52,67,0.0,2019-05-14 11:00:00.000
61,62,2019-05-14 15:15:00,516,3.8,751,87,28.0,55,68,0.0,2019-05-14 11:15:00.000
62,63,2019-05-14 15:30:00,461,3.8,728,82,28.0,59,69,0.0,2019-05-14 11:30:00.000
63,64,2019-05-14 15:45:00,392,3.9,618,101,28.0,62,70,3.4,2019-05-14 11:45:00.000
64,65,2019-05-14 16:00:00,303,4.0,364,153,28.0,66,70,12.8,2019-05-14 12:00:00.000
65,66,2019-05-14 16:15:00,244,4.0,282,143,28.0,69,71,15.8,2019-05-14 12:15:00.000
66,67,2019-05-14 16:30:00,158,4.1,28,148,28.0,73,71,32.1,2019-05-14 12:30:00.000
67,68,2019-05-14 16:45:00,110,4.1,0,110,28.0,76,71,36.5,2019-05-14 12:45:00.000
68,69,2019-05-14 17:00:00,83,4.2,0,83,28.0,80,72,29.4,2019-05-14 13:00:00.000
69,70,2019-05-14 17:15:00,53,4.0,19,51,28.0,83,72,21.5,2019-05-14 13:15:00.000
70,71,2019-05-14 17:30:00,17,3.9,9,16,27.9,87,72,36.6,2019-05-14 13:30:00.000
71,72,2019-05-14 17:45:00,0,3.8,0,0,27.8,91,72,21.0,2019-05-14 13:45:00.000
72,73,2019-05-14 18:00:00,0,3.7,0,0,27.8,94,72,17.1,2019-05-14 14:00:00.000
73,74,2019-05-14 18:15:00,0,3.5,0,0,27.7,98,71,0.0,2019-05-14 14:15:00.000
74,75,2019-05-14 18:30:00,0,3.4,0,0,27.7,101,71,0.0,2019-05-14 14:30:00.000
75,76,2019-05-14 18:45:00,0,3.3,0,0,27.6,105,71,0.0,2019-05-14 14:45:00.000
76,77,2019-05-14 19:00:00,0,3.1,0,0,27.6,108,70,0.0,2019-05-14 15:00:00.000
77,78,2019-05-14 19:15:00,0,3.0,0,0,27.5,112,70,0.0,2019-05-14 15:15:00.000
78,79,2019-05-14 19:30:00,0,2.9,0,0,27.5,115,69,0.0,2019-05-14 15:30:00.000
79,80,2019-05-14 19:45:00,0,2.8,0,0,27.4,119,69,0.0,2019-05-14 15:45:00.000
80,81,2019-05-14 20:00:00,0,2.7,0,0,27.4,122,68,0.0,2019-05-14 16:00:00.000
81,82,2019-05-14 20:15:00,0,2.6,0,0,27.4,126,67,0.0,2019-05-14 16:15:00.000
82,83,2019-05-14 20:30:00,0,2.6,0,0,27.4,129,66,0.0,2019-05-14 16:30:00.000
83,84,2019-05-14 20:45:00,0,2.6,0,0,27.4,133,64,0.0,2019-05-14 16:45:00.000
84,85,2019-05-14 21:00:00,0,2.6,0,0,27.4,136,62,0.0,2019-05-14 17:00:00.000
85,86,2019-05-14 21:15:00,0,2.5,0,0,27.4,139,60,0.0,2019-05-14 17:15:00.000
86,87,2019-05-14 21:30:00,0,2.5,0,0,27.4,142,58,0.0,2019-05-14 17:30:00.000
87,88,2019-05-14 21:45:00,0,2.5,0,0,27.4,146,55,0.0,2019-05-14 17:45:00.000
88,89,2019-05-14 22:00:00,0,2.5,0,0,27.5,149,52,0.0,2019-05-14 18:00:00.000
89,90,2019-05-14 22:15:00,0,2.4,0,0,27.5,151,47,0.0,2019-05-14 18:15:00.000
90,91,2019-05-14 22:30:00,0,2.4,0,0,27.5,154,42,0.0,2019-05-14 18:30:00.000
91,92,2019-05-14 22:45:00,0,2.4,0,0,27.5,156,36,0.0,2019-05-14 18:45:00.000
92,93,2019-05-14 23:00:00,0,2.4,0,0,27.5,158,28,0.0,2019-05-14 19:00:00.000
93,94,2019-05-14 23:15:00,0,2.4,0,0,27.4,160,19,0.0,2019-05-14 19:15:00.000
94,95,2019-05-14 23:30:00,0,2.3,0,0,27.4,161,8,0.0,2019-05-14 19:30:00.000
95,96,2019-05-14 23:45:00,0,2.3,0,0,27.3,161,-2,0.0,2019-05-14 19:45:00.000
