,BLOCK_ID,DATA_DATETIME,GHI,WIND_SPEED,DNI,DHI,TEMPERATURE,ZENITH,AZIMUTH,CLOUD_OPACITY,ENTRY_TIME
0,1,2021-05-24 00:00:00,0,0.4,0,0,22.8,159,-12,43.8,2021-05-23 20:00:00.000
1,2,2021-05-24 00:15:00,0,0.4,0,0,22.8,157,-21,46.1,2021-05-23 20:15:00.000
2,3,2021-05-24 00:30:00,0,0.4,0,0,22.8,156,-28,48.8,2021-05-23 20:30:00.000
3,4,2021-05-24 00:45:00,0,0.4,0,0,22.8,154,-35,55.9,2021-05-23 20:45:00.000
4,5,2021-05-24 01:00:00,0,0.4,0,0,22.8,152,-41,59.6,2021-05-23 21:00:00.000
5,6,2021-05-24 01:15:00,0,0.4,0,0,22.8,149,-46,48.8,2021-05-23 21:15:00.000
6,7,2021-05-24 01:30:00,0,0.3,0,0,22.7,146,-50,61.6,2021-05-23 21:30:00.000
7,8,2021-05-24 01:45:00,0,0.3,0,0,22.7,143,-53,62.0,2021-05-23 21:45:00.000
8,9,2021-05-24 02:00:00,0,0.3,0,0,22.7,140,-56,59.6,2021-05-23 22:00:00.000
9,10,2021-05-24 02:15:00,0,0.4,0,0,22.7,137,-58,44.1,2021-05-23 22:15:00.000
10,11,2021-05-24 02:30:00,0,0.4,0,0,22.7,134,-60,43.0,2021-05-23 22:30:00.000
11,12,2021-05-24 02:45:00,0,0.4,0,0,22.7,131,-62,47.5,2021-05-23 22:45:00.000
12,13,2021-05-24 03:00:00,0,0.4,0,0,22.7,127,-64,25.4,2021-05-23 23:00:00.000
13,14,2021-05-24 03:15:00,0,0.4,0,0,22.7,124,-65,21.6,2021-05-23 23:15:00.000
14,15,2021-05-24 03:30:00,0,0.4,0,0,22.7,120,-66,22.6,2021-05-23 23:30:00.000
15,16,2021-05-24 03:45:00,0,0.3,0,0,22.6,117,-67,28.2,2021-05-23 23:45:00.000
16,17,2021-05-24 04:00:00,0,0.3,0,0,22.6,114,-67,37.6,2021-05-24 00:00:00.000
17,18,2021-05-24 04:15:00,0,0.3,0,0,22.6,110,-68,48.3,2021-05-24 00:15:00.000
18,19,2021-05-24 04:30:00,0,0.3,0,0,22.6,107,-68,44.6,2021-05-24 00:30:00.000
19,20,2021-05-24 04:45:00,0,0.3,0,0,22.5,103,-69,36.9,2021-05-24 00:45:00.000
20,21,2021-05-24 05:00:00,0,0.2,0,0,22.5,100,-69,24.2,2021-05-24 01:00:00.000
21,22,2021-05-24 05:15:00,0,0.2,0,0,22.5,96,-69,37.1,2021-05-24 01:15:00.000
22,23,2021-05-24 05:30:00,0,0.1,0,0,22.5,93,-70,41.6,2021-05-24 01:30:00.000
23,24,2021-05-24 05:45:00,3,0.1,0,3,22.5,89,-70,45.4,2021-05-24 01:45:00.000
24,25,2021-05-24 06:00:00,32,0.1,18,31,22.6,86,-70,25.1,2021-05-24 02:00:00.000
25,26,2021-05-24 06:15:00,72,0.1,102,58,23.0,82,-69,16.4,2021-05-24 02:15:00.000
26,27,2021-05-24 06:30:00,109,0.2,99,90,23.3,79,-69,20.6,2021-05-24 02:30:00.000
27,28,2021-05-24 06:45:00,154,0.3,144,116,23.7,75,-69,20.2,2021-05-24 02:45:00.000
28,29,2021-05-24 07:00:00,205,0.4,216,137,24.0,72,-69,17.6,2021-05-24 03:00:00.000
29,30,2021-05-24 07:15:00,261,0.5,300,150,24.5,68,-68,14.7,2021-05-24 03:15:00.000
30,31,2021-05-24 07:30:00,242,0.5,38,227,24.9,65,-68,33.0,2021-05-24 03:30:00.000
31,32,2021-05-24 07:45:00,208,0.5,0,208,25.4,61,-67,50.4,2021-05-24 03:45:00.000
32,33,2021-05-24 08:00:00,214,0.6,0,214,25.8,58,-66,54.6,2021-05-24 04:00:00.000
33,34,2021-05-24 08:15:00,278,0.7,0,278,26.2,54,-65,47.1,2021-05-24 04:15:00.000
34,35,2021-05-24 08:30:00,295,0.8,0,295,26.6,51,-64,48.8,2021-05-24 04:30:00.000
35,36,2021-05-24 08:45:00,426,0.9,62,384,26.9,48,-62,31.8,2021-05-24 04:45:00.000
36,37,2021-05-24 09:00:00,497,1.0,169,376,27.3,44,-61,25.8,2021-05-24 05:00:00.000
37,38,2021-05-24 09:15:00,573,1.0,310,338,27.4,41,-59,19.5,2021-05-24 05:15:00.000
38,39,2021-05-24 09:30:00,670,1.1,514,265,27.6,38,-56,10.6,2021-05-24 05:30:00.000
39,40,2021-05-24 09:45:00,724,1.1,602,229,27.8,35,-53,7.7,2021-05-24 05:45:00.000
40,41,2021-05-24 10:00:00,815,1.1,823,116,27.9,32,-50,0.0,2021-05-24 06:00:00.000
41,42,2021-05-24 10:15:00,843,1.2,829,119,28.0,29,-46,0.0,2021-05-24 06:15:00.000
42,43,2021-05-24 10:30:00,824,1.3,691,206,28.0,27,-40,4.8,2021-05-24 06:30:00.000
43,44,2021-05-24 10:45:00,779,1.4,500,323,28.1,24,-34,11.9,2021-05-24 06:45:00.000
44,45,2021-05-24 11:00:00,684,1.5,231,471,28.1,22,-27,23.8,2021-05-24 07:00:00.000
45,46,2021-05-24 11:15:00,698,1.5,241,473,28.2,21,-18,23.1,2021-05-24 07:15:00.000
46,47,2021-05-24 11:30:00,751,1.5,356,416,28.2,20,-8,17.8,2021-05-24 07:30:00.000
47,48,2021-05-24 11:45:00,730,1.5,311,437,28.2,20,2,20.2,2021-05-24 07:45:00.000
48,49,2021-05-24 12:00:00,573,1.5,22,552,28.3,20,12,37.2,2021-05-24 08:00:00.000
49,50,2021-05-24 12:15:00,545,1.5,22,524,28.3,21,21,39.7,2021-05-24 08:15:00.000
50,51,2021-05-24 12:30:00,650,1.5,160,502,28.4,23,30,27.2,2021-05-24 08:30:00.000
51,52,2021-05-24 12:45:00,583,1.5,52,536,28.4,25,37,33.5,2021-05-24 08:45:00.000
52,53,2021-05-24 13:00:00,546,1.5,9,538,28.5,27,43,36.2,2021-05-24 09:00:00.000
53,54,2021-05-24 13:15:00,612,1.4,171,464,28.5,30,47,26.3,2021-05-24 09:15:00.000
54,55,2021-05-24 13:30:00,515,1.3,31,488,28.5,33,51,35.8,2021-05-24 09:30:00.000
55,56,2021-05-24 13:45:00,553,1.3,147,436,28.5,36,55,27.9,2021-05-24 09:45:00.000
56,57,2021-05-24 14:00:00,655,1.2,506,263,28.5,39,57,10.4,2021-05-24 10:00:00.000
57,58,2021-05-24 14:15:00,588,1.1,388,302,28.4,42,59,14.8,2021-05-24 10:15:00.000
58,59,2021-05-24 14:30:00,549,0.9,370,290,28.4,46,61,15.2,2021-05-24 10:30:00.000
59,60,2021-05-24 14:45:00,579,0.8,645,155,28.4,49,63,3.7,2021-05-24 10:45:00.000
60,61,2021-05-24 15:00:00,549,0.7,715,112,28.3,52,64,0.6,2021-05-24 11:00:00.000
61,62,2021-05-24 15:15:00,357,0.6,129,283,28.1,56,65,29.0,2021-05-24 11:15:00.000
62,63,2021-05-24 15:30:00,192,0.6,0,192,28.0,59,66,57.4,2021-05-24 11:30:00.000
63,64,2021-05-24 15:45:00,127,0.5,0,127,27.8,62,67,67.5,2021-05-24 11:45:00.000
64,65,2021-05-24 16:00:00,201,0.5,0,201,27.6,66,68,40.0,2021-05-24 12:00:00.000
65,66,2021-05-24 16:15:00,153,0.5,0,153,27.3,69,68,45.3,2021-05-24 12:15:00.000
66,67,2021-05-24 16:30:00,126,0.4,0,126,27.0,73,69,43.8,2021-05-24 12:30:00.000
67,68,2021-05-24 16:45:00,119,0.4,8,117,26.7,76,69,29.5,2021-05-24 12:45:00.000
68,69,2021-05-24 17:00:00,83,0.5,0,83,26.3,80,69,27.4,2021-05-24 13:00:00.000
69,70,2021-05-24 17:15:00,41,0.5,0,41,25.9,83,69,40.6,2021-05-24 13:15:00.000
70,71,2021-05-24 17:30:00,6,0.6,0,6,25.5,87,69,80.6,2021-05-24 13:30:00.000
71,72,2021-05-24 17:45:00,0,0.7,0,0,25.0,90,69,97.0,2021-05-24 13:45:00.000
72,73,2021-05-24 18:00:00,0,0.7,0,0,24.7,94,69,97.0,2021-05-24 14:00:00.000
73,74,2021-05-24 18:15:00,0,0.8,0,0,24.6,97,69,84.2,2021-05-24 14:15:00.000
74,75,2021-05-24 18:30:00,0,1.0,0,0,24.5,101,69,73.0,2021-05-24 14:30:00.000
75,76,2021-05-24 18:45:00,0,1.1,0,0,24.4,104,69,72.7,2021-05-24 14:45:00.000
76,77,2021-05-24 19:00:00,0,1.1,0,0,24.3,108,68,63.0,2021-05-24 15:00:00.000
77,78,2021-05-24 19:15:00,0,1.2,0,0,24.2,111,68,53.8,2021-05-24 15:15:00.000
78,79,2021-05-24 19:30:00,0,1.2,0,0,24.1,115,67,62.0,2021-05-24 15:30:00.000
79,80,2021-05-24 19:45:00,0,1.2,0,0,24.1,118,66,74.1,2021-05-24 15:45:00.000
80,81,2021-05-24 20:00:00,0,1.2,0,0,24.0,122,65,76.0,2021-05-24 16:00:00.000
81,82,2021-05-24 20:15:00,0,1.2,0,0,24.0,125,64,83.0,2021-05-24 16:15:00.000
82,83,2021-05-24 20:30:00,0,1.2,0,0,24.0,128,63,89.4,2021-05-24 16:30:00.000
83,84,2021-05-24 20:45:00,0,1.2,0,0,23.9,132,61,90.5,2021-05-24 16:45:00.000
84,85,2021-05-24 21:00:00,0,1.2,0,0,23.9,135,59,93.2,2021-05-24 17:00:00.000
85,86,2021-05-24 21:15:00,0,1.2,0,0,23.9,138,57,94.9,2021-05-24 17:15:00.000
86,87,2021-05-24 21:30:00,0,1.2,0,0,23.9,141,55,97.0,2021-05-24 17:30:00.000
87,88,2021-05-24 21:45:00,0,1.2,0,0,23.9,144,52,91.9,2021-05-24 17:45:00.000
88,89,2021-05-24 22:00:00,0,1.2,0,0,23.9,147,48,57.1,2021-05-24 18:00:00.000
89,90,2021-05-24 22:15:00,0,1.2,0,0,23.9,150,44,93.5,2021-05-24 18:15:00.000
90,91,2021-05-24 22:30:00,0,1.2,0,0,23.9,152,39,67.4,2021-05-24 18:30:00.000
91,92,2021-05-24 22:45:00,0,1.2,0,0,23.9,155,33,55.0,2021-05-24 18:45:00.000
92,93,2021-05-24 23:00:00,0,1.2,0,0,23.8,156,25,43.2,2021-05-24 19:00:00.000
93,94,2021-05-24 23:15:00,0,1.2,0,0,23.8,158,17,16.0,2021-05-24 19:15:00.000
94,95,2021-05-24 23:30:00,0,1.3,0,0,23.8,159,8,13.6,2021-05-24 19:30:00.000
95,96,2021-05-24 23:45:00,0,1.3,0,0,23.8,159,-2,62.8,2021-05-24 19:45:00.000
