,BLOCK_ID,DATA_DATETIME,GHI,WIND_SPEED,DNI,DHI,TEMPERATURE,ZENITH,AZIMUTH,CLOUD_OPACITY,ENTRY_TIME
0,1,2019-10-09 00:00:00,0,0.6,0,0,22.3,172,-126,0.0,2019-10-08 20:00:00.000
1,2,2019-10-09 00:15:00,0,0.6,0,0,22.2,168,-115,0.0,2019-10-08 20:15:00.000
2,3,2019-10-09 00:30:00,0,0.7,0,0,22.2,165,-109,0.0,2019-10-08 20:30:00.000
3,4,2019-10-09 00:45:00,0,0.7,0,0,22.1,161,-105,0.0,2019-10-08 20:45:00.000
4,5,2019-10-09 01:00:00,0,0.7,0,0,22.1,158,-103,0.0,2019-10-08 21:00:00.000
5,6,2019-10-09 01:15:00,0,0.6,0,0,22.0,154,-101,0.0,2019-10-08 21:15:00.000
6,7,2019-10-09 01:30:00,0,0.6,0,0,22.0,150,-100,0.0,2019-10-08 21:30:00.000
7,8,2019-10-09 01:45:00,0,0.5,0,0,22.0,147,-99,0.0,2019-10-08 21:45:00.000
8,9,2019-10-09 02:00:00,0,0.5,0,0,21.9,143,-98,0.0,2019-10-08 22:00:00.000
9,10,2019-10-09 02:15:00,0,0.4,0,0,21.9,139,-98,0.0,2019-10-08 22:15:00.000
10,11,2019-10-09 02:30:00,0,0.4,0,0,21.8,136,-97,0.0,2019-10-08 22:30:00.000
11,12,2019-10-09 02:45:00,0,0.4,0,0,21.8,132,-97,0.0,2019-10-08 22:45:00.000
12,13,2019-10-09 03:00:00,0,0.3,0,0,21.7,128,-96,0.0,2019-10-08 23:00:00.000
13,14,2019-10-09 03:15:00,0,0.4,0,0,21.7,124,-96,0.0,2019-10-08 23:15:00.000
14,15,2019-10-09 03:30:00,0,0.4,0,0,21.7,121,-96,0.0,2019-10-08 23:30:00.000
15,16,2019-10-09 03:45:00,0,0.4,0,0,21.7,117,-96,0.0,2019-10-08 23:45:00.000
16,17,2019-10-09 04:00:00,0,0.4,0,0,21.6,113,-96,0.0,2019-10-09 00:00:00.000
17,18,2019-10-09 04:15:00,0,0.5,0,0,21.6,109,-96,0.0,2019-10-09 00:15:00.000
18,19,2019-10-09 04:30:00,0,0.5,0,0,21.6,106,-96,0.0,2019-10-09 00:30:00.000
19,20,2019-10-09 04:45:00,0,0.5,0,0,21.6,102,-96,0.0,2019-10-09 00:45:00.000
20,21,2019-10-09 05:00:00,0,0.5,0,0,21.7,98,-95,0.0,2019-10-09 01:00:00.000
21,22,2019-10-09 05:15:00,0,0.5,0,0,21.9,95,-95,0.0,2019-10-09 01:15:00.000
22,23,2019-10-09 05:30:00,0,0.5,0,0,22.1,91,-96,0.0,2019-10-09 01:30:00.000
23,24,2019-10-09 05:45:00,24,0.5,85,17,22.2,87,-96,0.0,2019-10-09 01:45:00.000
24,25,2019-10-09 06:00:00,68,0.5,279,34,22.5,83,-96,0.0,2019-10-09 02:00:00.000
25,26,2019-10-09 06:15:00,122,0.6,404,48,22.9,80,-96,0.0,2019-10-09 02:15:00.000
26,27,2019-10-09 06:30:00,181,0.7,498,59,23.3,76,-96,0.0,2019-10-09 02:30:00.000
27,28,2019-10-09 06:45:00,243,0.7,570,68,23.7,72,-96,0.0,2019-10-09 02:45:00.000
28,29,2019-10-09 07:00:00,306,0.8,627,75,24.2,68,-96,0.0,2019-10-09 03:00:00.000
29,30,2019-10-09 07:15:00,369,1.0,673,81,25.0,65,-96,0.0,2019-10-09 03:15:00.000
30,31,2019-10-09 07:30:00,432,1.1,712,86,25.9,61,-97,0.0,2019-10-09 03:30:00.000
31,32,2019-10-09 07:45:00,493,1.2,743,91,26.8,57,-97,0.0,2019-10-09 03:45:00.000
32,33,2019-10-09 08:00:00,553,1.4,771,94,27.6,53,-97,0.0,2019-10-09 04:00:00.000
33,34,2019-10-09 08:15:00,610,1.5,793,98,28.0,50,-98,0.0,2019-10-09 04:15:00.000
34,35,2019-10-09 08:30:00,664,1.7,812,101,28.4,46,-98,0.0,2019-10-09 04:30:00.000
35,36,2019-10-09 08:45:00,715,1.8,828,103,28.8,42,-99,0.0,2019-10-09 04:45:00.000
36,37,2019-10-09 09:00:00,763,2.0,841,106,29.1,39,-100,0.0,2019-10-09 05:00:00.000
37,38,2019-10-09 09:15:00,807,2.2,853,108,29.4,35,-101,0.0,2019-10-09 05:15:00.000
38,39,2019-10-09 09:30:00,847,2.3,863,110,29.7,31,-102,0.0,2019-10-09 05:30:00.000
39,40,2019-10-09 09:45:00,883,2.5,870,112,30.0,28,-103,0.0,2019-10-09 05:45:00.000
40,41,2019-10-09 10:00:00,915,2.7,876,114,30.2,24,-105,0.0,2019-10-09 06:00:00.000
41,42,2019-10-09 10:15:00,858,2.8,611,285,30.4,20,-108,9.0,2019-10-09 06:15:00.000
42,43,2019-10-09 10:30:00,951,3.0,839,148,30.5,17,-112,1.5,2019-10-09 06:30:00.000
43,44,2019-10-09 10:45:00,983,3.1,887,120,30.7,13,-118,0.0,2019-10-09 06:45:00.000
44,45,2019-10-09 11:00:00,996,3.2,888,122,30.8,10,-128,0.0,2019-10-09 07:00:00.000
45,46,2019-10-09 11:15:00,1004,3.2,888,124,30.8,8,-145,0.0,2019-10-09 07:15:00.000
46,47,2019-10-09 11:30:00,1007,3.2,887,125,30.9,6,-174,0.0,2019-10-09 07:30:00.000
47,48,2019-10-09 11:45:00,1005,3.2,886,126,31.0,7,155,0.0,2019-10-09 07:45:00.000
48,49,2019-10-09 12:00:00,999,3.2,884,126,31.0,9,133,0.0,2019-10-09 08:00:00.000
49,50,2019-10-09 12:15:00,987,3.1,881,126,31.1,12,121,0.0,2019-10-09 08:15:00.000
50,51,2019-10-09 12:30:00,971,3.0,877,126,31.1,16,114,0.0,2019-10-09 08:30:00.000
51,52,2019-10-09 12:45:00,950,3.0,873,126,31.1,19,109,0.0,2019-10-09 08:45:00.000
52,53,2019-10-09 13:00:00,925,2.9,867,125,31.1,23,106,0.0,2019-10-09 09:00:00.000
53,54,2019-10-09 13:15:00,895,3.0,860,124,31.0,26,104,0.0,2019-10-09 09:15:00.000
54,55,2019-10-09 13:30:00,860,3.1,850,124,31.0,30,103,0.0,2019-10-09 09:30:00.000
55,56,2019-10-09 13:45:00,820,3.1,835,125,30.9,34,101,0.0,2019-10-09 09:45:00.000
56,57,2019-10-09 14:00:00,777,3.1,818,126,30.8,37,100,0.0,2019-10-09 10:00:00.000
57,58,2019-10-09 14:15:00,729,3.0,798,127,30.7,41,99,0.0,2019-10-09 10:15:00.000
58,59,2019-10-09 14:30:00,679,2.8,778,125,30.6,45,99,0.0,2019-10-09 10:30:00.000
59,60,2019-10-09 14:45:00,626,2.6,761,121,30.5,48,98,0.0,2019-10-09 10:45:00.000
60,61,2019-10-09 15:00:00,570,2.4,741,116,30.3,52,98,0.0,2019-10-09 11:00:00.000
61,62,2019-10-09 15:15:00,512,2.2,717,110,30.0,56,97,0.0,2019-10-09 11:15:00.000
62,63,2019-10-09 15:30:00,452,2.1,689,103,29.8,60,97,0.0,2019-10-09 11:30:00.000
63,64,2019-10-09 15:45:00,391,1.9,655,96,29.5,63,97,0.0,2019-10-09 11:45:00.000
64,65,2019-10-09 16:00:00,328,1.8,614,88,29.2,67,96,0.0,2019-10-09 12:00:00.000
65,66,2019-10-09 16:15:00,265,1.6,563,79,28.8,71,96,0.0,2019-10-09 12:15:00.000
66,67,2019-10-09 16:30:00,203,1.4,499,69,28.3,74,96,0.0,2019-10-09 12:30:00.000
67,68,2019-10-09 16:45:00,142,1.2,416,57,27.9,78,96,0.0,2019-10-09 12:45:00.000
68,69,2019-10-09 17:00:00,81,1.0,206,51,27.3,82,96,6.5,2019-10-09 13:00:00.000
69,70,2019-10-09 17:15:00,36,1.0,77,29,26.6,86,96,6.2,2019-10-09 13:15:00.000
70,71,2019-10-09 17:30:00,4,1.0,11,4,25.7,89,96,0.0,2019-10-09 13:30:00.000
71,72,2019-10-09 17:45:00,0,1.0,0,0,24.9,93,96,0.0,2019-10-09 13:45:00.000
72,73,2019-10-09 18:00:00,0,1.0,0,0,24.3,97,96,0.0,2019-10-09 14:00:00.000
73,74,2019-10-09 18:15:00,0,1.0,0,0,24.1,101,96,0.0,2019-10-09 14:15:00.000
74,75,2019-10-09 18:30:00,0,0.9,0,0,23.9,104,96,0.0,2019-10-09 14:30:00.000
75,76,2019-10-09 18:45:00,0,0.9,0,0,23.7,108,96,0.0,2019-10-09 14:45:00.000
76,77,2019-10-09 19:00:00,0,0.9,0,0,23.5,112,96,0.0,2019-10-09 15:00:00.000
77,78,2019-10-09 19:15:00,0,0.8,0,0,23.4,115,96,0.0,2019-10-09 15:15:00.000
78,79,2019-10-09 19:30:00,0,0.8,0,0,23.3,119,96,0.0,2019-10-09 15:30:00.000
79,80,2019-10-09 19:45:00,0,0.8,0,0,23.3,123,96,0.0,2019-10-09 15:45:00.000
80,81,2019-10-09 20:00:00,0,0.8,0,0,23.2,127,97,0.0,2019-10-09 16:00:00.000
81,82,2019-10-09 20:15:00,0,0.8,0,0,23.1,130,97,0.0,2019-10-09 16:15:00.000
82,83,2019-10-09 20:30:00,0,0.8,0,0,23.0,134,97,0.0,2019-10-09 16:30:00.000
83,84,2019-10-09 20:45:00,0,0.8,0,0,22.9,138,98,0.0,2019-10-09 16:45:00.000
84,85,2019-10-09 21:00:00,0,0.7,0,0,22.8,142,99,0.0,2019-10-09 17:00:00.000
85,86,2019-10-09 21:15:00,0,0.7,0,0,22.7,145,99,0.0,2019-10-09 17:15:00.000
86,87,2019-10-09 21:30:00,0,0.7,0,0,22.6,149,100,0.0,2019-10-09 17:30:00.000
87,88,2019-10-09 21:45:00,0,0.6,0,0,22.6,153,101,0.0,2019-10-09 17:45:00.000
88,89,2019-10-09 22:00:00,0,0.6,0,0,22.5,156,103,0.0,2019-10-09 18:00:00.000
89,90,2019-10-09 22:15:00,0,0.5,0,0,22.4,160,105,0.0,2019-10-09 18:15:00.000
90,91,2019-10-09 22:30:00,0,0.5,0,0,22.4,164,109,0.0,2019-10-09 18:30:00.000
91,92,2019-10-09 22:45:00,0,0.5,0,0,22.3,167,114,0.0,2019-10-09 18:45:00.000
92,93,2019-10-09 23:00:00,0,0.5,0,0,22.3,170,123,0.0,2019-10-09 19:00:00.000
93,94,2019-10-09 23:15:00,0,0.5,0,0,22.2,173,140,0.0,2019-10-09 19:15:00.000
94,95,2019-10-09 23:30:00,0,0.6,0,0,22.2,175,173,0.0,2019-10-09 19:30:00.000
95,96,2019-10-09 23:45:00,0,0.6,0,0,22.1,174,-151,0.0,2019-10-09 19:45:00.000
