,BLOCK_ID,DATA_DATETIME,GHI,WIND_SPEED,DNI,DHI,TEMPERATURE,ZENITH,AZIMUTH,CLOUD_OPACITY,ENTRY_TIME
0,1,2020-06-13 00:00:00,0,0.2,0,0,22.8,156,-8,50.2,2020-06-12 20:00:00.000
1,2,2020-06-13 00:15:00,0,0.2,0,0,22.8,155,-16,41.9,2020-06-12 20:15:00.000
2,3,2020-06-13 00:30:00,0,0.3,0,0,22.8,154,-24,40.2,2020-06-12 20:30:00.000
3,4,2020-06-13 00:45:00,0,0.3,0,0,22.8,152,-30,38.6,2020-06-12 20:45:00.000
4,5,2020-06-13 01:00:00,0,0.3,0,0,22.7,150,-36,25.0,2020-06-12 21:00:00.000
5,6,2020-06-13 01:15:00,0,0.2,0,0,22.8,148,-41,35.6,2020-06-12 21:15:00.000
6,7,2020-06-13 01:30:00,0,0.2,0,0,22.8,145,-45,45.0,2020-06-12 21:30:00.000
7,8,2020-06-13 01:45:00,0,0.1,0,0,22.9,142,-49,52.9,2020-06-12 21:45:00.000
8,9,2020-06-13 02:00:00,0,0.1,0,0,22.9,140,-52,49.4,2020-06-12 22:00:00.000
9,10,2020-06-13 02:15:00,0,0.1,0,0,22.9,137,-54,52.2,2020-06-12 22:15:00.000
10,11,2020-06-13 02:30:00,0,0.1,0,0,23.0,133,-56,51.8,2020-06-12 22:30:00.000
11,12,2020-06-13 02:45:00,0,0.1,0,0,23.0,130,-58,52.0,2020-06-12 22:45:00.000
12,13,2020-06-13 03:00:00,0,0.2,0,0,23.0,127,-60,45.6,2020-06-12 23:00:00.000
13,14,2020-06-13 03:15:00,0,0.2,0,0,22.9,124,-61,48.5,2020-06-12 23:15:00.000
14,15,2020-06-13 03:30:00,0,0.3,0,0,22.9,120,-62,54.7,2020-06-12 23:30:00.000
15,16,2020-06-13 03:45:00,0,0.3,0,0,22.8,117,-63,60.7,2020-06-12 23:45:00.000
16,17,2020-06-13 04:00:00,0,0.3,0,0,22.8,114,-64,49.6,2020-06-13 00:00:00.000
17,18,2020-06-13 04:15:00,0,0.3,0,0,22.8,110,-65,67.2,2020-06-13 00:15:00.000
18,19,2020-06-13 04:30:00,0,0.3,0,0,22.8,107,-65,82.8,2020-06-13 00:30:00.000
19,20,2020-06-13 04:45:00,0,0.3,0,0,22.7,104,-66,78.2,2020-06-13 00:45:00.000
20,21,2020-06-13 05:00:00,0,0.4,0,0,22.7,100,-66,68.6,2020-06-13 01:00:00.000
21,22,2020-06-13 05:15:00,0,0.4,0,0,22.8,97,-67,78.2,2020-06-13 01:15:00.000
22,23,2020-06-13 05:30:00,0,0.3,0,0,22.8,93,-67,81.4,2020-06-13 01:30:00.000
23,24,2020-06-13 05:45:00,1,0.3,0,1,22.8,90,-67,78.5,2020-06-13 01:45:00.000
24,25,2020-06-13 06:00:00,12,0.3,0,12,23.0,86,-67,62.8,2020-06-13 02:00:00.000
25,26,2020-06-13 06:15:00,46,0.3,0,46,23.3,83,-67,35.7,2020-06-13 02:15:00.000
26,27,2020-06-13 06:30:00,82,0.2,0,82,23.6,79,-67,31.8,2020-06-13 02:30:00.000
27,28,2020-06-13 06:45:00,119,0.1,7,117,23.9,76,-66,31.5,2020-06-13 02:45:00.000
28,29,2020-06-13 07:00:00,163,0.1,36,153,24.3,73,-66,28.0,2020-06-13 03:00:00.000
29,30,2020-06-13 07:15:00,200,0.1,40,185,24.9,69,-65,29.1,2020-06-13 03:15:00.000
30,31,2020-06-13 07:30:00,251,0.3,110,206,25.5,66,-65,25.4,2020-06-13 03:30:00.000
31,32,2020-06-13 07:45:00,250,0.5,7,247,26.0,62,-64,36.0,2020-06-13 03:45:00.000
32,33,2020-06-13 08:00:00,238,0.6,0,238,26.7,59,-63,46.2,2020-06-13 04:00:00.000
33,34,2020-06-13 08:15:00,243,0.5,0,243,27.4,56,-62,50.9,2020-06-13 04:15:00.000
34,35,2020-06-13 08:30:00,249,0.3,0,249,28.1,52,-61,54.1,2020-06-13 04:30:00.000
35,36,2020-06-13 08:45:00,282,0.2,0,282,28.8,49,-59,52.5,2020-06-13 04:45:00.000
36,37,2020-06-13 09:00:00,368,0.1,0,368,29.4,46,-58,42.0,2020-06-13 05:00:00.000
37,38,2020-06-13 09:15:00,380,0.2,0,380,29.9,43,-55,43.8,2020-06-13 05:15:00.000
38,39,2020-06-13 09:30:00,441,0.3,5,437,30.3,40,-53,38.4,2020-06-13 05:30:00.000
39,40,2020-06-13 09:45:00,627,0.4,374,327,30.7,37,-50,16.3,2020-06-13 05:45:00.000
40,41,2020-06-13 10:00:00,740,0.5,657,195,31.0,34,-47,5.2,2020-06-13 06:00:00.000
41,42,2020-06-13 10:15:00,725,0.6,529,273,31.0,31,-43,10.3,2020-06-13 06:15:00.000
42,43,2020-06-13 10:30:00,684,0.7,362,368,31.0,29,-38,17.6,2020-06-13 06:30:00.000
43,44,2020-06-13 10:45:00,731,0.8,441,338,31.0,27,-32,13.9,2020-06-13 06:45:00.000
44,45,2020-06-13 11:00:00,736,0.9,418,357,31.0,25,-25,14.8,2020-06-13 07:00:00.000
45,46,2020-06-13 11:15:00,750,1.0,434,353,30.9,24,-18,14.1,2020-06-13 07:15:00.000
46,47,2020-06-13 11:30:00,802,1.1,567,280,30.8,23,-9,8.8,2020-06-13 07:30:00.000
47,48,2020-06-13 11:45:00,603,1.2,81,528,30.7,23,0,31.6,2020-06-13 07:45:00.000
48,49,2020-06-13 12:00:00,665,1.3,207,474,30.6,23,9,24.4,2020-06-13 08:00:00.000
49,50,2020-06-13 12:15:00,609,1.2,110,508,30.5,24,17,30.3,2020-06-13 08:15:00.000
50,51,2020-06-13 12:30:00,487,1.2,0,487,30.4,25,25,43.6,2020-06-13 08:30:00.000
51,52,2020-06-13 12:45:00,564,1.1,57,514,30.3,27,32,33.4,2020-06-13 08:45:00.000
52,53,2020-06-13 13:00:00,628,1.1,205,449,30.0,29,37,24.2,2020-06-13 09:00:00.000
53,54,2020-06-13 13:15:00,628,1.0,246,418,29.6,31,42,22.0,2020-06-13 09:15:00.000
54,55,2020-06-13 13:30:00,694,0.8,502,279,29.0,34,46,10.8,2020-06-13 09:30:00.000
55,56,2020-06-13 13:45:00,536,0.7,120,440,28.5,37,50,28.2,2020-06-13 09:45:00.000
56,57,2020-06-13 14:00:00,530,0.6,162,405,28.1,40,53,25.4,2020-06-13 10:00:00.000
57,58,2020-06-13 14:15:00,518,0.6,200,372,27.9,43,55,22.8,2020-06-13 10:15:00.000
58,59,2020-06-13 14:30:00,488,0.5,197,351,27.7,46,57,22.4,2020-06-13 10:30:00.000
59,60,2020-06-13 14:45:00,480,0.5,279,298,27.5,49,59,17.8,2020-06-13 10:45:00.000
60,61,2020-06-13 15:00:00,415,0.5,172,309,27.3,52,61,23.0,2020-06-13 11:00:00.000
61,62,2020-06-13 15:15:00,314,0.5,12,308,27.2,56,62,35.6,2020-06-13 11:15:00.000
62,63,2020-06-13 15:30:00,286,0.4,8,281,27.1,59,63,34.8,2020-06-13 11:30:00.000
63,64,2020-06-13 15:45:00,372,0.4,532,122,27.1,62,64,3.6,2020-06-13 11:45:00.000
64,65,2020-06-13 16:00:00,278,0.4,236,180,27.0,66,65,16.0,2020-06-13 12:00:00.000
65,66,2020-06-13 16:15:00,221,0.4,139,170,26.8,69,65,20.4,2020-06-13 12:15:00.000
66,67,2020-06-13 16:30:00,131,0.5,8,129,26.6,72,66,41.2,2020-06-13 12:30:00.000
67,68,2020-06-13 16:45:00,65,0.5,0,65,26.4,76,66,61.3,2020-06-13 12:45:00.000
68,69,2020-06-13 17:00:00,63,0.6,0,63,26.2,79,66,45.2,2020-06-13 13:00:00.000
69,70,2020-06-13 17:15:00,61,0.7,122,44,25.8,83,67,14.7,2020-06-13 13:15:00.000
70,71,2020-06-13 17:30:00,23,0.7,0,23,25.4,86,67,23.0,2020-06-13 13:30:00.000
71,72,2020-06-13 17:45:00,3,0.8,0,3,25.0,90,67,29.1,2020-06-13 13:45:00.000
72,73,2020-06-13 18:00:00,0,0.9,0,0,24.7,93,67,26.2,2020-06-13 14:00:00.000
73,74,2020-06-13 18:15:00,0,0.9,0,0,24.6,97,67,28.6,2020-06-13 14:15:00.000
74,75,2020-06-13 18:30:00,0,0.9,0,0,24.6,100,66,26.8,2020-06-13 14:30:00.000
75,76,2020-06-13 18:45:00,0,0.9,0,0,24.5,103,66,27.7,2020-06-13 14:45:00.000
76,77,2020-06-13 19:00:00,0,0.9,0,0,24.4,107,65,27.0,2020-06-13 15:00:00.000
77,78,2020-06-13 19:15:00,0,0.8,0,0,24.4,110,65,26.1,2020-06-13 15:15:00.000
78,79,2020-06-13 19:30:00,0,0.8,0,0,24.4,114,64,24.0,2020-06-13 15:30:00.000
79,80,2020-06-13 19:45:00,0,0.7,0,0,24.4,117,63,23.9,2020-06-13 15:45:00.000
80,81,2020-06-13 20:00:00,0,0.6,0,0,24.4,120,62,23.6,2020-06-13 16:00:00.000
81,82,2020-06-13 20:15:00,0,0.6,0,0,24.4,124,61,18.7,2020-06-13 16:15:00.000
82,83,2020-06-13 20:30:00,0,0.6,0,0,24.3,127,60,16.4,2020-06-13 16:30:00.000
83,84,2020-06-13 20:45:00,0,0.7,0,0,24.2,130,58,16.0,2020-06-13 16:45:00.000
84,85,2020-06-13 21:00:00,0,0.7,0,0,24.2,133,57,15.2,2020-06-13 17:00:00.000
85,86,2020-06-13 21:15:00,0,0.7,0,0,24.1,136,54,18.0,2020-06-13 17:15:00.000
86,87,2020-06-13 21:30:00,0,0.7,0,0,24.1,139,52,18.8,2020-06-13 17:30:00.000
87,88,2020-06-13 21:45:00,0,0.8,0,0,24.0,142,49,18.3,2020-06-13 17:45:00.000
88,89,2020-06-13 22:00:00,0,0.8,0,0,24.0,145,45,20.6,2020-06-13 18:00:00.000
89,90,2020-06-13 22:15:00,0,0.8,0,0,23.9,148,41,19.3,2020-06-13 18:15:00.000
90,91,2020-06-13 22:30:00,0,0.8,0,0,23.9,150,36,18.4,2020-06-13 18:30:00.000
91,92,2020-06-13 22:45:00,0,0.8,0,0,23.8,152,31,19.0,2020-06-13 18:45:00.000
92,93,2020-06-13 23:00:00,0,0.8,0,0,23.8,154,24,19.0,2020-06-13 19:00:00.000
93,94,2020-06-13 23:15:00,0,0.7,0,0,23.8,155,17,23.9,2020-06-13 19:15:00.000
94,95,2020-06-13 23:30:00,0,0.7,0,0,23.8,156,9,38.8,2020-06-13 19:30:00.000
95,96,2020-06-13 23:45:00,0,0.6,0,0,23.7,156,0,47.9,2020-06-13 19:45:00.000
