,BLOCK_ID,DATA_DATETIME,GHI,WIND_SPEED,DNI,DHI,TEMPERATURE,ZENITH,AZIMUTH,CLOUD_OPACITY,ENTRY_TIME
0,1,2021-05-06 00:00:00,0,0.2,0,0,23.1,163,-15,64.0,2021-05-05 20:00:00.000
1,2,2021-05-06 00:15:00,0,0.3,0,0,23.1,162,-26,58.1,2021-05-05 20:15:00.000
2,3,2021-05-06 00:30:00,0,0.3,0,0,23.0,160,-35,52.8,2021-05-05 20:30:00.000
3,4,2021-05-06 00:45:00,0,0.4,0,0,23.0,157,-42,39.0,2021-05-05 20:45:00.000
4,5,2021-05-06 01:00:00,0,0.4,0,0,23.0,155,-48,31.2,2021-05-05 21:00:00.000
5,6,2021-05-06 01:15:00,0,0.5,0,0,22.9,152,-53,35.2,2021-05-05 21:15:00.000
6,7,2021-05-06 01:30:00,0,0.5,0,0,22.9,149,-57,29.8,2021-05-05 21:30:00.000
7,8,2021-05-06 01:45:00,0,0.5,0,0,22.9,145,-60,24.4,2021-05-05 21:45:00.000
8,9,2021-05-06 02:00:00,0,0.5,0,0,22.9,142,-62,21.4,2021-05-05 22:00:00.000
9,10,2021-05-06 02:15:00,0,0.5,0,0,22.8,139,-65,23.3,2021-05-05 22:15:00.000
10,11,2021-05-06 02:30:00,0,0.6,0,0,22.8,135,-66,34.4,2021-05-05 22:30:00.000
11,12,2021-05-06 02:45:00,0,0.6,0,0,22.8,132,-68,36.0,2021-05-05 22:45:00.000
12,13,2021-05-06 03:00:00,0,0.6,0,0,22.7,128,-69,36.0,2021-05-05 23:00:00.000
13,14,2021-05-06 03:15:00,0,0.5,0,0,22.7,125,-70,24.7,2021-05-05 23:15:00.000
14,15,2021-05-06 03:30:00,0,0.4,0,0,22.7,121,-71,33.6,2021-05-05 23:30:00.000
15,16,2021-05-06 03:45:00,0,0.3,0,0,22.7,118,-72,33.0,2021-05-05 23:45:00.000
16,17,2021-05-06 04:00:00,0,0.2,0,0,22.6,114,-72,25.2,2021-05-06 00:00:00.000
17,18,2021-05-06 04:15:00,0,0.2,0,0,22.6,111,-73,25.0,2021-05-06 00:15:00.000
18,19,2021-05-06 04:30:00,0,0.2,0,0,22.6,107,-73,23.4,2021-05-06 00:30:00.000
19,20,2021-05-06 04:45:00,0,0.2,0,0,22.6,104,-73,37.8,2021-05-06 00:45:00.000
20,21,2021-05-06 05:00:00,0,0.2,0,0,22.6,100,-74,39.6,2021-05-06 01:00:00.000
21,22,2021-05-06 05:15:00,0,0.2,0,0,22.7,96,-74,42.7,2021-05-06 01:15:00.000
22,23,2021-05-06 05:30:00,0,0.2,0,0,22.7,93,-74,46.4,2021-05-06 01:30:00.000
23,24,2021-05-06 05:45:00,4,0.2,0,4,22.7,89,-74,43.8,2021-05-06 01:45:00.000
24,25,2021-05-06 06:00:00,27,0.3,0,27,22.8,86,-74,34.6,2021-05-06 02:00:00.000
25,26,2021-05-06 06:15:00,67,0.3,23,63,23.2,82,-74,24.2,2021-05-06 02:15:00.000
26,27,2021-05-06 06:30:00,106,0.3,37,99,23.6,78,-74,24.8,2021-05-06 02:30:00.000
27,28,2021-05-06 06:45:00,177,0.3,303,96,24.0,75,-74,10.8,2021-05-06 02:45:00.000
28,29,2021-05-06 07:00:00,239,0.2,421,102,24.4,71,-73,7.2,2021-05-06 03:00:00.000
29,30,2021-05-06 07:15:00,305,0.2,555,95,24.8,68,-73,3.3,2021-05-06 03:15:00.000
30,31,2021-05-06 07:30:00,347,0.3,477,137,25.3,64,-72,7.8,2021-05-06 03:30:00.000
31,32,2021-05-06 07:45:00,363,0.4,309,211,25.8,60,-72,16.3,2021-05-06 03:45:00.000
32,33,2021-05-06 08:00:00,431,0.5,417,202,26.2,57,-71,12.2,2021-05-06 04:00:00.000
33,34,2021-05-06 08:15:00,466,0.5,378,238,26.6,53,-70,14.7,2021-05-06 04:15:00.000
34,35,2021-05-06 08:30:00,556,0.6,573,186,26.9,50,-69,7.0,2021-05-06 04:30:00.000
35,36,2021-05-06 08:45:00,647,0.7,782,107,27.3,46,-68,0.0,2021-05-06 04:45:00.000
36,37,2021-05-06 09:00:00,694,0.8,796,111,27.6,43,-67,0.0,2021-05-06 05:00:00.000
37,38,2021-05-06 09:15:00,737,0.8,807,114,27.9,39,-65,0.0,2021-05-06 05:15:00.000
38,39,2021-05-06 09:30:00,778,0.9,816,118,28.1,36,-63,0.0,2021-05-06 05:30:00.000
39,40,2021-05-06 09:45:00,814,0.9,824,121,28.3,33,-60,0.0,2021-05-06 05:45:00.000
40,41,2021-05-06 10:00:00,846,0.9,830,124,28.5,30,-57,0.0,2021-05-06 06:00:00.000
41,42,2021-05-06 10:15:00,874,1.0,836,126,28.7,26,-53,0.0,2021-05-06 06:15:00.000
42,43,2021-05-06 10:30:00,898,1.0,839,129,28.8,24,-48,0.0,2021-05-06 06:30:00.000
43,44,2021-05-06 10:45:00,863,1.0,664,243,29.0,21,-42,5.8,2021-05-06 06:45:00.000
44,45,2021-05-06 11:00:00,914,1.0,786,169,29.2,19,-33,1.6,2021-05-06 07:00:00.000
45,46,2021-05-06 11:15:00,938,1.1,829,145,29.2,17,-23,0.0,2021-05-06 07:15:00.000
46,47,2021-05-06 11:30:00,942,1.2,825,148,29.1,16,-11,0.0,2021-05-06 07:30:00.000
47,48,2021-05-06 11:45:00,837,1.2,509,346,29.1,15,3,11.3,2021-05-06 07:45:00.000
48,49,2021-05-06 12:00:00,732,1.3,249,492,29.1,16,16,22.2,2021-05-06 08:00:00.000
49,50,2021-05-06 12:15:00,699,1.2,196,512,29.0,17,27,25.0,2021-05-06 08:15:00.000
50,51,2021-05-06 12:30:00,887,1.2,726,203,28.9,19,37,3.6,2021-05-06 08:30:00.000
51,52,2021-05-06 12:45:00,903,1.1,820,143,28.9,22,44,0.0,2021-05-06 08:45:00.000
52,53,2021-05-06 13:00:00,882,1.0,816,141,28.8,25,50,0.0,2021-05-06 09:00:00.000
53,54,2021-05-06 13:15:00,856,1.0,811,138,28.8,28,55,0.0,2021-05-06 09:15:00.000
54,55,2021-05-06 13:30:00,741,0.9,518,295,28.7,31,58,10.4,2021-05-06 09:30:00.000
55,56,2021-05-06 13:45:00,707,0.9,496,295,28.7,34,61,10.8,2021-05-06 09:45:00.000
56,57,2021-05-06 14:00:00,539,0.8,119,444,28.6,37,64,28.6,2021-05-06 10:00:00.000
57,58,2021-05-06 14:15:00,409,0.8,0,409,28.4,41,66,42.7,2021-05-06 10:15:00.000
58,59,2021-05-06 14:30:00,340,0.8,0,340,28.3,44,67,49.0,2021-05-06 10:30:00.000
59,60,2021-05-06 14:45:00,279,0.7,0,279,28.1,48,69,55.2,2021-05-06 10:45:00.000
60,61,2021-05-06 15:00:00,339,0.7,2,337,27.9,51,70,40.2,2021-05-06 11:00:00.000
61,62,2021-05-06 15:15:00,341,0.7,0,341,27.7,55,71,34.0,2021-05-06 11:15:00.000
62,63,2021-05-06 15:30:00,308,0.8,3,306,27.4,58,71,33.2,2021-05-06 11:30:00.000
63,64,2021-05-06 15:45:00,244,0.8,0,244,27.2,62,72,39.8,2021-05-06 11:45:00.000
64,65,2021-05-06 16:00:00,159,0.9,0,159,26.9,65,73,54.4,2021-05-06 12:00:00.000
65,66,2021-05-06 16:15:00,112,0.9,0,112,26.5,69,73,61.3,2021-05-06 12:15:00.000
66,67,2021-05-06 16:30:00,78,1.0,0,78,26.1,73,73,65.8,2021-05-06 12:30:00.000
67,68,2021-05-06 16:45:00,52,1.1,0,52,25.7,76,74,69.7,2021-05-06 12:45:00.000
68,69,2021-05-06 17:00:00,42,1.1,0,42,25.3,80,74,63.2,2021-05-06 13:00:00.000
69,70,2021-05-06 17:15:00,29,1.1,0,29,25.0,83,74,57.6,2021-05-06 13:15:00.000
70,71,2021-05-06 17:30:00,7,1.1,0,7,24.7,87,74,73.7,2021-05-06 13:30:00.000
71,72,2021-05-06 17:45:00,0,1.1,0,0,24.4,91,74,89.6,2021-05-06 13:45:00.000
72,73,2021-05-06 18:00:00,0,1.0,0,0,24.1,94,74,92.6,2021-05-06 14:00:00.000
73,74,2021-05-06 18:15:00,0,1.0,0,0,24.0,98,74,88.6,2021-05-06 14:15:00.000
74,75,2021-05-06 18:30:00,0,1.0,0,0,23.9,101,73,94.8,2021-05-06 14:30:00.000
75,76,2021-05-06 18:45:00,0,1.0,0,0,23.8,105,73,96.7,2021-05-06 14:45:00.000
76,77,2021-05-06 19:00:00,0,0.9,0,0,23.8,108,73,96.8,2021-05-06 15:00:00.000
77,78,2021-05-06 19:15:00,0,0.9,0,0,23.7,112,72,97.0,2021-05-06 15:15:00.000
78,79,2021-05-06 19:30:00,0,0.8,0,0,23.6,116,72,97.0,2021-05-06 15:30:00.000
79,80,2021-05-06 19:45:00,0,0.8,0,0,23.6,119,71,97.0,2021-05-06 15:45:00.000
80,81,2021-05-06 20:00:00,0,0.8,0,0,23.5,123,70,96.2,2021-05-06 16:00:00.000
81,82,2021-05-06 20:15:00,0,0.7,0,0,23.5,126,69,97.0,2021-05-06 16:15:00.000
82,83,2021-05-06 20:30:00,0,0.7,0,0,23.4,130,68,97.0,2021-05-06 16:30:00.000
83,84,2021-05-06 20:45:00,0,0.8,0,0,23.4,133,67,97.0,2021-05-06 16:45:00.000
84,85,2021-05-06 21:00:00,0,0.8,0,0,23.4,137,65,97.0,2021-05-06 17:00:00.000
85,86,2021-05-06 21:15:00,0,0.8,0,0,23.3,140,63,97.0,2021-05-06 17:15:00.000
86,87,2021-05-06 21:30:00,0,0.8,0,0,23.3,143,61,97.0,2021-05-06 17:30:00.000
87,88,2021-05-06 21:45:00,0,0.8,0,0,23.2,147,58,97.0,2021-05-06 17:45:00.000
88,89,2021-05-06 22:00:00,0,0.9,0,0,23.2,150,55,95.4,2021-05-06 18:00:00.000
89,90,2021-05-06 22:15:00,0,0.9,0,0,23.1,153,51,88.7,2021-05-06 18:15:00.000
90,91,2021-05-06 22:30:00,0,0.9,0,0,23.1,156,46,81.9,2021-05-06 18:30:00.000
91,92,2021-05-06 22:45:00,0,0.9,0,0,23.0,158,39,86.1,2021-05-06 18:45:00.000
92,93,2021-05-06 23:00:00,0,1.0,0,0,23.0,160,31,89.0,2021-05-06 19:00:00.000
93,94,2021-05-06 23:15:00,0,1.0,0,0,22.9,162,21,90.4,2021-05-06 19:15:00.000
94,95,2021-05-06 23:30:00,0,0.9,0,0,22.9,163,10,86.6,2021-05-06 19:30:00.000
95,96,2021-05-06 23:45:00,0,0.9,0,0,22.8,163,-2,80.7,2021-05-06 19:45:00.000
