,BLOCK_ID,DATA_DATETIME,GHI,WIND_SPEED,DNI,DHI,TEMPERATURE,ZENITH,AZIMUTH,CLOUD_OPACITY,ENTRY_TIME
0,1,2019-07-17 00:00:00,0,1.3,0,0,22.5,158,-5,0.0,2019-07-16 20:00:00.000
1,2,2019-07-17 00:15:00,0,1.3,0,0,22.4,157,-14,0.0,2019-07-16 20:15:00.000
2,3,2019-07-17 00:30:00,0,1.3,0,0,22.4,156,-22,0.0,2019-07-16 20:30:00.000
3,4,2019-07-17 00:45:00,0,1.3,0,0,22.3,154,-30,0.0,2019-07-16 20:45:00.000
4,5,2019-07-17 01:00:00,0,1.3,0,0,22.3,152,-36,0.0,2019-07-16 21:00:00.000
5,6,2019-07-17 01:15:00,0,1.3,0,0,22.3,150,-41,0.0,2019-07-16 21:15:00.000
6,7,2019-07-17 01:30:00,0,1.4,0,0,22.4,147,-46,0.0,2019-07-16 21:30:00.000
7,8,2019-07-17 01:45:00,0,1.4,0,0,22.4,145,-50,0.0,2019-07-16 21:45:00.000
8,9,2019-07-17 02:00:00,0,1.4,0,0,22.4,142,-53,42.3,2019-07-16 22:00:00.000
9,10,2019-07-17 02:15:00,0,1.4,0,0,22.4,139,-55,52.9,2019-07-16 22:15:00.000
10,11,2019-07-17 02:30:00,0,1.4,0,0,22.4,135,-58,53.0,2019-07-16 22:30:00.000
11,12,2019-07-17 02:45:00,0,1.4,0,0,22.4,132,-60,51.5,2019-07-16 22:45:00.000
12,13,2019-07-17 03:00:00,0,1.3,0,0,22.4,129,-61,52.6,2019-07-16 23:00:00.000
13,14,2019-07-17 03:15:00,0,1.2,0,0,22.4,126,-63,47.6,2019-07-16 23:15:00.000
14,15,2019-07-17 03:30:00,0,1.1,0,0,22.4,122,-64,51.0,2019-07-16 23:30:00.000
15,16,2019-07-17 03:45:00,0,1.0,0,0,22.4,119,-65,51.8,2019-07-16 23:45:00.000
16,17,2019-07-17 04:00:00,0,1.0,0,0,22.4,116,-66,65.9,2019-07-17 00:00:00.000
17,18,2019-07-17 04:15:00,0,0.9,0,0,22.4,112,-66,46.0,2019-07-17 00:15:00.000
18,19,2019-07-17 04:30:00,0,0.9,0,0,22.3,109,-67,51.4,2019-07-17 00:30:00.000
19,20,2019-07-17 04:45:00,0,0.9,0,0,22.3,105,-67,53.9,2019-07-17 00:45:00.000
20,21,2019-07-17 05:00:00,0,0.9,0,0,22.2,102,-68,49.9,2019-07-17 01:00:00.000
21,22,2019-07-17 05:15:00,0,0.9,0,0,22.2,98,-68,59.4,2019-07-17 01:15:00.000
22,23,2019-07-17 05:30:00,0,1.0,0,0,22.2,95,-68,49.6,2019-07-17 01:30:00.000
23,24,2019-07-17 05:45:00,0,1.1,0,0,22.2,91,-68,35.3,2019-07-17 01:45:00.000
24,25,2019-07-17 06:00:00,11,1.1,0,11,22.3,88,-68,35.3,2019-07-17 02:00:00.000
25,26,2019-07-17 06:15:00,41,1.2,89,30,22.6,84,-68,27.4,2019-07-17 02:15:00.000
26,27,2019-07-17 06:30:00,100,1.3,358,43,22.9,81,-68,0.0,2019-07-17 02:30:00.000
27,28,2019-07-17 06:45:00,142,1.4,345,69,23.3,77,-68,5.7,2019-07-17 02:45:00.000
28,29,2019-07-17 07:00:00,200,1.5,451,72,23.7,74,-68,3.8,2019-07-17 03:00:00.000
29,30,2019-07-17 07:15:00,263,1.7,578,69,24.2,70,-67,0.0,2019-07-17 03:15:00.000
30,31,2019-07-17 07:30:00,319,1.8,623,75,24.8,67,-67,0.0,2019-07-17 03:30:00.000
31,32,2019-07-17 07:45:00,375,1.9,660,80,25.4,63,-66,0.0,2019-07-17 03:45:00.000
32,33,2019-07-17 08:00:00,429,2.1,690,85,25.9,60,-65,0.0,2019-07-17 04:00:00.000
33,34,2019-07-17 08:15:00,480,2.3,706,93,26.2,57,-64,0.3,2019-07-17 04:15:00.000
34,35,2019-07-17 08:30:00,527,2.5,703,107,26.5,53,-63,1.2,2019-07-17 04:30:00.000
35,36,2019-07-17 08:45:00,547,2.6,590,167,26.7,50,-62,6.0,2019-07-17 04:45:00.000
36,37,2019-07-17 09:00:00,560,2.8,486,228,27.0,47,-60,10.7,2019-07-17 05:00:00.000
37,38,2019-07-17 09:15:00,608,3.0,525,226,27.2,43,-59,9.5,2019-07-17 05:15:00.000
38,39,2019-07-17 09:30:00,644,3.1,535,237,27.4,40,-56,9.3,2019-07-17 05:30:00.000
39,40,2019-07-17 09:45:00,735,3.2,752,137,27.5,37,-54,1.6,2019-07-17 05:45:00.000
40,41,2019-07-17 10:00:00,767,3.4,755,142,27.7,34,-51,1.7,2019-07-17 06:00:00.000
41,42,2019-07-17 10:15:00,768,3.4,677,192,27.9,31,-47,4.9,2019-07-17 06:15:00.000
42,43,2019-07-17 10:30:00,761,3.4,569,262,28.2,29,-42,8.6,2019-07-17 06:30:00.000
43,44,2019-07-17 10:45:00,782,3.4,571,270,28.4,26,-37,8.3,2019-07-17 06:45:00.000
44,45,2019-07-17 11:00:00,847,3.5,733,179,28.6,24,-30,2.5,2019-07-17 07:00:00.000
45,46,2019-07-17 11:15:00,868,3.5,761,166,28.8,23,-22,1.3,2019-07-17 07:15:00.000
46,47,2019-07-17 11:30:00,879,3.6,769,163,29.0,22,-14,0.9,2019-07-17 07:30:00.000
47,48,2019-07-17 11:45:00,868,3.7,722,193,29.2,21,-4,2.4,2019-07-17 07:45:00.000
48,49,2019-07-17 12:00:00,816,3.7,557,296,29.3,21,5,8.1,2019-07-17 08:00:00.000
49,50,2019-07-17 12:15:00,806,3.8,540,304,29.3,22,15,8.7,2019-07-17 08:15:00.000
50,51,2019-07-17 12:30:00,851,3.8,709,198,29.3,23,24,2.4,2019-07-17 08:30:00.000
51,52,2019-07-17 12:45:00,793,3.9,555,288,29.4,25,31,7.6,2019-07-17 08:45:00.000
52,53,2019-07-17 13:00:00,771,3.9,535,293,29.4,27,37,8.2,2019-07-17 09:00:00.000
53,54,2019-07-17 13:15:00,766,4.0,579,261,29.3,29,43,6.2,2019-07-17 09:15:00.000
54,55,2019-07-17 13:30:00,657,4.0,318,385,29.3,32,47,17.1,2019-07-17 09:30:00.000
55,56,2019-07-17 13:45:00,647,4.1,352,356,29.2,35,51,15.0,2019-07-17 09:45:00.000
56,57,2019-07-17 14:00:00,613,4.1,327,354,29.2,38,54,15.7,2019-07-17 10:00:00.000
57,58,2019-07-17 14:15:00,543,3.9,205,386,29.1,41,57,21.3,2019-07-17 10:15:00.000
58,59,2019-07-17 14:30:00,442,3.7,17,429,29.0,44,59,31.8,2019-07-17 10:30:00.000
59,60,2019-07-17 14:45:00,518,3.5,326,296,28.8,47,61,14.2,2019-07-17 10:45:00.000
60,61,2019-07-17 15:00:00,433,3.3,160,329,28.7,50,62,22.5,2019-07-17 11:00:00.000
61,62,2019-07-17 15:15:00,422,3.3,243,279,28.5,54,64,16.9,2019-07-17 11:15:00.000
62,63,2019-07-17 15:30:00,330,3.2,55,299,28.4,57,65,27.9,2019-07-17 11:30:00.000
63,64,2019-07-17 15:45:00,311,3.2,106,259,28.2,61,66,22.8,2019-07-17 11:45:00.000
64,65,2019-07-17 16:00:00,309,3.1,295,181,28.0,64,66,11.4,2019-07-17 12:00:00.000
65,66,2019-07-17 16:15:00,193,3.0,0,193,27.7,67,67,34.2,2019-07-17 12:15:00.000
66,67,2019-07-17 16:30:00,182,2.8,46,168,27.4,71,67,23.4,2019-07-17 12:30:00.000
67,68,2019-07-17 16:45:00,139,2.6,5,138,27.1,74,68,24.2,2019-07-17 12:45:00.000
68,69,2019-07-17 17:00:00,97,2.5,3,96,26.8,78,68,26.3,2019-07-17 13:00:00.000
69,70,2019-07-17 17:15:00,61,2.3,0,61,26.3,81,68,26.1,2019-07-17 13:15:00.000
70,71,2019-07-17 17:30:00,38,2.2,52,33,25.8,85,69,6.7,2019-07-17 13:30:00.000
71,72,2019-07-17 17:45:00,7,2.0,0,7,25.2,88,69,41.3,2019-07-17 13:45:00.000
72,73,2019-07-17 18:00:00,0,1.9,0,0,24.8,92,69,40.0,2019-07-17 14:00:00.000
73,74,2019-07-17 18:15:00,0,1.8,0,0,24.6,95,68,19.5,2019-07-17 14:15:00.000
74,75,2019-07-17 18:30:00,0,1.8,0,0,24.3,99,68,15.2,2019-07-17 14:30:00.000
75,76,2019-07-17 18:45:00,0,1.8,0,0,24.1,102,68,0.0,2019-07-17 14:45:00.000
76,77,2019-07-17 19:00:00,0,1.8,0,0,23.9,106,68,0.0,2019-07-17 15:00:00.000
77,78,2019-07-17 19:15:00,0,1.8,0,0,23.9,109,67,0.0,2019-07-17 15:15:00.000
78,79,2019-07-17 19:30:00,0,1.9,0,0,23.8,113,66,0.0,2019-07-17 15:30:00.000
79,80,2019-07-17 19:45:00,0,1.9,0,0,23.8,116,66,0.0,2019-07-17 15:45:00.000
80,81,2019-07-17 20:00:00,0,1.9,0,0,23.7,119,65,0.0,2019-07-17 16:00:00.000
81,82,2019-07-17 20:15:00,0,1.8,0,0,23.7,123,64,0.0,2019-07-17 16:15:00.000
82,83,2019-07-17 20:30:00,0,1.8,0,0,23.7,126,63,0.0,2019-07-17 16:30:00.000
83,84,2019-07-17 20:45:00,0,1.7,0,0,23.6,129,61,0.0,2019-07-17 16:45:00.000
84,85,2019-07-17 21:00:00,0,1.6,0,0,23.6,133,60,0.0,2019-07-17 17:00:00.000
85,86,2019-07-17 21:15:00,0,1.6,0,0,23.7,136,58,0.0,2019-07-17 17:15:00.000
86,87,2019-07-17 21:30:00,0,1.6,0,0,23.8,139,55,0.0,2019-07-17 17:30:00.000
87,88,2019-07-17 21:45:00,0,1.5,0,0,23.8,142,53,0.0,2019-07-17 17:45:00.000
88,89,2019-07-17 22:00:00,0,1.5,0,0,23.9,145,49,0.0,2019-07-17 18:00:00.000
89,90,2019-07-17 22:15:00,0,1.5,0,0,23.8,148,45,0.0,2019-07-17 18:15:00.000
90,91,2019-07-17 22:30:00,0,1.5,0,0,23.8,150,41,0.0,2019-07-17 18:30:00.000
91,92,2019-07-17 22:45:00,0,1.5,0,0,23.7,153,35,0.0,2019-07-17 18:45:00.000
92,93,2019-07-17 23:00:00,0,1.6,0,0,23.7,155,29,28.8,2019-07-17 19:00:00.000
93,94,2019-07-17 23:15:00,0,1.6,0,0,23.7,156,21,38.5,2019-07-17 19:15:00.000
94,95,2019-07-17 23:30:00,0,1.7,0,0,23.7,157,13,36.0,2019-07-17 19:30:00.000
95,96,2019-07-17 23:45:00,0,1.8,0,0,23.7,158,4,36.0,2019-07-17 19:45:00.000
