,BLOCK_ID,DATA_DATETIME,GHI,WIND_SPEED,DNI,DHI,TEMPERATURE,ZENITH,AZIMUTH,CLOUD_OPACITY,ENTRY_TIME
0,1,2021-09-01 00:00:00,0,0.3,0,0,22.9,170,-19,14.0,2021-08-31 20:00:00.000
1,2,2021-09-01 00:15:00,0,0.3,0,0,22.8,168,-36,30.0,2021-08-31 20:15:00.000
2,3,2021-09-01 00:30:00,0,0.4,0,0,22.8,165,-48,59.0,2021-08-31 20:30:00.000
3,4,2021-09-01 00:45:00,0,0.4,0,0,22.7,162,-56,56.6,2021-08-31 20:45:00.000
4,5,2021-09-01 01:00:00,0,0.4,0,0,22.7,159,-62,58.8,2021-08-31 21:00:00.000
5,6,2021-09-01 01:15:00,0,0.4,0,0,22.7,156,-66,93.4,2021-08-31 21:15:00.000
6,7,2021-09-01 01:30:00,0,0.4,0,0,22.7,152,-69,89.0,2021-08-31 21:30:00.000
7,8,2021-09-01 01:45:00,0,0.4,0,0,22.7,149,-71,96.0,2021-08-31 21:45:00.000
8,9,2021-09-01 02:00:00,0,0.4,0,0,22.6,145,-73,96.0,2021-08-31 22:00:00.000
9,10,2021-09-01 02:15:00,0,0.4,0,0,22.6,142,-75,95.3,2021-08-31 22:15:00.000
10,11,2021-09-01 02:30:00,0,0.4,0,0,22.6,138,-76,96.0,2021-08-31 22:30:00.000
11,12,2021-09-01 02:45:00,0,0.4,0,0,22.6,134,-77,89.9,2021-08-31 22:45:00.000
12,13,2021-09-01 03:00:00,0,0.4,0,0,22.5,131,-78,83.4,2021-08-31 23:00:00.000
13,14,2021-09-01 03:15:00,0,0.4,0,0,22.5,127,-78,82.2,2021-08-31 23:15:00.000
14,15,2021-09-01 03:30:00,0,0.4,0,0,22.5,123,-79,85.8,2021-08-31 23:30:00.000
15,16,2021-09-01 03:45:00,0,0.4,0,0,22.5,120,-79,87.4,2021-08-31 23:45:00.000
16,17,2021-09-01 04:00:00,0,0.4,0,0,22.4,116,-80,94.6,2021-09-01 00:00:00.000
17,18,2021-09-01 04:15:00,0,0.5,0,0,22.4,112,-80,93.1,2021-09-01 00:15:00.000
18,19,2021-09-01 04:30:00,0,0.5,0,0,22.4,109,-80,89.4,2021-09-01 00:30:00.000
19,20,2021-09-01 04:45:00,0,0.5,0,0,22.4,105,-81,87.6,2021-09-01 00:45:00.000
20,21,2021-09-01 05:00:00,0,0.5,0,0,22.4,101,-81,94.6,2021-09-01 01:00:00.000
21,22,2021-09-01 05:15:00,0,0.5,0,0,22.4,98,-81,60.1,2021-09-01 01:15:00.000
22,23,2021-09-01 05:30:00,0,0.5,0,0,22.4,94,-81,43.6,2021-09-01 01:30:00.000
23,24,2021-09-01 05:45:00,2,0.5,0,2,22.4,90,-81,33.4,2021-09-01 01:45:00.000
24,25,2021-09-01 06:00:00,12,0.5,0,12,22.5,87,-81,58.4,2021-09-01 02:00:00.000
25,26,2021-09-01 06:15:00,39,0.5,0,39,22.9,83,-81,51.5,2021-09-01 02:15:00.000
26,27,2021-09-01 06:30:00,68,0.5,0,68,23.3,79,-81,48.8,2021-09-01 02:30:00.000
27,28,2021-09-01 06:45:00,96,0.4,0,96,23.7,75,-81,50.1,2021-09-01 02:45:00.000
28,29,2021-09-01 07:00:00,145,0.4,0,145,24.2,72,-81,42.4,2021-09-01 03:00:00.000
29,30,2021-09-01 07:15:00,194,0.3,0,194,24.8,68,-81,38.0,2021-09-01 03:15:00.000
30,31,2021-09-01 07:30:00,274,0.2,152,207,25.3,64,-80,26.8,2021-09-01 03:30:00.000
31,32,2021-09-01 07:45:00,378,0.2,435,165,25.9,61,-80,12.6,2021-09-01 03:45:00.000
32,33,2021-09-01 08:00:00,479,0.4,710,89,26.4,57,-80,2.8,2021-09-01 04:00:00.000
33,34,2021-09-01 08:15:00,549,0.5,801,69,26.9,53,-79,0.0,2021-09-01 04:15:00.000
34,35,2021-09-01 08:30:00,603,0.7,817,72,27.3,49,-79,0.0,2021-09-01 04:30:00.000
35,36,2021-09-01 08:45:00,655,0.9,831,75,27.7,46,-78,0.0,2021-09-01 04:45:00.000
36,37,2021-09-01 09:00:00,703,1.0,843,78,28.0,42,-77,0.0,2021-09-01 05:00:00.000
37,38,2021-09-01 09:15:00,749,1.1,853,81,28.2,38,-76,0.0,2021-09-01 05:15:00.000
38,39,2021-09-01 09:30:00,790,1.2,862,83,28.3,35,-75,0.0,2021-09-01 05:30:00.000
39,40,2021-09-01 09:45:00,828,1.3,869,85,28.5,31,-74,0.0,2021-09-01 05:45:00.000
40,41,2021-09-01 10:00:00,758,1.4,539,283,28.6,28,-72,12.0,2021-09-01 06:00:00.000
41,42,2021-09-01 10:15:00,559,1.5,135,436,28.9,24,-69,37.2,2021-09-01 06:15:00.000
42,43,2021-09-01 10:30:00,174,1.5,0,174,29.1,21,-66,81.0,2021-09-01 06:30:00.000
43,44,2021-09-01 10:45:00,530,1.6,97,438,29.4,17,-61,43.6,2021-09-01 06:45:00.000
44,45,2021-09-01 11:00:00,847,1.7,562,302,29.6,14,-54,11.4,2021-09-01 07:00:00.000
45,46,2021-09-01 11:15:00,757,1.9,325,439,29.5,11,-43,21.7,2021-09-01 07:15:00.000
46,47,2021-09-01 11:30:00,501,2.0,11,490,29.4,9,-25,48.6,2021-09-01 07:30:00.000
47,48,2021-09-01 11:45:00,670,2.2,204,468,29.4,8,-2,31.5,2021-09-01 07:45:00.000
48,49,2021-09-01 12:00:00,907,2.3,679,236,29.3,9,23,7.0,2021-09-01 08:00:00.000
49,50,2021-09-01 12:15:00,819,2.3,454,374,29.1,11,41,15.4,2021-09-01 08:15:00.000
50,51,2021-09-01 12:30:00,403,2.4,98,307,29.0,14,53,58.0,2021-09-01 08:30:00.000
51,52,2021-09-01 12:45:00,412,2.4,0,412,28.9,17,60,56.1,2021-09-01 08:45:00.000
52,53,2021-09-01 13:00:00,640,2.4,139,510,28.7,20,65,30.4,2021-09-01 09:00:00.000
53,54,2021-09-01 13:15:00,91,2.4,0,91,28.5,24,69,89.8,2021-09-01 09:15:00.000
54,55,2021-09-01 13:30:00,45,2.4,0,45,28.4,27,72,94.8,2021-09-01 09:30:00.000
55,56,2021-09-01 13:45:00,380,2.3,1,379,28.2,31,74,54.1,2021-09-01 09:45:00.000
56,57,2021-09-01 14:00:00,435,2.3,1,435,28.0,34,75,45.2,2021-09-01 10:00:00.000
57,58,2021-09-01 14:15:00,237,2.3,0,237,27.9,38,76,68.7,2021-09-01 10:15:00.000
58,59,2021-09-01 14:30:00,54,2.3,0,54,27.7,42,77,92.4,2021-09-01 10:30:00.000
59,60,2021-09-01 14:45:00,49,2.3,0,49,27.5,45,78,92.4,2021-09-01 10:45:00.000
60,61,2021-09-01 15:00:00,199,2.2,0,199,27.3,49,79,67.2,2021-09-01 11:00:00.000
61,62,2021-09-01 15:15:00,345,2.2,58,311,27.2,53,79,37.6,2021-09-01 11:15:00.000
62,63,2021-09-01 15:30:00,398,2.1,283,242,27.1,56,80,20.2,2021-09-01 11:30:00.000
63,64,2021-09-01 15:45:00,360,2.1,306,206,26.9,60,80,18.5,2021-09-01 11:45:00.000
64,65,2021-09-01 16:00:00,211,2.0,46,189,26.8,64,80,45.2,2021-09-01 12:00:00.000
65,66,2021-09-01 16:15:00,90,1.9,0,90,26.5,67,81,72.2,2021-09-01 12:15:00.000
66,67,2021-09-01 16:30:00,91,1.9,0,91,26.2,71,81,64.6,2021-09-01 12:30:00.000
67,68,2021-09-01 16:45:00,60,1.8,0,60,25.8,75,81,69.4,2021-09-01 12:45:00.000
68,69,2021-09-01 17:00:00,81,1.8,0,81,25.5,79,81,41.8,2021-09-01 13:00:00.000
69,70,2021-09-01 17:15:00,59,1.7,24,56,25.2,82,81,31.2,2021-09-01 13:15:00.000
70,71,2021-09-01 17:30:00,22,1.7,16,20,24.8,86,81,48.0,2021-09-01 13:30:00.000
71,72,2021-09-01 17:45:00,0,1.7,0,0,24.5,90,81,92.5,2021-09-01 13:45:00.000
72,73,2021-09-01 18:00:00,0,1.6,0,0,24.1,93,81,87.4,2021-09-01 14:00:00.000
73,74,2021-09-01 18:15:00,0,1.6,0,0,24.0,97,81,58.4,2021-09-01 14:15:00.000
74,75,2021-09-01 18:30:00,0,1.6,0,0,23.8,101,81,89.6,2021-09-01 14:30:00.000
75,76,2021-09-01 18:45:00,0,1.6,0,0,23.6,104,81,96.7,2021-09-01 14:45:00.000
76,77,2021-09-01 19:00:00,0,1.6,0,0,23.5,108,81,70.4,2021-09-01 15:00:00.000
77,78,2021-09-01 19:15:00,0,1.5,0,0,23.4,112,80,94.9,2021-09-01 15:15:00.000
78,79,2021-09-01 19:30:00,0,1.4,0,0,23.4,116,80,97.0,2021-09-01 15:30:00.000
79,80,2021-09-01 19:45:00,0,1.3,0,0,23.3,119,80,97.0,2021-09-01 15:45:00.000
80,81,2021-09-01 20:00:00,0,1.2,0,0,23.3,123,79,97.0,2021-09-01 16:00:00.000
81,82,2021-09-01 20:15:00,0,1.1,0,0,23.2,127,79,97.0,2021-09-01 16:15:00.000
82,83,2021-09-01 20:30:00,0,1.0,0,0,23.2,130,78,97.0,2021-09-01 16:30:00.000
83,84,2021-09-01 20:45:00,0,0.9,0,0,23.1,134,77,97.0,2021-09-01 16:45:00.000
84,85,2021-09-01 21:00:00,0,0.9,0,0,23.1,138,76,97.0,2021-09-01 17:00:00.000
85,86,2021-09-01 21:15:00,0,0.8,0,0,23.0,141,75,97.0,2021-09-01 17:15:00.000
86,87,2021-09-01 21:30:00,0,0.8,0,0,23.0,145,74,97.0,2021-09-01 17:30:00.000
87,88,2021-09-01 21:45:00,0,0.8,0,0,23.0,148,72,91.3,2021-09-01 17:45:00.000
88,89,2021-09-01 22:00:00,0,0.7,0,0,22.9,152,70,88.8,2021-09-01 18:00:00.000
89,90,2021-09-01 22:15:00,0,0.7,0,0,22.8,155,67,88.2,2021-09-01 18:15:00.000
90,91,2021-09-01 22:30:00,0,0.7,0,0,22.8,159,63,87.3,2021-09-01 18:30:00.000
91,92,2021-09-01 22:45:00,0,0.7,0,0,22.7,162,58,80.2,2021-09-01 18:45:00.000
92,93,2021-09-01 23:00:00,0,0.7,0,0,22.7,165,50,93.2,2021-09-01 19:00:00.000
93,94,2021-09-01 23:15:00,0,0.7,0,0,22.6,168,39,97.0,2021-09-01 19:15:00.000
94,95,2021-09-01 23:30:00,0,0.7,0,0,22.6,170,23,97.0,2021-09-01 19:30:00.000
95,96,2021-09-01 23:45:00,0,0.7,0,0,22.6,171,2,97.0,2021-09-01 19:45:00.000
