,BLOCK_ID,DATA_DATETIME,GHI,WIND_SPEED,DNI,DHI,TEMPERATURE,ZENITH,AZIMUTH,CLOUD_OPACITY,ENTRY_TIME
0,1,2020-12-03 00:00:00,0,0.4,0,0,23.9,158,-165,72.0,2020-12-02 20:00:00.000
1,2,2020-12-03 00:15:00,0,0.4,0,0,23.9,157,-156,70.9,2020-12-02 20:15:00.000
2,3,2020-12-03 00:30:00,0,0.4,0,0,23.9,155,-149,73.0,2020-12-02 20:30:00.000
3,4,2020-12-03 00:45:00,0,0.4,0,0,23.8,153,-143,68.9,2020-12-02 20:45:00.000
4,5,2020-12-03 01:00:00,0,0.5,0,0,23.8,150,-138,60.8,2020-12-02 21:00:00.000
5,6,2020-12-03 01:15:00,0,0.6,0,0,23.8,148,-133,49.7,2020-12-02 21:15:00.000
6,7,2020-12-03 01:30:00,0,0.8,0,0,23.7,145,-129,21.4,2020-12-02 21:30:00.000
7,8,2020-12-03 01:45:00,0,0.9,0,0,23.7,142,-126,22.9,2020-12-02 21:45:00.000
8,9,2020-12-03 02:00:00,0,1.0,0,0,23.7,139,-124,22.0,2020-12-02 22:00:00.000
9,10,2020-12-03 02:15:00,0,0.9,0,0,23.6,136,-122,25.9,2020-12-02 22:15:00.000
10,11,2020-12-03 02:30:00,0,0.9,0,0,23.6,133,-120,20.8,2020-12-02 22:30:00.000
11,12,2020-12-03 02:45:00,0,0.8,0,0,23.6,129,-118,19.0,2020-12-02 22:45:00.000
12,13,2020-12-03 03:00:00,0,0.7,0,0,23.5,126,-117,19.8,2020-12-02 23:00:00.000
13,14,2020-12-03 03:15:00,0,0.7,0,0,23.5,123,-116,22.2,2020-12-02 23:15:00.000
14,15,2020-12-03 03:30:00,0,0.7,0,0,23.6,119,-115,27.4,2020-12-02 23:30:00.000
15,16,2020-12-03 03:45:00,0,0.7,0,0,23.6,116,-114,41.9,2020-12-02 23:45:00.000
16,17,2020-12-03 04:00:00,0,0.8,0,0,23.6,112,-114,15.2,2020-12-03 00:00:00.000
17,18,2020-12-03 04:15:00,0,0.8,0,0,23.6,109,-113,18.9,2020-12-03 00:15:00.000
18,19,2020-12-03 04:30:00,0,0.8,0,0,23.5,105,-113,14.0,2020-12-03 00:30:00.000
19,20,2020-12-03 04:45:00,0,0.8,0,0,23.5,102,-112,45.1,2020-12-03 00:45:00.000
20,21,2020-12-03 05:00:00,0,0.8,0,0,23.5,98,-112,36.4,2020-12-03 01:00:00.000
21,22,2020-12-03 05:15:00,0,0.8,0,0,23.6,95,-112,56.4,2020-12-03 01:15:00.000
22,23,2020-12-03 05:30:00,0,0.9,0,0,23.6,92,-112,55.8,2020-12-03 01:30:00.000
23,24,2020-12-03 05:45:00,6,0.9,0,6,23.7,88,-112,67.5,2020-12-03 01:45:00.000
24,25,2020-12-03 06:00:00,31,1.0,0,31,23.8,85,-112,45.0,2020-12-03 02:00:00.000
25,26,2020-12-03 06:15:00,87,0.9,107,69,24.3,81,-112,16.3,2020-12-03 02:15:00.000
26,27,2020-12-03 06:30:00,156,0.9,432,62,24.7,78,-113,2.0,2020-12-03 02:30:00.000
27,28,2020-12-03 06:45:00,206,0.9,436,86,25.2,74,-113,4.9,2020-12-03 02:45:00.000
28,29,2020-12-03 07:00:00,255,0.8,432,114,25.7,71,-114,7.2,2020-12-03 03:00:00.000
29,30,2020-12-03 07:15:00,292,0.6,340,162,26.4,67,-114,12.9,2020-12-03 03:15:00.000
30,31,2020-12-03 07:30:00,345,0.5,374,181,27.0,64,-115,12.6,2020-12-03 03:30:00.000
31,32,2020-12-03 07:45:00,422,0.4,538,156,27.7,61,-116,7.0,2020-12-03 03:45:00.000
32,33,2020-12-03 08:00:00,509,0.3,750,103,28.3,57,-117,0.0,2020-12-03 04:00:00.000
33,34,2020-12-03 08:15:00,563,0.2,774,108,28.8,54,-118,0.0,2020-12-03 04:15:00.000
34,35,2020-12-03 08:30:00,616,0.2,794,112,29.3,51,-120,0.0,2020-12-03 04:30:00.000
35,36,2020-12-03 08:45:00,665,0.3,811,116,29.8,47,-121,0.0,2020-12-03 04:45:00.000
36,37,2020-12-03 09:00:00,712,0.4,826,120,30.2,44,-123,0.0,2020-12-03 05:00:00.000
37,38,2020-12-03 09:15:00,754,0.5,838,123,30.5,41,-126,0.0,2020-12-03 05:15:00.000
38,39,2020-12-03 09:30:00,794,0.5,849,126,30.8,38,-128,0.0,2020-12-03 05:30:00.000
39,40,2020-12-03 09:45:00,829,0.6,857,129,31.1,35,-132,0.0,2020-12-03 05:45:00.000
40,41,2020-12-03 10:00:00,860,0.6,865,132,31.4,33,-136,0.0,2020-12-03 06:00:00.000
41,42,2020-12-03 10:15:00,887,0.7,871,134,31.5,30,-140,0.0,2020-12-03 06:15:00.000
42,43,2020-12-03 10:30:00,852,0.7,678,252,31.7,28,-146,6.4,2020-12-03 06:30:00.000
43,44,2020-12-03 10:45:00,817,0.7,524,346,31.8,26,-152,11.9,2020-12-03 06:45:00.000
44,45,2020-12-03 11:00:00,874,0.7,662,270,31.9,24,-159,7.2,2020-12-03 07:00:00.000
45,46,2020-12-03 11:15:00,950,0.7,883,139,31.9,23,-168,0.0,2020-12-03 07:15:00.000
46,47,2020-12-03 11:30:00,894,0.7,685,261,31.9,23,-176,6.4,2020-12-03 07:30:00.000
47,48,2020-12-03 11:45:00,841,0.7,530,352,31.9,23,175,11.8,2020-12-03 07:45:00.000
48,49,2020-12-03 12:00:00,714,0.7,219,512,31.8,23,166,24.8,2020-12-03 08:00:00.000
49,50,2020-12-03 12:15:00,609,0.7,57,558,31.6,25,158,35.1,2020-12-03 08:15:00.000
50,51,2020-12-03 12:30:00,691,0.6,204,508,31.4,26,151,25.2,2020-12-03 08:30:00.000
51,52,2020-12-03 12:45:00,669,0.6,206,489,31.2,28,144,26.0,2020-12-03 08:45:00.000
52,53,2020-12-03 13:00:00,670,0.5,234,468,30.9,31,139,24.0,2020-12-03 09:00:00.000
53,54,2020-12-03 13:15:00,706,0.4,373,393,30.6,33,135,17.3,2020-12-03 09:15:00.000
54,55,2020-12-03 13:30:00,514,0.4,71,455,30.2,36,131,37.5,2020-12-03 09:30:00.000
55,56,2020-12-03 13:45:00,112,0.4,0,112,29.8,39,128,85.6,2020-12-03 09:45:00.000
56,57,2020-12-03 14:00:00,113,0.5,0,113,29.5,42,125,84.8,2020-12-03 10:00:00.000
57,58,2020-12-03 14:15:00,159,0.5,0,159,29.3,45,123,77.2,2020-12-03 10:15:00.000
58,59,2020-12-03 14:30:00,217,0.6,0,217,29.1,48,121,66.6,2020-12-03 10:30:00.000
59,60,2020-12-03 14:45:00,246,0.7,0,246,28.9,51,119,59.1,2020-12-03 10:45:00.000
60,61,2020-12-03 15:00:00,262,0.7,0,262,28.7,55,118,52.2,2020-12-03 11:00:00.000
61,62,2020-12-03 15:15:00,277,0.8,0,277,28.4,58,117,44.0,2020-12-03 11:15:00.000
62,63,2020-12-03 15:30:00,252,0.9,0,252,28.2,61,116,42.4,2020-12-03 11:30:00.000
63,64,2020-12-03 15:45:00,192,1.0,0,192,28.0,65,115,49.2,2020-12-03 11:45:00.000
64,65,2020-12-03 16:00:00,237,1.1,105,198,27.7,68,114,26.0,2020-12-03 12:00:00.000
65,66,2020-12-03 16:15:00,165,1.1,0,165,27.4,72,114,36.7,2020-12-03 12:15:00.000
66,67,2020-12-03 16:30:00,133,1.0,0,133,27.1,75,113,34.4,2020-12-03 12:30:00.000
67,68,2020-12-03 16:45:00,99,1.0,0,99,26.7,78,113,31.7,2020-12-03 12:45:00.000
68,69,2020-12-03 17:00:00,71,1.0,25,67,26.4,82,112,22.2,2020-12-03 13:00:00.000
69,70,2020-12-03 17:15:00,36,1.1,0,36,26.0,85,112,18.8,2020-12-03 13:15:00.000
70,71,2020-12-03 17:30:00,7,1.1,0,7,25.6,89,112,18.4,2020-12-03 13:30:00.000
71,72,2020-12-03 17:45:00,0,1.2,0,0,25.2,92,112,49.7,2020-12-03 13:45:00.000
72,73,2020-12-03 18:00:00,0,1.2,0,0,24.8,96,112,30.6,2020-12-03 14:00:00.000
73,74,2020-12-03 18:15:00,0,1.3,0,0,24.7,99,112,20.7,2020-12-03 14:15:00.000
74,75,2020-12-03 18:30:00,0,1.4,0,0,24.5,103,112,19.2,2020-12-03 14:30:00.000
75,76,2020-12-03 18:45:00,0,1.4,0,0,24.4,106,113,16.6,2020-12-03 14:45:00.000
76,77,2020-12-03 19:00:00,0,1.5,0,0,24.2,110,113,18.0,2020-12-03 15:00:00.000
77,78,2020-12-03 19:15:00,0,1.4,0,0,24.2,113,114,24.3,2020-12-03 15:15:00.000
78,79,2020-12-03 19:30:00,0,1.3,0,0,24.2,117,114,25.0,2020-12-03 15:30:00.000
79,80,2020-12-03 19:45:00,0,1.2,0,0,24.1,120,115,19.0,2020-12-03 15:45:00.000
80,81,2020-12-03 20:00:00,0,1.2,0,0,24.1,123,116,15.0,2020-12-03 16:00:00.000
81,82,2020-12-03 20:15:00,0,1.2,0,0,24.0,127,117,20.2,2020-12-03 16:15:00.000
82,83,2020-12-03 20:30:00,0,1.2,0,0,24.0,130,119,19.0,2020-12-03 16:30:00.000
83,84,2020-12-03 20:45:00,0,1.2,0,0,23.9,133,120,22.2,2020-12-03 16:45:00.000
84,85,2020-12-03 21:00:00,0,1.2,0,0,23.9,136,122,26.6,2020-12-03 17:00:00.000
85,86,2020-12-03 21:15:00,0,1.1,0,0,23.8,140,125,39.7,2020-12-03 17:15:00.000
86,87,2020-12-03 21:30:00,0,1.1,0,0,23.8,143,127,44.4,2020-12-03 17:30:00.000
87,88,2020-12-03 21:45:00,0,1.0,0,0,23.7,145,130,57.3,2020-12-03 17:45:00.000
88,89,2020-12-03 22:00:00,0,1.0,0,0,23.7,148,134,66.6,2020-12-03 18:00:00.000
89,90,2020-12-03 22:15:00,0,1.0,0,0,23.6,151,139,67.7,2020-12-03 18:15:00.000
90,91,2020-12-03 22:30:00,0,1.0,0,0,23.6,153,144,62.2,2020-12-03 18:30:00.000
91,92,2020-12-03 22:45:00,0,1.0,0,0,23.6,155,151,63.4,2020-12-03 18:45:00.000
92,93,2020-12-03 23:00:00,0,1.0,0,0,23.5,157,158,66.6,2020-12-03 19:00:00.000
93,94,2020-12-03 23:15:00,0,1.0,0,0,23.5,158,167,67.1,2020-12-03 19:15:00.000
94,95,2020-12-03 23:30:00,0,1.0,0,0,23.4,158,176,47.6,2020-12-03 19:30:00.000
95,96,2020-12-03 23:45:00,0,1.0,0,0,23.4,158,-174,39.0,2020-12-03 19:45:00.000
