,BLOCK_ID,DATA_DATETIME,GHI,WIND_SPEED,DNI,DHI,TEMPERATURE,ZENITH,AZIMUTH,CLOUD_OPACITY,ENTRY_TIME
0,1,2020-01-21 00:00:00,0,1.4,0,0,22.1,160,-177,0.0,2020-01-20 20:00:00.000
1,2,2020-01-21 00:15:00,0,1.4,0,0,22.1,160,-167,0.0,2020-01-20 20:15:00.000
2,3,2020-01-21 00:30:00,0,1.3,0,0,22.0,159,-158,0.0,2020-01-20 20:30:00.000
3,4,2020-01-21 00:45:00,0,1.3,0,0,22.0,157,-150,0.0,2020-01-20 20:45:00.000
4,5,2020-01-21 01:00:00,0,1.2,0,0,22.0,155,-143,0.0,2020-01-20 21:00:00.000
5,6,2020-01-21 01:15:00,0,1.2,0,0,22.0,152,-137,0.0,2020-01-20 21:15:00.000
6,7,2020-01-21 01:30:00,0,1.2,0,0,22.0,150,-132,0.0,2020-01-20 21:30:00.000
7,8,2020-01-21 01:45:00,0,1.2,0,0,22.0,147,-128,0.0,2020-01-20 21:45:00.000
8,9,2020-01-21 02:00:00,0,1.2,0,0,22.0,144,-125,0.0,2020-01-20 22:00:00.000
9,10,2020-01-21 02:15:00,0,1.2,0,0,22.0,141,-122,0.0,2020-01-20 22:15:00.000
10,11,2020-01-21 02:30:00,0,1.3,0,0,22.0,138,-120,0.0,2020-01-20 22:30:00.000
11,12,2020-01-21 02:45:00,0,1.3,0,0,22.0,134,-118,0.0,2020-01-20 22:45:00.000
12,13,2020-01-21 03:00:00,0,1.3,0,0,22.0,131,-117,0.0,2020-01-20 23:00:00.000
13,14,2020-01-21 03:15:00,0,1.3,0,0,22.0,128,-115,0.0,2020-01-20 23:15:00.000
14,15,2020-01-21 03:30:00,0,1.3,0,0,22.0,124,-114,0.0,2020-01-20 23:30:00.000
15,16,2020-01-21 03:45:00,0,1.4,0,0,22.0,121,-113,0.0,2020-01-20 23:45:00.000
16,17,2020-01-21 04:00:00,0,1.4,0,0,22.0,117,-113,0.0,2020-01-21 00:00:00.000
17,18,2020-01-21 04:15:00,0,1.3,0,0,22.0,114,-112,0.0,2020-01-21 00:15:00.000
18,19,2020-01-21 04:30:00,0,1.3,0,0,21.9,110,-112,0.0,2020-01-21 00:30:00.000
19,20,2020-01-21 04:45:00,0,1.3,0,0,21.9,107,-111,0.0,2020-01-21 00:45:00.000
20,21,2020-01-21 05:00:00,0,1.2,0,0,21.9,103,-111,0.0,2020-01-21 01:00:00.000
21,22,2020-01-21 05:15:00,0,1.2,0,0,21.9,100,-111,0.0,2020-01-21 01:15:00.000
22,23,2020-01-21 05:30:00,0,1.2,0,0,21.9,96,-110,0.0,2020-01-21 01:30:00.000
23,24,2020-01-21 05:45:00,0,1.1,0,0,21.9,93,-110,0.0,2020-01-21 01:45:00.000
24,25,2020-01-21 06:00:00,7,1.1,19,6,22.0,89,-110,0.0,2020-01-21 02:00:00.000
25,26,2020-01-21 06:15:00,42,1.1,165,26,22.3,86,-110,2.9,2020-01-21 02:15:00.000
26,27,2020-01-21 06:30:00,85,1.2,233,53,22.7,82,-111,9.5,2020-01-21 02:30:00.000
27,28,2020-01-21 06:45:00,143,1.3,399,63,23.1,79,-111,5.7,2020-01-21 02:45:00.000
28,29,2020-01-21 07:00:00,210,1.3,582,61,23.5,75,-111,0.9,2020-01-21 03:00:00.000
29,30,2020-01-21 07:15:00,255,1.5,489,102,24.2,72,-112,7.2,2020-01-21 03:15:00.000
30,31,2020-01-21 07:30:00,331,1.6,663,84,24.9,68,-112,2.3,2020-01-21 03:30:00.000
31,32,2020-01-21 07:45:00,402,1.7,769,75,25.6,65,-113,0.0,2020-01-21 03:45:00.000
32,33,2020-01-21 08:00:00,463,1.8,804,79,26.2,61,-114,0.0,2020-01-21 04:00:00.000
33,34,2020-01-21 08:15:00,523,1.9,832,82,26.6,58,-115,0.0,2020-01-21 04:15:00.000
34,35,2020-01-21 08:30:00,554,1.9,711,143,27.0,55,-116,4.7,2020-01-21 04:30:00.000
35,36,2020-01-21 08:45:00,637,2.0,877,89,27.4,51,-117,0.0,2020-01-21 04:45:00.000
36,37,2020-01-21 09:00:00,691,2.1,894,92,27.8,48,-119,0.0,2020-01-21 05:00:00.000
37,38,2020-01-21 09:15:00,740,2.2,909,94,28.2,45,-120,0.0,2020-01-21 05:15:00.000
38,39,2020-01-21 09:30:00,787,2.3,921,96,28.5,41,-122,0.0,2020-01-21 05:30:00.000
39,40,2020-01-21 09:45:00,822,2.4,901,115,28.9,38,-125,0.9,2020-01-21 05:45:00.000
40,41,2020-01-21 10:00:00,866,2.4,935,103,29.2,35,-128,0.2,2020-01-21 06:00:00.000
41,42,2020-01-21 10:15:00,855,2.5,777,198,29.4,32,-132,5.3,2020-01-21 06:15:00.000
42,43,2020-01-21 10:30:00,844,2.5,655,276,29.6,30,-136,9.5,2020-01-21 06:30:00.000
43,44,2020-01-21 10:45:00,885,2.5,705,258,29.9,27,-141,7.6,2020-01-21 06:45:00.000
44,45,2020-01-21 11:00:00,962,2.5,900,147,30.1,25,-147,1.5,2020-01-21 07:00:00.000
45,46,2020-01-21 11:15:00,934,2.5,753,241,30.2,23,-155,5.9,2020-01-21 07:15:00.000
46,47,2020-01-21 11:30:00,949,2.5,766,239,30.3,22,-163,5.4,2020-01-21 07:30:00.000
47,48,2020-01-21 11:45:00,1011,2.4,947,127,30.4,21,-173,0.0,2020-01-21 07:45:00.000
48,49,2020-01-21 12:00:00,1013,2.4,949,126,30.5,21,178,0.0,2020-01-21 08:00:00.000
49,50,2020-01-21 12:15:00,1010,2.4,950,125,30.6,21,168,0.0,2020-01-21 08:15:00.000
50,51,2020-01-21 12:30:00,1002,2.4,950,124,30.7,22,159,0.0,2020-01-21 08:30:00.000
51,52,2020-01-21 12:45:00,989,2.4,948,124,30.8,24,151,0.0,2020-01-21 08:45:00.000
52,53,2020-01-21 13:00:00,971,2.5,945,122,30.8,26,144,0.0,2020-01-21 09:00:00.000
53,54,2020-01-21 13:15:00,948,2.9,940,121,30.8,28,138,0.0,2020-01-21 09:15:00.000
54,55,2020-01-21 13:30:00,920,3.2,933,120,30.7,31,134,0.0,2020-01-21 09:30:00.000
55,56,2020-01-21 13:45:00,887,3.6,924,119,30.6,34,130,0.0,2020-01-21 09:45:00.000
56,57,2020-01-21 14:00:00,850,3.8,913,118,30.5,37,126,0.0,2020-01-21 10:00:00.000
57,58,2020-01-21 14:15:00,808,3.7,900,117,30.3,40,124,0.0,2020-01-21 10:15:00.000
58,59,2020-01-21 14:30:00,762,3.5,885,115,30.0,43,121,0.0,2020-01-21 10:30:00.000
59,60,2020-01-21 14:45:00,713,3.3,868,113,29.8,46,119,0.0,2020-01-21 10:45:00.000
60,61,2020-01-21 15:00:00,661,3.2,849,110,29.6,50,118,0.0,2020-01-21 11:00:00.000
61,62,2020-01-21 15:15:00,606,3.0,827,107,29.3,53,116,0.0,2020-01-21 11:15:00.000
62,63,2020-01-21 15:30:00,548,2.9,801,103,29.0,56,115,0.0,2020-01-21 11:30:00.000
63,64,2020-01-21 15:45:00,488,2.7,770,99,28.7,60,114,0.0,2020-01-21 11:45:00.000
64,65,2020-01-21 16:00:00,426,2.6,734,94,28.5,63,113,0.0,2020-01-21 12:00:00.000
65,66,2020-01-21 16:15:00,363,2.5,691,88,28.1,67,112,0.0,2020-01-21 12:15:00.000
66,67,2020-01-21 16:30:00,299,2.4,639,81,27.8,70,112,0.0,2020-01-21 12:30:00.000
67,68,2020-01-21 16:45:00,236,2.3,575,73,27.5,74,111,0.0,2020-01-21 12:45:00.000
68,69,2020-01-21 17:00:00,174,2.2,495,62,27.1,77,111,0.0,2020-01-21 13:00:00.000
69,70,2020-01-21 17:15:00,113,2.1,356,53,26.6,81,111,2.1,2020-01-21 13:15:00.000
70,71,2020-01-21 17:30:00,57,1.9,132,43,26.0,84,110,8.4,2020-01-21 13:30:00.000
71,72,2020-01-21 17:45:00,20,1.8,61,15,25.5,88,110,0.0,2020-01-21 13:45:00.000
72,73,2020-01-21 18:00:00,1,1.7,1,1,25.0,91,110,0.0,2020-01-21 14:00:00.000
73,74,2020-01-21 18:15:00,0,1.6,0,0,24.7,95,110,0.0,2020-01-21 14:15:00.000
74,75,2020-01-21 18:30:00,0,1.6,0,0,24.4,98,110,0.0,2020-01-21 14:30:00.000
75,76,2020-01-21 18:45:00,0,1.6,0,0,24.1,102,111,0.0,2020-01-21 14:45:00.000
76,77,2020-01-21 19:00:00,0,1.6,0,0,23.9,105,111,0.0,2020-01-21 15:00:00.000
77,78,2020-01-21 19:15:00,0,1.8,0,0,23.8,109,111,0.0,2020-01-21 15:15:00.000
78,79,2020-01-21 19:30:00,0,1.9,0,0,23.7,112,112,0.0,2020-01-21 15:30:00.000
79,80,2020-01-21 19:45:00,0,2.0,0,0,23.6,116,112,0.0,2020-01-21 15:45:00.000
80,81,2020-01-21 20:00:00,0,2.1,0,0,23.5,119,113,0.0,2020-01-21 16:00:00.000
81,82,2020-01-21 20:15:00,0,1.9,0,0,23.4,123,114,0.0,2020-01-21 16:15:00.000
82,83,2020-01-21 20:30:00,0,1.8,0,0,23.2,126,115,0.0,2020-01-21 16:30:00.000
83,84,2020-01-21 20:45:00,0,1.6,0,0,23.1,129,116,0.0,2020-01-21 16:45:00.000
84,85,2020-01-21 21:00:00,0,1.5,0,0,22.9,133,117,0.0,2020-01-21 17:00:00.000
85,86,2020-01-21 21:15:00,0,1.4,0,0,22.8,136,119,0.0,2020-01-21 17:15:00.000
86,87,2020-01-21 21:30:00,0,1.4,0,0,22.7,139,121,0.0,2020-01-21 17:30:00.000
87,88,2020-01-21 21:45:00,0,1.3,0,0,22.6,142,123,0.0,2020-01-21 17:45:00.000
88,89,2020-01-21 22:00:00,0,1.3,0,0,22.5,145,126,0.0,2020-01-21 18:00:00.000
89,90,2020-01-21 22:15:00,0,1.3,0,0,22.5,148,130,0.0,2020-01-21 18:15:00.000
90,91,2020-01-21 22:30:00,0,1.3,0,0,22.4,151,134,0.0,2020-01-21 18:30:00.000
91,92,2020-01-21 22:45:00,0,1.3,0,0,22.4,154,139,0.0,2020-01-21 18:45:00.000
92,93,2020-01-21 23:00:00,0,1.3,0,0,22.4,156,146,0.0,2020-01-21 19:00:00.000
93,94,2020-01-21 23:15:00,0,1.2,0,0,22.4,158,153,0.0,2020-01-21 19:15:00.000
94,95,2020-01-21 23:30:00,0,1.2,0,0,22.3,159,162,0.0,2020-01-21 19:30:00.000
95,96,2020-01-21 23:45:00,0,1.2,0,0,22.3,160,172,0.0,2020-01-21 19:45:00.000
