,BLOCK_ID,DATA_DATETIME,GHI,WIND_SPEED,DNI,DHI,TEMPERATURE,ZENITH,AZIMUTH,CLOUD_OPACITY,ENTRY_TIME
0,1,2020-02-08 00:00:00,0,1.2,0,0,22.6,165,-180,0.0,2020-02-07 20:00:00.000
1,2,2020-02-08 00:15:00,0,1.1,0,0,22.5,164,-166,0.0,2020-02-07 20:15:00.000
2,3,2020-02-08 00:30:00,0,1.1,0,0,22.5,163,-154,0.0,2020-02-07 20:30:00.000
3,4,2020-02-08 00:45:00,0,1.1,0,0,22.4,161,-144,0.0,2020-02-07 20:45:00.000
4,5,2020-02-08 01:00:00,0,1.0,0,0,22.4,159,-136,0.0,2020-02-07 21:00:00.000
5,6,2020-02-08 01:15:00,0,0.9,0,0,22.4,156,-130,0.0,2020-02-07 21:15:00.000
6,7,2020-02-08 01:30:00,0,0.9,0,0,22.4,153,-125,0.0,2020-02-07 21:30:00.000
7,8,2020-02-08 01:45:00,0,0.8,0,0,22.3,150,-121,0.0,2020-02-07 21:45:00.000
8,9,2020-02-08 02:00:00,0,0.7,0,0,22.3,147,-118,0.0,2020-02-07 22:00:00.000
9,10,2020-02-08 02:15:00,0,0.7,0,0,22.3,143,-116,0.0,2020-02-07 22:15:00.000
10,11,2020-02-08 02:30:00,0,0.7,0,0,22.2,140,-114,0.0,2020-02-07 22:30:00.000
11,12,2020-02-08 02:45:00,0,0.7,0,0,22.2,137,-112,0.0,2020-02-07 22:45:00.000
12,13,2020-02-08 03:00:00,0,0.6,0,0,22.1,133,-111,0.0,2020-02-07 23:00:00.000
13,14,2020-02-08 03:15:00,0,0.7,0,0,22.1,130,-110,0.0,2020-02-07 23:15:00.000
14,15,2020-02-08 03:30:00,0,0.7,0,0,22.1,126,-109,0.0,2020-02-07 23:30:00.000
15,16,2020-02-08 03:45:00,0,0.7,0,0,22.0,122,-108,0.0,2020-02-07 23:45:00.000
16,17,2020-02-08 04:00:00,0,0.7,0,0,22.0,119,-108,0.0,2020-02-08 00:00:00.000
17,18,2020-02-08 04:15:00,0,0.7,0,0,22.0,115,-107,0.0,2020-02-08 00:15:00.000
18,19,2020-02-08 04:30:00,0,0.7,0,0,22.0,112,-107,0.0,2020-02-08 00:30:00.000
19,20,2020-02-08 04:45:00,0,0.8,0,0,22.0,108,-106,0.0,2020-02-08 00:45:00.000
20,21,2020-02-08 05:00:00,0,0.8,0,0,21.9,105,-106,0.0,2020-02-08 01:00:00.000
21,22,2020-02-08 05:15:00,0,0.8,0,0,21.9,101,-106,0.0,2020-02-08 01:15:00.000
22,23,2020-02-08 05:30:00,0,0.8,0,0,21.9,97,-106,0.0,2020-02-08 01:30:00.000
23,24,2020-02-08 05:45:00,0,0.8,0,0,21.9,94,-106,0.0,2020-02-08 01:45:00.000
24,25,2020-02-08 06:00:00,2,0.8,3,2,22.0,90,-106,0.0,2020-02-08 02:00:00.000
25,26,2020-02-08 06:15:00,32,0.8,103,23,22.4,86,-106,2.7,2020-02-08 02:15:00.000
26,27,2020-02-08 06:30:00,69,0.8,121,54,22.9,83,-106,13.7,2020-02-08 02:30:00.000
27,28,2020-02-08 06:45:00,118,0.8,194,82,23.3,79,-106,14.0,2020-02-08 02:45:00.000
28,29,2020-02-08 07:00:00,172,0.7,269,105,23.8,76,-106,13.2,2020-02-08 03:00:00.000
29,30,2020-02-08 07:15:00,240,0.6,430,108,24.8,72,-107,7.9,2020-02-08 03:15:00.000
30,31,2020-02-08 07:30:00,298,0.4,462,128,25.8,68,-107,8.3,2020-02-08 03:30:00.000
31,32,2020-02-08 07:45:00,368,0.3,576,122,26.8,65,-108,5.4,2020-02-08 03:45:00.000
32,33,2020-02-08 08:00:00,452,0.1,758,88,27.7,61,-108,0.0,2020-02-08 04:00:00.000
33,34,2020-02-08 08:15:00,513,0.1,788,93,28.4,58,-109,0.0,2020-02-08 04:15:00.000
34,35,2020-02-08 08:30:00,573,0.0,814,97,29.0,54,-110,0.0,2020-02-08 04:30:00.000
35,36,2020-02-08 08:45:00,630,0.1,835,101,29.6,51,-111,0.0,2020-02-08 04:45:00.000
36,37,2020-02-08 09:00:00,684,0.2,853,104,30.1,47,-112,0.0,2020-02-08 05:00:00.000
37,38,2020-02-08 09:15:00,735,0.2,868,108,30.5,44,-114,0.0,2020-02-08 05:15:00.000
38,39,2020-02-08 09:30:00,782,0.3,881,111,30.8,40,-115,0.0,2020-02-08 05:30:00.000
39,40,2020-02-08 09:45:00,826,0.4,892,114,31.1,37,-117,0.0,2020-02-08 05:45:00.000
40,41,2020-02-08 10:00:00,866,0.4,901,116,31.4,34,-120,0.0,2020-02-08 06:00:00.000
41,42,2020-02-08 10:15:00,901,0.4,908,119,31.5,31,-123,0.0,2020-02-08 06:15:00.000
42,43,2020-02-08 10:30:00,932,0.5,914,121,31.6,27,-127,0.0,2020-02-08 06:30:00.000
43,44,2020-02-08 10:45:00,958,0.5,918,123,31.7,25,-132,0.0,2020-02-08 06:45:00.000
44,45,2020-02-08 11:00:00,971,0.5,893,143,31.7,22,-138,0.9,2020-02-08 07:00:00.000
45,46,2020-02-08 11:15:00,996,0.4,923,127,31.7,20,-146,0.0,2020-02-08 07:15:00.000
46,47,2020-02-08 11:30:00,1008,0.3,923,129,31.6,18,-156,0.0,2020-02-08 07:30:00.000
47,48,2020-02-08 11:45:00,1002,0.2,882,157,31.5,17,-167,1.2,2020-02-08 07:45:00.000
48,49,2020-02-08 12:00:00,969,0.2,769,230,31.5,16,180,4.7,2020-02-08 08:00:00.000
49,50,2020-02-08 12:15:00,944,0.2,700,273,31.3,17,167,6.8,2020-02-08 08:15:00.000
50,51,2020-02-08 12:30:00,939,0.2,703,270,31.2,18,156,6.6,2020-02-08 08:30:00.000
51,52,2020-02-08 12:45:00,813,0.2,386,450,31.0,20,146,18.1,2020-02-08 08:45:00.000
52,53,2020-02-08 13:00:00,514,0.2,56,462,30.8,22,138,47.3,2020-02-08 09:00:00.000
53,54,2020-02-08 13:15:00,475,0.3,14,463,30.7,25,132,50.0,2020-02-08 09:15:00.000
54,55,2020-02-08 13:30:00,567,0.3,9,559,30.5,28,127,38.7,2020-02-08 09:30:00.000
55,56,2020-02-08 13:45:00,512,0.4,0,512,30.3,31,123,42.6,2020-02-08 09:45:00.000
56,57,2020-02-08 14:00:00,287,0.4,0,287,30.2,34,120,66.5,2020-02-08 10:00:00.000
57,58,2020-02-08 14:15:00,127,0.4,0,127,30.1,37,117,84.4,2020-02-08 10:15:00.000
58,59,2020-02-08 14:30:00,148,0.4,0,148,30.1,40,115,80.6,2020-02-08 10:30:00.000
59,60,2020-02-08 14:45:00,252,0.5,0,252,30.0,44,113,65.1,2020-02-08 10:45:00.000
60,61,2020-02-08 15:00:00,405,0.5,26,388,29.9,47,112,39.2,2020-02-08 11:00:00.000
61,62,2020-02-08 15:15:00,506,0.6,312,308,29.7,51,111,17.7,2020-02-08 11:15:00.000
62,63,2020-02-08 15:30:00,372,0.7,42,346,29.5,54,110,33.4,2020-02-08 11:30:00.000
63,64,2020-02-08 15:45:00,362,0.8,115,303,29.3,58,109,26.9,2020-02-08 11:45:00.000
64,65,2020-02-08 16:00:00,349,0.8,212,247,29.0,61,108,20.1,2020-02-08 12:00:00.000
65,66,2020-02-08 16:15:00,262,0.9,25,251,28.7,65,107,30.0,2020-02-08 12:15:00.000
66,67,2020-02-08 16:30:00,248,0.9,177,185,28.3,69,107,19.6,2020-02-08 12:30:00.000
67,68,2020-02-08 16:45:00,143,1.0,0,143,28.0,72,106,42.7,2020-02-08 12:45:00.000
68,69,2020-02-08 17:00:00,110,1.0,0,110,27.6,76,106,39.8,2020-02-08 13:00:00.000
69,70,2020-02-08 17:15:00,76,1.0,0,76,27.1,79,106,40.0,2020-02-08 13:15:00.000
70,71,2020-02-08 17:30:00,37,0.9,0,37,26.5,83,106,47.4,2020-02-08 13:30:00.000
71,72,2020-02-08 17:45:00,24,0.9,4,24,26.0,87,106,11.0,2020-02-08 13:45:00.000
72,73,2020-02-08 18:00:00,2,0.9,3,2,25.5,90,105,0.0,2020-02-08 14:00:00.000
73,74,2020-02-08 18:15:00,0,0.9,0,0,25.2,94,105,0.0,2020-02-08 14:15:00.000
74,75,2020-02-08 18:30:00,0,1.0,0,0,24.9,97,105,0.0,2020-02-08 14:30:00.000
75,76,2020-02-08 18:45:00,0,1.0,0,0,24.6,101,106,0.0,2020-02-08 14:45:00.000
76,77,2020-02-08 19:00:00,0,1.0,0,0,24.3,105,106,0.0,2020-02-08 15:00:00.000
77,78,2020-02-08 19:15:00,0,1.0,0,0,24.2,108,106,0.0,2020-02-08 15:15:00.000
78,79,2020-02-08 19:30:00,0,1.0,0,0,24.2,112,106,0.0,2020-02-08 15:30:00.000
79,80,2020-02-08 19:45:00,0,1.0,0,0,24.1,115,107,0.0,2020-02-08 15:45:00.000
80,81,2020-02-08 20:00:00,0,1.1,0,0,24.0,119,107,0.0,2020-02-08 16:00:00.000
81,82,2020-02-08 20:15:00,0,1.1,0,0,23.9,123,108,0.0,2020-02-08 16:15:00.000
82,83,2020-02-08 20:30:00,0,1.2,0,0,23.8,126,109,0.0,2020-02-08 16:30:00.000
83,84,2020-02-08 20:45:00,0,1.3,0,0,23.7,130,110,0.0,2020-02-08 16:45:00.000
84,85,2020-02-08 21:00:00,0,1.3,0,0,23.6,133,111,0.0,2020-02-08 17:00:00.000
85,86,2020-02-08 21:15:00,0,1.3,0,0,23.5,137,112,0.0,2020-02-08 17:15:00.000
86,87,2020-02-08 21:30:00,0,1.3,0,0,23.5,140,114,0.0,2020-02-08 17:30:00.000
87,88,2020-02-08 21:45:00,0,1.3,0,0,23.4,144,116,0.0,2020-02-08 17:45:00.000
88,89,2020-02-08 22:00:00,0,1.3,0,0,23.3,147,118,0.0,2020-02-08 18:00:00.000
89,90,2020-02-08 22:15:00,0,1.3,0,0,23.3,150,121,0.0,2020-02-08 18:15:00.000
90,91,2020-02-08 22:30:00,0,1.3,0,0,23.2,153,125,0.0,2020-02-08 18:30:00.000
91,92,2020-02-08 22:45:00,0,1.3,0,0,23.2,156,130,0.0,2020-02-08 18:45:00.000
92,93,2020-02-08 23:00:00,0,1.3,0,0,23.2,159,136,0.0,2020-02-08 19:00:00.000
93,94,2020-02-08 23:15:00,0,1.3,0,0,23.1,162,144,0.0,2020-02-08 19:15:00.000
94,95,2020-02-08 23:30:00,0,1.3,0,0,23.1,164,154,0.0,2020-02-08 19:30:00.000
95,96,2020-02-08 23:45:00,0,1.3,0,0,23.0,165,166,0.0,2020-02-08 19:45:00.000
