,BLOCK_ID,DATA_DATETIME,GHI,WIND_SPEED,DNI,DHI,TEMPERATURE,ZENITH,AZIMUTH,CLOUD_OPACITY,ENTRY_TIME
0,1,2020-09-05 00:00:00,0,1.6,0,0,23.1,171,-26,93.0,2020-09-04 20:00:00.000
1,2,2020-09-05 00:15:00,0,1.5,0,0,23.1,169,-43,96.3,2020-09-04 20:15:00.000
2,3,2020-09-05 00:30:00,0,1.4,0,0,23.0,166,-55,97.0,2020-09-04 20:30:00.000
3,4,2020-09-05 00:45:00,0,1.4,0,0,22.9,163,-62,96.7,2020-09-04 20:45:00.000
4,5,2020-09-05 01:00:00,0,1.3,0,0,22.9,160,-67,92.0,2020-09-04 21:00:00.000
5,6,2020-09-05 01:15:00,0,1.2,0,0,22.9,156,-70,91.7,2020-09-04 21:15:00.000
6,7,2020-09-05 01:30:00,0,1.2,0,0,22.9,153,-73,88.6,2020-09-04 21:30:00.000
7,8,2020-09-05 01:45:00,0,1.1,0,0,22.9,149,-75,89.9,2020-09-04 21:45:00.000
8,9,2020-09-05 02:00:00,0,1.0,0,0,22.9,145,-76,92.8,2020-09-04 22:00:00.000
9,10,2020-09-05 02:15:00,0,1.0,0,0,22.9,142,-78,93.9,2020-09-04 22:15:00.000
10,11,2020-09-05 02:30:00,0,1.0,0,0,22.8,138,-78,95.2,2020-09-04 22:30:00.000
11,12,2020-09-05 02:45:00,0,1.0,0,0,22.8,134,-79,89.7,2020-09-04 22:45:00.000
12,13,2020-09-05 03:00:00,0,1.0,0,0,22.7,131,-80,73.0,2020-09-04 23:00:00.000
13,14,2020-09-05 03:15:00,0,0.9,0,0,22.7,127,-81,64.5,2020-09-04 23:15:00.000
14,15,2020-09-05 03:30:00,0,0.9,0,0,22.7,123,-81,67.4,2020-09-04 23:30:00.000
15,16,2020-09-05 03:45:00,0,0.8,0,0,22.6,120,-81,57.1,2020-09-04 23:45:00.000
16,17,2020-09-05 04:00:00,0,0.8,0,0,22.6,116,-82,29.4,2020-09-05 00:00:00.000
17,18,2020-09-05 04:15:00,0,0.7,0,0,22.6,112,-82,26.4,2020-09-05 00:15:00.000
18,19,2020-09-05 04:30:00,0,0.6,0,0,22.6,108,-82,34.2,2020-09-05 00:30:00.000
19,20,2020-09-05 04:45:00,0,0.5,0,0,22.5,105,-82,23.8,2020-09-05 00:45:00.000
20,21,2020-09-05 05:00:00,0,0.4,0,0,22.5,101,-83,33.0,2020-09-05 01:00:00.000
21,22,2020-09-05 05:15:00,0,0.4,0,0,22.5,97,-83,41.8,2020-09-05 01:15:00.000
22,23,2020-09-05 05:30:00,0,0.3,0,0,22.6,94,-83,36.6,2020-09-05 01:30:00.000
23,24,2020-09-05 05:45:00,3,0.3,0,3,22.6,90,-83,22.5,2020-09-05 01:45:00.000
24,25,2020-09-05 06:00:00,29,0.3,20,27,22.7,86,-83,16.6,2020-09-05 02:00:00.000
25,26,2020-09-05 06:15:00,69,0.3,111,54,23.0,82,-83,15.3,2020-09-05 02:15:00.000
26,27,2020-09-05 06:30:00,119,0.3,221,75,23.4,79,-83,12.8,2020-09-05 02:30:00.000
27,28,2020-09-05 06:45:00,166,0.3,235,104,23.7,75,-83,15.2,2020-09-05 02:45:00.000
28,29,2020-09-05 07:00:00,251,0.4,554,71,24.2,71,-83,2.2,2020-09-05 03:00:00.000
29,30,2020-09-05 07:15:00,317,0.4,652,68,24.8,68,-83,0.0,2020-09-05 03:15:00.000
30,31,2020-09-05 07:30:00,379,0.5,691,73,25.5,64,-82,0.0,2020-09-05 03:30:00.000
31,32,2020-09-05 07:45:00,439,0.6,723,78,26.1,60,-82,0.0,2020-09-05 03:45:00.000
32,33,2020-09-05 08:00:00,499,0.7,751,82,26.7,56,-82,0.0,2020-09-05 04:00:00.000
33,34,2020-09-05 08:15:00,535,0.9,677,126,27.0,53,-82,3.6,2020-09-05 04:15:00.000
34,35,2020-09-05 08:30:00,597,1.0,728,116,27.4,49,-81,2.4,2020-09-05 04:30:00.000
35,36,2020-09-05 08:45:00,663,1.1,808,93,27.7,45,-81,0.0,2020-09-05 04:45:00.000
36,37,2020-09-05 09:00:00,711,1.3,822,96,28.0,41,-80,0.0,2020-09-05 05:00:00.000
37,38,2020-09-05 09:15:00,757,1.3,834,98,28.3,38,-79,0.0,2020-09-05 05:15:00.000
38,39,2020-09-05 09:30:00,799,1.4,843,100,28.5,34,-78,0.0,2020-09-05 05:30:00.000
39,40,2020-09-05 09:45:00,837,1.4,852,103,28.8,30,-77,0.0,2020-09-05 05:45:00.000
40,41,2020-09-05 10:00:00,822,1.5,692,205,29.0,27,-75,5.6,2020-09-05 06:00:00.000
41,42,2020-09-05 10:15:00,672,1.6,214,476,29.0,23,-73,25.3,2020-09-05 06:15:00.000
42,43,2020-09-05 10:30:00,774,1.7,417,381,29.0,20,-70,16.4,2020-09-05 06:30:00.000
43,44,2020-09-05 10:45:00,822,1.8,496,346,29.0,16,-66,13.0,2020-09-05 06:45:00.000
44,45,2020-09-05 11:00:00,892,1.9,655,253,29.0,13,-59,7.2,2020-09-05 07:00:00.000
45,46,2020-09-05 11:15:00,869,2.0,559,318,29.0,10,-48,10.6,2020-09-05 07:15:00.000
46,47,2020-09-05 11:30:00,728,2.2,219,511,28.9,7,-28,25.6,2020-09-05 07:30:00.000
47,48,2020-09-05 11:45:00,739,2.3,232,509,28.9,7,1,24.6,2020-09-05 07:45:00.000
48,49,2020-09-05 12:00:00,808,2.4,387,424,28.9,8,31,17.4,2020-09-05 08:00:00.000
49,50,2020-09-05 12:15:00,877,2.4,583,303,28.8,10,49,9.7,2020-09-05 08:15:00.000
50,51,2020-09-05 12:30:00,842,2.4,515,340,28.7,13,60,12.2,2020-09-05 08:30:00.000
51,52,2020-09-05 12:45:00,936,2.5,842,128,28.7,16,67,0.7,2020-09-05 08:45:00.000
52,53,2020-09-05 13:00:00,921,2.4,860,113,28.6,20,71,0.0,2020-09-05 09:00:00.000
53,54,2020-09-05 13:15:00,895,2.2,855,111,28.5,24,74,0.0,2020-09-05 09:15:00.000
54,55,2020-09-05 13:30:00,865,2.0,849,109,28.5,27,76,0.0,2020-09-05 09:30:00.000
55,56,2020-09-05 13:45:00,831,1.7,841,108,28.4,31,77,0.0,2020-09-05 09:45:00.000
56,57,2020-09-05 14:00:00,792,1.6,831,107,28.3,34,78,0.0,2020-09-05 10:00:00.000
57,58,2020-09-05 14:15:00,750,1.6,820,104,28.4,38,79,0.0,2020-09-05 10:15:00.000
58,59,2020-09-05 14:30:00,670,1.6,670,170,28.4,42,80,4.8,2020-09-05 10:30:00.000
59,60,2020-09-05 14:45:00,655,1.7,794,99,28.4,45,81,0.0,2020-09-05 10:45:00.000
60,61,2020-09-05 15:00:00,603,1.7,778,95,28.4,49,81,0.0,2020-09-05 11:00:00.000
61,62,2020-09-05 15:15:00,549,1.7,759,91,28.3,53,82,0.0,2020-09-05 11:15:00.000
62,63,2020-09-05 15:30:00,492,1.7,736,87,28.2,57,82,0.0,2020-09-05 11:30:00.000
63,64,2020-09-05 15:45:00,433,1.7,710,82,28.2,60,82,0.0,2020-09-05 11:45:00.000
64,65,2020-09-05 16:00:00,373,1.7,678,76,28.0,64,83,0.0,2020-09-05 12:00:00.000
65,66,2020-09-05 16:15:00,312,1.6,639,70,27.8,68,83,0.0,2020-09-05 12:15:00.000
66,67,2020-09-05 16:30:00,251,1.6,590,63,27.5,71,83,0.0,2020-09-05 12:30:00.000
67,68,2020-09-05 16:45:00,187,1.6,485,62,27.2,75,83,2.1,2020-09-05 12:45:00.000
68,69,2020-09-05 17:00:00,108,1.6,125,82,26.9,79,83,19.0,2020-09-05 13:00:00.000
69,70,2020-09-05 17:15:00,77,1.6,303,36,26.3,83,83,2.4,2020-09-05 13:15:00.000
70,71,2020-09-05 17:30:00,28,1.5,32,25,25.7,86,83,13.6,2020-09-05 13:30:00.000
71,72,2020-09-05 17:45:00,1,1.5,0,1,25.1,90,83,48.8,2020-09-05 13:45:00.000
72,73,2020-09-05 18:00:00,0,1.5,0,0,24.6,94,83,18.0,2020-09-05 14:00:00.000
73,74,2020-09-05 18:15:00,0,1.5,0,0,24.5,98,83,18.7,2020-09-05 14:15:00.000
74,75,2020-09-05 18:30:00,0,1.5,0,0,24.3,101,83,18.8,2020-09-05 14:30:00.000
75,76,2020-09-05 18:45:00,0,1.5,0,0,24.2,105,83,19.0,2020-09-05 14:45:00.000
76,77,2020-09-05 19:00:00,0,1.4,0,0,24.1,109,82,19.8,2020-09-05 15:00:00.000
77,78,2020-09-05 19:15:00,0,1.3,0,0,24.0,112,82,23.3,2020-09-05 15:15:00.000
78,79,2020-09-05 19:30:00,0,1.2,0,0,24.0,116,82,21.6,2020-09-05 15:30:00.000
79,80,2020-09-05 19:45:00,0,1.0,0,0,23.9,120,82,21.0,2020-09-05 15:45:00.000
80,81,2020-09-05 20:00:00,0,0.9,0,0,23.9,124,81,17.0,2020-09-05 16:00:00.000
81,82,2020-09-05 20:15:00,0,0.9,0,0,23.8,127,81,28.5,2020-09-05 16:15:00.000
82,83,2020-09-05 20:30:00,0,0.9,0,0,23.8,131,80,39.8,2020-09-05 16:30:00.000
83,84,2020-09-05 20:45:00,0,0.9,0,0,23.7,135,80,28.0,2020-09-05 16:45:00.000
84,85,2020-09-05 21:00:00,0,0.9,0,0,23.6,138,79,15.6,2020-09-05 17:00:00.000
85,86,2020-09-05 21:15:00,0,0.9,0,0,23.6,142,78,14.7,2020-09-05 17:15:00.000
86,87,2020-09-05 21:30:00,0,0.9,0,0,23.5,146,77,17.2,2020-09-05 17:30:00.000
87,88,2020-09-05 21:45:00,0,0.8,0,0,23.5,149,75,25.6,2020-09-05 17:45:00.000
88,89,2020-09-05 22:00:00,0,0.8,0,0,23.4,153,73,16.8,2020-09-05 18:00:00.000
89,90,2020-09-05 22:15:00,0,0.7,0,0,23.3,156,71,18.6,2020-09-05 18:15:00.000
90,91,2020-09-05 22:30:00,0,0.7,0,0,23.3,160,68,20.0,2020-09-05 18:30:00.000
91,92,2020-09-05 22:45:00,0,0.6,0,0,23.2,163,63,21.0,2020-09-05 18:45:00.000
92,93,2020-09-05 23:00:00,0,0.5,0,0,23.2,167,56,20.2,2020-09-05 19:00:00.000
93,94,2020-09-05 23:15:00,0,0.5,0,0,23.1,169,44,18.0,2020-09-05 19:15:00.000
94,95,2020-09-05 23:30:00,0,0.4,0,0,23.1,172,25,19.6,2020-09-05 19:30:00.000
95,96,2020-09-05 23:45:00,0,0.4,0,0,23.0,172,-1,24.0,2020-09-05 19:45:00.000
