,BLOCK_ID,DATA_DATETIME,GHI,WIND_SPEED,DNI,DHI,TEMPERATURE,ZENITH,AZIMUTH,CLOUD_OPACITY,ENTRY_TIME
0,1,2019-06-10 00:00:00,0,0.5,0,0,23.7,156,-9,37.0,2019-06-09 20:00:00.000
1,2,2019-06-10 00:15:00,0,0.5,0,0,23.7,155,-17,37.0,2019-06-09 20:15:00.000
2,3,2019-06-10 00:30:00,0,0.5,0,0,23.6,154,-25,37.0,2019-06-09 20:30:00.000
3,4,2019-06-10 00:45:00,0,0.5,0,0,23.6,152,-31,37.0,2019-06-09 20:45:00.000
4,5,2019-06-10 01:00:00,0,0.6,0,0,23.6,150,-37,30.7,2019-06-09 21:00:00.000
5,6,2019-06-10 01:15:00,0,0.6,0,0,23.7,148,-42,37.3,2019-06-09 21:15:00.000
6,7,2019-06-10 01:30:00,0,0.7,0,0,23.7,145,-46,37.3,2019-06-09 21:30:00.000
7,8,2019-06-10 01:45:00,0,0.7,0,0,23.8,142,-49,37.3,2019-06-09 21:45:00.000
8,9,2019-06-10 02:00:00,0,0.7,0,0,23.8,140,-52,21.9,2019-06-09 22:00:00.000
9,10,2019-06-10 02:15:00,0,0.7,0,0,23.8,136,-55,31.3,2019-06-09 22:15:00.000
10,11,2019-06-10 02:30:00,0,0.7,0,0,23.8,133,-57,32.5,2019-06-09 22:30:00.000
11,12,2019-06-10 02:45:00,0,0.7,0,0,23.8,130,-59,38.9,2019-06-09 22:45:00.000
12,13,2019-06-10 03:00:00,0,0.6,0,0,23.8,127,-60,37.0,2019-06-09 23:00:00.000
13,14,2019-06-10 03:15:00,0,0.6,0,0,23.8,124,-62,37.0,2019-06-09 23:15:00.000
14,15,2019-06-10 03:30:00,0,0.7,0,0,23.8,120,-63,37.0,2019-06-09 23:30:00.000
15,16,2019-06-10 03:45:00,0,0.7,0,0,23.8,117,-64,34.1,2019-06-09 23:45:00.000
16,17,2019-06-10 04:00:00,0,0.7,0,0,23.8,114,-65,33.7,2019-06-10 00:00:00.000
17,18,2019-06-10 04:15:00,0,0.7,0,0,23.8,110,-65,37.0,2019-06-10 00:15:00.000
18,19,2019-06-10 04:30:00,0,0.8,0,0,23.8,107,-66,49.8,2019-06-10 00:30:00.000
19,20,2019-06-10 04:45:00,0,0.8,0,0,23.8,103,-66,35.9,2019-06-10 00:45:00.000
20,21,2019-06-10 05:00:00,0,0.8,0,0,23.8,100,-67,36.2,2019-06-10 01:00:00.000
21,22,2019-06-10 05:15:00,0,0.9,0,0,23.9,97,-67,38.1,2019-06-10 01:15:00.000
22,23,2019-06-10 05:30:00,0,0.9,0,0,23.9,93,-67,60.4,2019-06-10 01:30:00.000
23,24,2019-06-10 05:45:00,1,0.9,0,1,23.9,90,-67,64.8,2019-06-10 01:45:00.000
24,25,2019-06-10 06:00:00,18,0.9,0,18,24.0,86,-67,46.4,2019-06-10 02:00:00.000
25,26,2019-06-10 06:15:00,56,1.0,8,55,24.1,83,-67,23.6,2019-06-10 02:15:00.000
26,27,2019-06-10 06:30:00,85,1.1,5,84,24.3,79,-67,29.8,2019-06-10 02:30:00.000
27,28,2019-06-10 06:45:00,110,1.1,0,110,24.5,76,-67,36.9,2019-06-10 02:45:00.000
28,29,2019-06-10 07:00:00,165,1.2,44,151,24.7,72,-66,28.2,2019-06-10 03:00:00.000
29,30,2019-06-10 07:15:00,178,1.3,0,178,24.9,69,-66,37.4,2019-06-10 03:15:00.000
30,31,2019-06-10 07:30:00,218,1.3,0,218,25.2,66,-65,35.7,2019-06-10 03:30:00.000
31,32,2019-06-10 07:45:00,287,1.4,94,242,25.4,62,-64,27.3,2019-06-10 03:45:00.000
32,33,2019-06-10 08:00:00,362,1.4,251,232,25.6,59,-63,18.9,2019-06-10 04:00:00.000
33,34,2019-06-10 08:15:00,445,1.5,447,189,25.7,56,-62,10.7,2019-06-10 04:15:00.000
34,35,2019-06-10 08:30:00,545,1.5,723,102,25.7,52,-61,0.2,2019-06-10 04:30:00.000
35,36,2019-06-10 08:45:00,561,1.6,601,167,25.7,49,-60,5.3,2019-06-10 04:45:00.000
36,37,2019-06-10 09:00:00,587,1.6,546,206,25.8,46,-58,7.8,2019-06-10 05:00:00.000
37,38,2019-06-10 09:15:00,580,1.6,408,282,25.8,43,-56,14.3,2019-06-10 05:15:00.000
38,39,2019-06-10 09:30:00,452,1.5,35,425,25.9,40,-53,36.9,2019-06-10 05:30:00.000
39,40,2019-06-10 09:45:00,328,1.5,0,328,26.0,37,-50,56.3,2019-06-10 05:45:00.000
40,41,2019-06-10 10:00:00,376,1.5,0,376,26.1,34,-47,51.8,2019-06-10 06:00:00.000
41,42,2019-06-10 10:15:00,413,1.6,0,413,26.3,31,-43,48.9,2019-06-10 06:15:00.000
42,43,2019-06-10 10:30:00,386,1.6,0,386,26.5,29,-38,53.6,2019-06-10 06:30:00.000
43,44,2019-06-10 10:45:00,304,1.7,0,304,26.7,27,-32,64.2,2019-06-10 06:45:00.000
44,45,2019-06-10 11:00:00,249,1.7,0,249,26.8,25,-25,71.3,2019-06-10 07:00:00.000
45,46,2019-06-10 11:15:00,219,1.8,0,219,26.9,23,-17,75.0,2019-06-10 07:15:00.000
46,47,2019-06-10 11:30:00,216,1.9,0,216,27.0,23,-9,75.6,2019-06-10 07:30:00.000
47,48,2019-06-10 11:45:00,260,2.0,0,260,27.1,22,0,70.7,2019-06-10 07:45:00.000
48,49,2019-06-10 12:00:00,230,2.0,0,230,27.2,23,9,74.0,2019-06-10 08:00:00.000
49,50,2019-06-10 12:15:00,351,2.0,0,351,27.2,23,18,60.0,2019-06-10 08:15:00.000
50,51,2019-06-10 12:30:00,498,2.0,0,498,27.1,25,26,42.6,2019-06-10 08:30:00.000
51,52,2019-06-10 12:45:00,478,2.0,0,478,27.1,27,32,43.8,2019-06-10 08:45:00.000
52,53,2019-06-10 13:00:00,505,1.9,0,505,27.1,29,38,39.2,2019-06-10 09:00:00.000
53,54,2019-06-10 13:15:00,495,1.8,0,495,27.0,31,43,38.8,2019-06-10 09:15:00.000
54,55,2019-06-10 13:30:00,408,1.7,0,408,26.9,34,47,47.8,2019-06-10 09:30:00.000
55,56,2019-06-10 13:45:00,262,1.5,0,262,26.8,37,51,65.2,2019-06-10 09:45:00.000
56,57,2019-06-10 14:00:00,160,1.4,0,160,26.7,40,53,77.6,2019-06-10 10:00:00.000
57,58,2019-06-10 14:15:00,189,1.4,0,189,26.6,43,56,72.0,2019-06-10 10:15:00.000
58,59,2019-06-10 14:30:00,210,1.4,0,210,26.5,46,58,66.6,2019-06-10 10:30:00.000
59,60,2019-06-10 14:45:00,222,1.4,0,222,26.4,49,60,62.1,2019-06-10 10:45:00.000
60,61,2019-06-10 15:00:00,267,1.4,0,267,26.3,52,61,50.5,2019-06-10 11:00:00.000
61,62,2019-06-10 15:15:00,292,1.4,0,292,26.1,56,62,40.5,2019-06-10 11:15:00.000
62,63,2019-06-10 15:30:00,221,1.4,0,221,25.9,59,63,49.9,2019-06-10 11:30:00.000
63,64,2019-06-10 15:45:00,170,1.3,0,170,25.7,62,64,56.1,2019-06-10 11:45:00.000
64,65,2019-06-10 16:00:00,146,1.3,0,146,25.5,66,65,56.3,2019-06-10 12:00:00.000
65,66,2019-06-10 16:15:00,137,1.3,0,137,25.3,69,66,51.1,2019-06-10 12:15:00.000
66,67,2019-06-10 16:30:00,96,1.2,0,96,25.1,73,66,57.5,2019-06-10 12:30:00.000
67,68,2019-06-10 16:45:00,75,1.2,0,75,25.0,76,67,55.1,2019-06-10 12:45:00.000
68,69,2019-06-10 17:00:00,52,1.2,0,52,24.8,79,67,57.3,2019-06-10 13:00:00.000
69,70,2019-06-10 17:15:00,43,1.2,0,43,24.7,83,67,40.4,2019-06-10 13:15:00.000
70,71,2019-06-10 17:30:00,17,1.2,0,17,24.5,86,67,43.3,2019-06-10 13:30:00.000
71,72,2019-06-10 17:45:00,3,1.2,0,3,24.4,90,67,14.0,2019-06-10 13:45:00.000
72,73,2019-06-10 18:00:00,0,1.2,0,0,24.2,93,67,14.0,2019-06-10 14:00:00.000
73,74,2019-06-10 18:15:00,0,1.2,0,0,24.2,97,67,40.3,2019-06-10 14:15:00.000
74,75,2019-06-10 18:30:00,0,1.1,0,0,24.1,100,67,49.8,2019-06-10 14:30:00.000
75,76,2019-06-10 18:45:00,0,1.1,0,0,24.1,104,66,65.3,2019-06-10 14:45:00.000
76,77,2019-06-10 19:00:00,0,1.1,0,0,24.0,107,66,65.2,2019-06-10 15:00:00.000
77,78,2019-06-10 19:15:00,0,0.9,0,0,24.0,110,65,59.7,2019-06-10 15:15:00.000
78,79,2019-06-10 19:30:00,0,0.8,0,0,24.0,114,64,42.0,2019-06-10 15:30:00.000
79,80,2019-06-10 19:45:00,0,0.7,0,0,24.0,117,64,63.4,2019-06-10 15:45:00.000
80,81,2019-06-10 20:00:00,0,0.7,0,0,23.9,121,63,66.0,2019-06-10 16:00:00.000
81,82,2019-06-10 20:15:00,0,0.6,0,0,23.9,124,62,66.8,2019-06-10 16:15:00.000
82,83,2019-06-10 20:30:00,0,0.4,0,0,23.9,127,60,66.8,2019-06-10 16:30:00.000
83,84,2019-06-10 20:45:00,0,0.4,0,0,23.9,130,59,67.0,2019-06-10 16:45:00.000
84,85,2019-06-10 21:00:00,0,0.3,0,0,23.8,134,57,67.0,2019-06-10 17:00:00.000
85,86,2019-06-10 21:15:00,0,0.2,0,0,23.8,137,55,67.0,2019-06-10 17:15:00.000
86,87,2019-06-10 21:30:00,0,0.2,0,0,23.8,140,52,67.0,2019-06-10 17:30:00.000
87,88,2019-06-10 21:45:00,0,0.1,0,0,23.8,143,49,67.0,2019-06-10 17:45:00.000
88,89,2019-06-10 22:00:00,0,0.1,0,0,23.7,145,46,67.0,2019-06-10 18:00:00.000
89,90,2019-06-10 22:15:00,0,0.1,0,0,23.7,148,41,67.0,2019-06-10 18:15:00.000
90,91,2019-06-10 22:30:00,0,0.1,0,0,23.7,150,36,67.0,2019-06-10 18:30:00.000
91,92,2019-06-10 22:45:00,0,0.2,0,0,23.7,152,31,67.0,2019-06-10 18:45:00.000
92,93,2019-06-10 23:00:00,0,0.2,0,0,23.7,154,24,67.0,2019-06-10 19:00:00.000
93,94,2019-06-10 23:15:00,0,0.2,0,0,23.7,155,17,67.0,2019-06-10 19:15:00.000
94,95,2019-06-10 23:30:00,0,0.2,0,0,23.7,156,8,67.0,2019-06-10 19:30:00.000
95,96,2019-06-10 23:45:00,0,0.2,0,0,23.7,156,0,70.6,2019-06-10 19:45:00.000
