,BLOCK_ID,DATA_DATETIME,GHI,WIND_SPEED,DNI,DHI,TEMPERATURE,ZENITH,AZIMUTH,CLOUD_OPACITY,ENTRY_TIME
0,1,2019-07-14 00:00:00,0,2.1,0,0,22.2,157,-5,41.2,2019-07-13 20:00:00.000
1,2,2019-07-14 00:15:00,0,2.1,0,0,22.3,157,-14,52.5,2019-07-13 20:15:00.000
2,3,2019-07-14 00:30:00,0,2.2,0,0,22.3,155,-22,22.5,2019-07-13 20:30:00.000
3,4,2019-07-14 00:45:00,0,2.2,0,0,22.4,154,-29,37.8,2019-07-13 20:45:00.000
4,5,2019-07-14 01:00:00,0,2.2,0,0,22.4,152,-36,37.8,2019-07-13 21:00:00.000
5,6,2019-07-14 01:15:00,0,2.2,0,0,22.4,149,-41,38.2,2019-07-13 21:15:00.000
6,7,2019-07-14 01:30:00,0,2.1,0,0,22.5,147,-45,53.7,2019-07-13 21:30:00.000
7,8,2019-07-14 01:45:00,0,2.1,0,0,22.5,144,-49,51.4,2019-07-13 21:45:00.000
8,9,2019-07-14 02:00:00,0,2.1,0,0,22.5,141,-52,64.4,2019-07-13 22:00:00.000
9,10,2019-07-14 02:15:00,0,2.1,0,0,22.5,138,-55,61.5,2019-07-13 22:15:00.000
10,11,2019-07-14 02:30:00,0,2.2,0,0,22.6,135,-57,80.7,2019-07-13 22:30:00.000
11,12,2019-07-14 02:45:00,0,2.3,0,0,22.6,132,-59,60.4,2019-07-13 22:45:00.000
12,13,2019-07-14 03:00:00,0,2.4,0,0,22.6,129,-61,60.4,2019-07-13 23:00:00.000
13,14,2019-07-14 03:15:00,0,2.4,0,0,22.6,125,-62,52.2,2019-07-13 23:15:00.000
14,15,2019-07-14 03:30:00,0,2.5,0,0,22.6,122,-63,33.2,2019-07-13 23:30:00.000
15,16,2019-07-14 03:45:00,0,2.5,0,0,22.5,119,-64,40.7,2019-07-13 23:45:00.000
16,17,2019-07-14 04:00:00,0,2.6,0,0,22.5,115,-65,51.6,2019-07-14 00:00:00.000
17,18,2019-07-14 04:15:00,0,2.6,0,0,22.5,112,-66,49.3,2019-07-14 00:15:00.000
18,19,2019-07-14 04:30:00,0,2.6,0,0,22.4,108,-67,54.6,2019-07-14 00:30:00.000
19,20,2019-07-14 04:45:00,0,2.7,0,0,22.4,105,-67,54.9,2019-07-14 00:45:00.000
20,21,2019-07-14 05:00:00,0,2.7,0,0,22.4,102,-67,11.1,2019-07-14 01:00:00.000
21,22,2019-07-14 05:15:00,0,2.7,0,0,22.4,98,-68,0.0,2019-07-14 01:15:00.000
22,23,2019-07-14 05:30:00,0,2.6,0,0,22.4,95,-68,0.0,2019-07-14 01:30:00.000
23,24,2019-07-14 05:45:00,1,2.6,1,1,22.3,91,-68,0.0,2019-07-14 01:45:00.000
24,25,2019-07-14 06:00:00,18,2.6,60,13,22.4,88,-68,0.0,2019-07-14 02:00:00.000
25,26,2019-07-14 06:15:00,46,2.6,33,43,22.6,84,-68,17.3,2019-07-14 02:15:00.000
26,27,2019-07-14 06:30:00,74,2.6,0,74,22.9,81,-68,27.2,2019-07-14 02:30:00.000
27,28,2019-07-14 06:45:00,122,2.6,96,100,23.1,77,-68,21.5,2019-07-14 02:45:00.000
28,29,2019-07-14 07:00:00,168,2.7,158,124,23.4,74,-67,19.5,2019-07-14 03:00:00.000
29,30,2019-07-14 07:15:00,215,2.8,201,147,23.8,70,-67,18.7,2019-07-14 03:15:00.000
30,31,2019-07-14 07:30:00,240,3.0,121,194,24.3,67,-66,25.0,2019-07-14 03:30:00.000
31,32,2019-07-14 07:45:00,255,3.1,29,242,24.7,63,-66,32.1,2019-07-14 03:45:00.000
32,33,2019-07-14 08:00:00,272,3.3,0,272,25.1,60,-65,36.7,2019-07-14 04:00:00.000
33,34,2019-07-14 08:15:00,302,3.5,13,295,25.3,57,-64,37.5,2019-07-14 04:15:00.000
34,35,2019-07-14 08:30:00,366,3.6,59,330,25.5,53,-63,31.5,2019-07-14 04:30:00.000
35,36,2019-07-14 08:45:00,338,3.8,0,338,25.7,50,-61,42.0,2019-07-14 04:45:00.000
36,37,2019-07-14 09:00:00,319,3.9,0,319,25.9,47,-60,49.2,2019-07-14 05:00:00.000
37,38,2019-07-14 09:15:00,388,4.0,27,368,26.2,44,-58,42.4,2019-07-14 05:15:00.000
38,39,2019-07-14 09:30:00,411,4.1,18,397,26.4,40,-56,42.2,2019-07-14 05:30:00.000
39,40,2019-07-14 09:45:00,463,4.2,26,442,26.6,37,-53,38.2,2019-07-14 05:45:00.000
40,41,2019-07-14 10:00:00,670,4.3,445,302,26.8,34,-50,14.4,2019-07-14 06:00:00.000
41,42,2019-07-14 10:15:00,726,4.4,532,274,26.9,32,-46,10.5,2019-07-14 06:15:00.000
42,43,2019-07-14 10:30:00,653,4.4,273,415,27.0,29,-41,21.8,2019-07-14 06:30:00.000
43,44,2019-07-14 10:45:00,639,4.5,194,466,27.1,27,-36,25.3,2019-07-14 06:45:00.000
44,45,2019-07-14 11:00:00,627,4.5,141,500,27.2,25,-29,27.8,2019-07-14 07:00:00.000
45,46,2019-07-14 11:15:00,741,4.5,386,387,27.3,23,-22,15.5,2019-07-14 07:15:00.000
46,47,2019-07-14 11:30:00,740,4.5,362,404,27.4,22,-13,16.3,2019-07-14 07:30:00.000
47,48,2019-07-14 11:45:00,549,4.5,3,547,27.6,21,-4,38.1,2019-07-14 07:45:00.000
48,49,2019-07-14 12:00:00,566,4.5,2,565,27.7,21,6,36.2,2019-07-14 08:00:00.000
49,50,2019-07-14 12:15:00,298,4.5,0,298,27.7,22,15,67.2,2019-07-14 08:15:00.000
50,51,2019-07-14 12:30:00,43,4.5,0,43,27.6,23,23,95.7,2019-07-14 08:30:00.000
51,52,2019-07-14 12:45:00,439,4.4,34,408,27.6,25,31,48.9,2019-07-14 08:45:00.000
52,53,2019-07-14 13:00:00,532,4.4,23,511,27.6,27,37,37.0,2019-07-14 09:00:00.000
53,54,2019-07-14 13:15:00,674,4.3,323,393,27.6,30,42,18.0,2019-07-14 09:15:00.000
54,55,2019-07-14 13:30:00,779,4.2,721,169,27.5,32,47,2.1,2019-07-14 09:30:00.000
55,56,2019-07-14 13:45:00,658,4.2,410,321,27.5,35,50,14.3,2019-07-14 09:45:00.000
56,57,2019-07-14 14:00:00,643,4.1,450,289,27.4,38,54,12.3,2019-07-14 10:00:00.000
57,58,2019-07-14 14:15:00,551,4.0,263,355,27.3,41,56,20.9,2019-07-14 10:15:00.000
58,59,2019-07-14 14:30:00,594,4.0,491,241,27.3,44,58,9.8,2019-07-14 10:30:00.000
59,60,2019-07-14 14:45:00,514,3.9,329,290,27.2,47,60,16.5,2019-07-14 10:45:00.000
60,61,2019-07-14 15:00:00,498,3.9,412,238,27.1,51,62,12.3,2019-07-14 11:00:00.000
61,62,2019-07-14 15:15:00,519,3.8,703,106,26.9,54,63,0.0,2019-07-14 11:15:00.000
62,63,2019-07-14 15:30:00,464,3.7,656,110,26.7,57,64,0.9,2019-07-14 11:30:00.000
63,64,2019-07-14 15:45:00,415,3.7,650,97,26.6,61,65,0.0,2019-07-14 11:45:00.000
64,65,2019-07-14 16:00:00,360,3.6,616,91,26.4,64,66,0.0,2019-07-14 12:00:00.000
65,66,2019-07-14 16:15:00,260,3.5,260,160,26.2,68,66,14.5,2019-07-14 12:15:00.000
66,67,2019-07-14 16:30:00,239,3.4,452,93,26.0,71,67,3.3,2019-07-14 12:30:00.000
67,68,2019-07-14 16:45:00,156,3.3,217,95,25.8,74,67,20.7,2019-07-14 12:45:00.000
68,69,2019-07-14 17:00:00,61,3.1,0,61,25.5,78,68,56.5,2019-07-14 13:00:00.000
69,70,2019-07-14 17:15:00,54,3.0,0,54,25.0,81,68,40.5,2019-07-14 13:15:00.000
70,71,2019-07-14 17:30:00,27,2.8,0,27,24.6,85,68,34.9,2019-07-14 13:30:00.000
71,72,2019-07-14 17:45:00,11,2.6,0,11,24.1,88,68,9.0,2019-07-14 13:45:00.000
72,73,2019-07-14 18:00:00,0,2.5,0,0,23.7,92,68,26.6,2019-07-14 14:00:00.000
73,74,2019-07-14 18:15:00,0,2.4,0,0,23.5,95,68,12.4,2019-07-14 14:15:00.000
74,75,2019-07-14 18:30:00,0,2.3,0,0,23.3,99,68,0.0,2019-07-14 14:30:00.000
75,76,2019-07-14 18:45:00,0,2.3,0,0,23.1,102,67,0.0,2019-07-14 14:45:00.000
76,77,2019-07-14 19:00:00,0,2.2,0,0,22.9,106,67,0.0,2019-07-14 15:00:00.000
77,78,2019-07-14 19:15:00,0,2.0,0,0,22.8,109,67,0.0,2019-07-14 15:15:00.000
78,79,2019-07-14 19:30:00,0,1.8,0,0,22.7,113,66,0.0,2019-07-14 15:30:00.000
79,80,2019-07-14 19:45:00,0,1.6,0,0,22.6,116,65,0.0,2019-07-14 15:45:00.000
80,81,2019-07-14 20:00:00,0,1.5,0,0,22.5,119,64,16.1,2019-07-14 16:00:00.000
81,82,2019-07-14 20:15:00,0,1.5,0,0,22.5,123,63,19.7,2019-07-14 16:15:00.000
82,83,2019-07-14 20:30:00,0,1.6,0,0,22.4,126,62,19.0,2019-07-14 16:30:00.000
83,84,2019-07-14 20:45:00,0,1.7,0,0,22.4,129,61,0.0,2019-07-14 16:45:00.000
84,85,2019-07-14 21:00:00,0,1.7,0,0,22.3,133,59,0.0,2019-07-14 17:00:00.000
85,86,2019-07-14 21:15:00,0,1.8,0,0,22.3,136,57,11.9,2019-07-14 17:15:00.000
86,87,2019-07-14 21:30:00,0,1.8,0,0,22.3,139,55,0.0,2019-07-14 17:30:00.000
87,88,2019-07-14 21:45:00,0,1.9,0,0,22.3,142,52,0.0,2019-07-14 17:45:00.000
88,89,2019-07-14 22:00:00,0,1.9,0,0,22.2,145,49,0.0,2019-07-14 18:00:00.000
89,90,2019-07-14 22:15:00,0,2.0,0,0,22.2,147,45,0.0,2019-07-14 18:15:00.000
90,91,2019-07-14 22:30:00,0,2.1,0,0,22.2,150,40,0.0,2019-07-14 18:30:00.000
91,92,2019-07-14 22:45:00,0,2.2,0,0,22.2,152,35,0.0,2019-07-14 18:45:00.000
92,93,2019-07-14 23:00:00,0,2.2,0,0,22.2,154,28,0.0,2019-07-14 19:00:00.000
93,94,2019-07-14 23:15:00,0,2.2,0,0,22.2,156,21,0.0,2019-07-14 19:15:00.000
94,95,2019-07-14 23:30:00,0,2.1,0,0,22.2,157,13,0.0,2019-07-14 19:30:00.000
95,96,2019-07-14 23:45:00,0,2.1,0,0,22.2,157,4,0.0,2019-07-14 19:45:00.000
