,BLOCK_ID,DATA_DATETIME,GHI,WIND_SPEED,DNI,DHI,TEMPERATURE,ZENITH,AZIMUTH,CLOUD_OPACITY,ENTRY_TIME
0,1,2019-01-26 00:00:00,0,3.6,0,0,27.2,161,-178,67.0,2019-01-25 20:00:00.000
1,2,2019-01-26 00:15:00,0,3.6,0,0,27.2,161,-167,67.0,2019-01-25 20:15:00.000
2,3,2019-01-26 00:30:00,0,3.6,0,0,27.1,160,-157,67.0,2019-01-25 20:30:00.000
3,4,2019-01-26 00:45:00,0,3.6,0,0,27.1,158,-149,67.0,2019-01-25 20:45:00.000
4,5,2019-01-26 01:00:00,0,3.6,0,0,27.1,156,-141,67.0,2019-01-25 21:00:00.000
5,6,2019-01-26 01:15:00,0,3.6,0,0,27.0,153,-136,67.0,2019-01-25 21:15:00.000
6,7,2019-01-26 01:30:00,0,3.6,0,0,27.0,151,-131,67.0,2019-01-25 21:30:00.000
7,8,2019-01-26 01:45:00,0,3.7,0,0,26.9,148,-127,67.0,2019-01-25 21:45:00.000
8,9,2019-01-26 02:00:00,0,3.6,0,0,26.9,145,-124,67.7,2019-01-25 22:00:00.000
9,10,2019-01-26 02:15:00,0,3.6,0,0,26.9,141,-121,67.8,2019-01-25 22:15:00.000
10,11,2019-01-26 02:30:00,0,3.5,0,0,26.9,138,-119,67.8,2019-01-25 22:30:00.000
11,12,2019-01-26 02:45:00,0,3.5,0,0,26.8,135,-117,67.2,2019-01-25 22:45:00.000
12,13,2019-01-26 03:00:00,0,3.4,0,0,26.8,132,-115,74.6,2019-01-25 23:00:00.000
13,14,2019-01-26 03:15:00,0,3.4,0,0,26.8,128,-114,80.9,2019-01-25 23:15:00.000
14,15,2019-01-26 03:30:00,0,3.3,0,0,26.8,125,-113,67.8,2019-01-25 23:30:00.000
15,16,2019-01-26 03:45:00,0,3.2,0,0,26.8,121,-112,68.0,2019-01-25 23:45:00.000
16,17,2019-01-26 04:00:00,0,3.2,0,0,26.8,118,-111,61.5,2019-01-26 00:00:00.000
17,18,2019-01-26 04:15:00,0,3.1,0,0,26.7,114,-111,68.0,2019-01-26 00:15:00.000
18,19,2019-01-26 04:30:00,0,3.1,0,0,26.7,111,-110,68.0,2019-01-26 00:30:00.000
19,20,2019-01-26 04:45:00,0,3.0,0,0,26.7,107,-110,68.0,2019-01-26 00:45:00.000
20,21,2019-01-26 05:00:00,0,2.9,0,0,26.7,104,-110,71.6,2019-01-26 01:00:00.000
21,22,2019-01-26 05:15:00,0,2.8,0,0,26.7,100,-109,45.3,2019-01-26 01:15:00.000
22,23,2019-01-26 05:30:00,0,2.7,0,0,26.6,97,-109,61.0,2019-01-26 01:30:00.000
23,24,2019-01-26 05:45:00,0,2.6,0,0,26.6,93,-109,49.1,2019-01-26 01:45:00.000
24,25,2019-01-26 06:00:00,2,2.5,0,2,26.6,90,-109,54.2,2019-01-26 02:00:00.000
25,26,2019-01-26 06:15:00,22,2.3,0,22,26.5,86,-109,46.2,2019-01-26 02:15:00.000
26,27,2019-01-26 06:30:00,62,2.2,0,62,26.5,83,-109,28.6,2019-01-26 02:30:00.000
27,28,2019-01-26 06:45:00,105,2.1,31,98,26.5,79,-110,26.6,2019-01-26 02:45:00.000
28,29,2019-01-26 07:00:00,170,2.0,233,111,26.4,75,-110,16.0,2019-01-26 03:00:00.000
29,30,2019-01-26 07:15:00,213,1.8,226,145,26.4,72,-110,18.6,2019-01-26 03:15:00.000
30,31,2019-01-26 07:30:00,231,1.7,60,209,26.4,68,-111,29.2,2019-01-26 03:30:00.000
31,32,2019-01-26 07:45:00,298,1.6,181,222,26.3,65,-112,23.1,2019-01-26 03:45:00.000
32,33,2019-01-26 08:00:00,282,1.5,37,265,26.3,61,-112,37.0,2019-01-26 04:00:00.000
33,34,2019-01-26 08:15:00,258,1.6,0,258,26.4,58,-113,49.3,2019-01-26 04:15:00.000
34,35,2019-01-26 08:30:00,284,1.7,0,284,26.4,55,-114,49.7,2019-01-26 04:30:00.000
35,36,2019-01-26 08:45:00,296,1.8,0,296,26.4,51,-115,52.3,2019-01-26 04:45:00.000
36,37,2019-01-26 09:00:00,332,1.9,0,332,26.5,48,-117,50.7,2019-01-26 05:00:00.000
37,38,2019-01-26 09:15:00,351,2.0,0,351,26.5,45,-119,51.5,2019-01-26 05:15:00.000
38,39,2019-01-26 09:30:00,372,2.1,0,372,26.6,41,-121,51.6,2019-01-26 05:30:00.000
39,40,2019-01-26 09:45:00,340,2.2,0,340,26.6,38,-123,58.1,2019-01-26 05:45:00.000
40,41,2019-01-26 10:00:00,333,2.3,0,333,26.6,35,-126,60.8,2019-01-26 06:00:00.000
41,42,2019-01-26 10:15:00,415,2.4,0,415,26.7,32,-130,53.1,2019-01-26 06:15:00.000
42,43,2019-01-26 10:30:00,613,2.5,117,510,26.7,29,-134,33.1,2019-01-26 06:30:00.000
43,44,2019-01-26 10:45:00,636,2.6,86,559,26.8,27,-139,32.3,2019-01-26 06:45:00.000
44,45,2019-01-26 11:00:00,708,2.7,206,520,26.8,24,-145,26.4,2019-01-26 07:00:00.000
45,46,2019-01-26 11:15:00,718,2.8,203,531,26.8,22,-153,26.6,2019-01-26 07:15:00.000
46,47,2019-01-26 11:30:00,785,2.9,334,473,26.8,21,-161,20.6,2019-01-26 07:30:00.000
47,48,2019-01-26 11:45:00,730,3.0,198,543,26.8,20,-171,26.7,2019-01-26 07:45:00.000
48,49,2019-01-26 12:00:00,828,3.1,431,422,26.8,20,178,17.0,2019-01-26 08:00:00.000
49,50,2019-01-26 12:15:00,870,3.2,545,359,26.8,20,168,12.5,2019-01-26 08:15:00.000
50,51,2019-01-26 12:30:00,859,3.3,532,364,26.9,21,159,12.9,2019-01-26 08:30:00.000
51,52,2019-01-26 12:45:00,835,3.4,498,376,26.9,23,150,14.3,2019-01-26 08:45:00.000
52,53,2019-01-26 13:00:00,615,3.5,66,555,26.9,25,143,35.7,2019-01-26 09:00:00.000
53,54,2019-01-26 13:15:00,281,3.5,0,281,26.9,27,137,69.9,2019-01-26 09:15:00.000
54,55,2019-01-26 13:30:00,439,3.6,0,439,26.9,30,132,51.5,2019-01-26 09:30:00.000
55,56,2019-01-26 13:45:00,388,3.7,0,388,26.9,33,128,55.7,2019-01-26 09:45:00.000
56,57,2019-01-26 14:00:00,397,3.8,0,397,26.9,36,125,52.7,2019-01-26 10:00:00.000
57,58,2019-01-26 14:15:00,356,3.8,0,356,26.9,39,122,55.6,2019-01-26 10:15:00.000
58,59,2019-01-26 14:30:00,179,3.9,0,179,26.9,42,120,76.5,2019-01-26 10:30:00.000
59,60,2019-01-26 14:45:00,94,3.9,0,94,26.9,46,118,86.7,2019-01-26 10:45:00.000
60,61,2019-01-26 15:00:00,166,3.9,0,166,27.0,49,116,74.9,2019-01-26 11:00:00.000
61,62,2019-01-26 15:15:00,156,3.9,0,156,27.0,52,115,74.2,2019-01-26 11:15:00.000
62,63,2019-01-26 15:30:00,221,3.9,0,221,27.0,56,114,59.7,2019-01-26 11:30:00.000
63,64,2019-01-26 15:45:00,260,3.9,0,260,27.0,59,113,47.2,2019-01-26 11:45:00.000
64,65,2019-01-26 16:00:00,226,3.9,0,226,27.0,63,112,47.6,2019-01-26 12:00:00.000
65,66,2019-01-26 16:15:00,217,4.0,5,215,27.0,66,111,41.2,2019-01-26 12:15:00.000
66,67,2019-01-26 16:30:00,146,4.0,3,145,27.0,70,111,53.2,2019-01-26 12:30:00.000
67,68,2019-01-26 16:45:00,67,4.0,0,67,27.1,73,110,73.2,2019-01-26 12:45:00.000
68,69,2019-01-26 17:00:00,51,4.0,0,51,27.0,77,110,72.2,2019-01-26 13:00:00.000
69,70,2019-01-26 17:15:00,26,3.9,0,26,27.0,80,109,78.6,2019-01-26 13:15:00.000
70,71,2019-01-26 17:30:00,25,3.7,0,25,26.9,84,109,64.2,2019-01-26 13:30:00.000
71,72,2019-01-26 17:45:00,14,3.6,0,14,26.8,87,109,47.9,2019-01-26 13:45:00.000
72,73,2019-01-26 18:00:00,1,3.5,0,1,26.8,91,109,45.8,2019-01-26 14:00:00.000
73,74,2019-01-26 18:15:00,0,3.4,0,0,26.7,94,109,44.2,2019-01-26 14:15:00.000
74,75,2019-01-26 18:30:00,0,3.3,0,0,26.6,98,109,49.0,2019-01-26 14:30:00.000
75,76,2019-01-26 18:45:00,0,3.2,0,0,26.5,101,109,46.3,2019-01-26 14:45:00.000
76,77,2019-01-26 19:00:00,0,3.1,0,0,26.5,105,110,46.2,2019-01-26 15:00:00.000
77,78,2019-01-26 19:15:00,0,2.9,0,0,26.4,108,110,52.6,2019-01-26 15:15:00.000
78,79,2019-01-26 19:30:00,0,2.8,0,0,26.3,112,110,69.0,2019-01-26 15:30:00.000
79,80,2019-01-26 19:45:00,0,2.7,0,0,26.3,115,111,74.3,2019-01-26 15:45:00.000
80,81,2019-01-26 20:00:00,0,2.6,0,0,26.2,119,112,56.3,2019-01-26 16:00:00.000
81,82,2019-01-26 20:15:00,0,2.7,0,0,26.3,122,112,52.0,2019-01-26 16:15:00.000
82,83,2019-01-26 20:30:00,0,2.7,0,0,26.4,126,113,52.0,2019-01-26 16:30:00.000
83,84,2019-01-26 20:45:00,0,2.8,0,0,26.5,129,114,52.0,2019-01-26 16:45:00.000
84,85,2019-01-26 21:00:00,0,2.8,0,0,26.6,133,116,52.0,2019-01-26 17:00:00.000
85,86,2019-01-26 21:15:00,0,2.8,0,0,26.7,136,117,52.0,2019-01-26 17:15:00.000
86,87,2019-01-26 21:30:00,0,2.9,0,0,26.8,139,119,52.0,2019-01-26 17:30:00.000
87,88,2019-01-26 21:45:00,0,2.9,0,0,26.9,143,122,52.0,2019-01-26 17:45:00.000
88,89,2019-01-26 22:00:00,0,3.0,0,0,27.0,146,124,52.0,2019-01-26 18:00:00.000
89,90,2019-01-26 22:15:00,0,3.0,0,0,27.0,149,128,53.8,2019-01-26 18:15:00.000
90,91,2019-01-26 22:30:00,0,3.1,0,0,27.1,152,132,55.9,2019-01-26 18:30:00.000
91,92,2019-01-26 22:45:00,0,3.1,0,0,27.2,154,137,53.2,2019-01-26 18:45:00.000
92,93,2019-01-26 23:00:00,0,3.2,0,0,27.3,157,143,58.8,2019-01-26 19:00:00.000
93,94,2019-01-26 23:15:00,0,3.2,0,0,27.2,159,151,66.0,2019-01-26 19:15:00.000
94,95,2019-01-26 23:30:00,0,3.3,0,0,27.2,160,160,66.0,2019-01-26 19:30:00.000
95,96,2019-01-26 23:45:00,0,3.4,0,0,27.1,161,171,66.0,2019-01-26 19:45:00.000
