,BLOCK_ID,DATA_DATETIME,GHI,WIND_SPEED,DNI,DHI,TEMPERATURE,ZENITH,AZIMUTH,CLOUD_OPACITY,ENTRY_TIME
0,1,2020-04-10 00:00:00,0,1.2,0,0,22.8,171,-21,0.0,2020-04-09 20:00:00.000
1,2,2020-04-10 00:15:00,0,1.2,0,0,22.7,169,-40,0.0,2020-04-09 20:15:00.000
2,3,2020-04-10 00:30:00,0,1.3,0,0,22.7,167,-52,0.0,2020-04-09 20:30:00.000
3,4,2020-04-10 00:45:00,0,1.3,0,0,22.7,163,-60,0.0,2020-04-09 20:45:00.000
4,5,2020-04-10 01:00:00,0,1.3,0,0,22.7,160,-65,0.0,2020-04-09 21:00:00.000
5,6,2020-04-10 01:15:00,0,1.2,0,0,22.6,157,-69,0.0,2020-04-09 21:15:00.000
6,7,2020-04-10 01:30:00,0,1.2,0,0,22.6,153,-72,0.0,2020-04-09 21:30:00.000
7,8,2020-04-10 01:45:00,0,1.2,0,0,22.6,150,-74,0.0,2020-04-09 21:45:00.000
8,9,2020-04-10 02:00:00,0,1.1,0,0,22.5,146,-75,0.0,2020-04-09 22:00:00.000
9,10,2020-04-10 02:15:00,0,1.1,0,0,22.5,142,-77,0.0,2020-04-09 22:15:00.000
10,11,2020-04-10 02:30:00,0,1.2,0,0,22.5,139,-78,0.0,2020-04-09 22:30:00.000
11,12,2020-04-10 02:45:00,0,1.2,0,0,22.4,135,-79,0.0,2020-04-09 22:45:00.000
12,13,2020-04-10 03:00:00,0,1.2,0,0,22.4,131,-79,0.0,2020-04-09 23:00:00.000
13,14,2020-04-10 03:15:00,0,1.2,0,0,22.4,128,-80,0.0,2020-04-09 23:15:00.000
14,15,2020-04-10 03:30:00,0,1.2,0,0,22.3,124,-80,0.0,2020-04-09 23:30:00.000
15,16,2020-04-10 03:45:00,0,1.2,0,0,22.3,120,-81,0.0,2020-04-09 23:45:00.000
16,17,2020-04-10 04:00:00,0,1.2,0,0,22.3,116,-81,0.0,2020-04-10 00:00:00.000
17,18,2020-04-10 04:15:00,0,1.2,0,0,22.3,113,-81,0.0,2020-04-10 00:15:00.000
18,19,2020-04-10 04:30:00,0,1.2,0,0,22.2,109,-82,0.0,2020-04-10 00:30:00.000
19,20,2020-04-10 04:45:00,0,1.2,0,0,22.2,105,-82,0.0,2020-04-10 00:45:00.000
20,21,2020-04-10 05:00:00,0,1.2,0,0,22.2,102,-82,0.0,2020-04-10 01:00:00.000
21,22,2020-04-10 05:15:00,0,1.2,0,0,22.2,98,-82,0.0,2020-04-10 01:15:00.000
22,23,2020-04-10 05:30:00,0,1.3,0,0,22.2,94,-82,0.0,2020-04-10 01:30:00.000
23,24,2020-04-10 05:45:00,3,1.3,6,2,22.2,91,-82,0.0,2020-04-10 01:45:00.000
24,25,2020-04-10 06:00:00,28,1.3,124,18,22.3,87,-82,0.0,2020-04-10 02:00:00.000
25,26,2020-04-10 06:15:00,75,1.3,332,34,22.8,83,-82,0.0,2020-04-10 02:15:00.000
26,27,2020-04-10 06:30:00,130,1.2,448,47,23.2,79,-82,0.0,2020-04-10 02:30:00.000
27,28,2020-04-10 06:45:00,190,1.2,534,57,23.7,76,-82,0.0,2020-04-10 02:45:00.000
28,29,2020-04-10 07:00:00,253,1.2,600,66,24.3,72,-82,0.0,2020-04-10 03:00:00.000
29,30,2020-04-10 07:15:00,316,1.3,651,74,25.0,68,-82,0.0,2020-04-10 03:15:00.000
30,31,2020-04-10 07:30:00,378,1.4,691,81,25.8,64,-82,0.0,2020-04-10 03:30:00.000
31,32,2020-04-10 07:45:00,441,1.5,725,87,26.5,61,-82,0.0,2020-04-10 03:45:00.000
32,33,2020-04-10 08:00:00,502,1.6,753,92,27.2,57,-81,0.0,2020-04-10 04:00:00.000
33,34,2020-04-10 08:15:00,561,1.6,777,97,27.7,53,-81,0.0,2020-04-10 04:15:00.000
34,35,2020-04-10 08:30:00,618,1.6,797,101,28.2,50,-80,0.0,2020-04-10 04:30:00.000
35,36,2020-04-10 08:45:00,672,1.6,814,105,28.7,46,-80,0.0,2020-04-10 04:45:00.000
36,37,2020-04-10 09:00:00,723,1.6,828,109,29.1,42,-79,0.0,2020-04-10 05:00:00.000
37,38,2020-04-10 09:15:00,706,1.6,596,240,29.5,39,-78,8.3,2020-04-10 05:15:00.000
38,39,2020-04-10 09:30:00,800,1.6,798,144,29.8,35,-77,1.8,2020-04-10 05:30:00.000
39,40,2020-04-10 09:45:00,824,1.5,752,180,30.2,31,-76,3.5,2020-04-10 05:45:00.000
40,41,2020-04-10 10:00:00,889,1.5,867,121,30.5,28,-74,0.0,2020-04-10 06:00:00.000
41,42,2020-04-10 10:15:00,921,1.5,873,123,30.6,24,-72,0.0,2020-04-10 06:15:00.000
42,43,2020-04-10 10:30:00,948,1.5,878,125,30.8,20,-69,0.0,2020-04-10 06:30:00.000
43,44,2020-04-10 10:45:00,970,1.6,882,126,30.9,17,-65,0.0,2020-04-10 06:45:00.000
44,45,2020-04-10 11:00:00,988,1.6,886,127,31.1,14,-58,0.0,2020-04-10 07:00:00.000
45,46,2020-04-10 11:15:00,1001,1.6,889,127,31.1,11,-48,0.0,2020-04-10 07:15:00.000
46,47,2020-04-10 11:30:00,1009,1.7,890,128,31.1,8,-31,0.0,2020-04-10 07:30:00.000
47,48,2020-04-10 11:45:00,1012,1.7,891,128,31.1,7,-4,0.0,2020-04-10 07:45:00.000
48,49,2020-04-10 12:00:00,1010,1.8,891,128,31.1,8,24,0.0,2020-04-10 08:00:00.000
49,50,2020-04-10 12:15:00,1003,1.8,890,127,31.1,10,44,0.0,2020-04-10 08:15:00.000
50,51,2020-04-10 12:30:00,992,1.9,888,126,31.1,13,56,0.0,2020-04-10 08:30:00.000
51,52,2020-04-10 12:45:00,976,2.0,885,125,31.0,16,63,0.0,2020-04-10 08:45:00.000
52,53,2020-04-10 13:00:00,954,2.2,881,124,31.0,20,68,0.0,2020-04-10 09:00:00.000
53,54,2020-04-10 13:15:00,929,2.6,877,122,30.9,23,71,0.0,2020-04-10 09:15:00.000
54,55,2020-04-10 13:30:00,898,3.0,870,121,30.8,27,74,0.0,2020-04-10 09:30:00.000
55,56,2020-04-10 13:45:00,863,3.4,860,120,30.7,30,76,0.0,2020-04-10 09:45:00.000
56,57,2020-04-10 14:00:00,824,3.7,849,119,30.6,34,77,0.0,2020-04-10 10:00:00.000
57,58,2020-04-10 14:15:00,780,3.6,835,118,30.4,38,78,0.0,2020-04-10 10:15:00.000
58,59,2020-04-10 14:30:00,733,3.4,821,116,30.1,41,79,0.0,2020-04-10 10:30:00.000
59,60,2020-04-10 14:45:00,683,3.3,805,113,29.9,45,80,0.0,2020-04-10 10:45:00.000
60,61,2020-04-10 15:00:00,630,3.1,788,109,29.7,49,80,0.0,2020-04-10 11:00:00.000
61,62,2020-04-10 15:15:00,574,3.1,767,105,29.4,52,81,0.0,2020-04-10 11:15:00.000
62,63,2020-04-10 15:30:00,515,3.1,743,100,29.1,56,81,0.0,2020-04-10 11:30:00.000
63,64,2020-04-10 15:45:00,455,3.0,715,94,28.9,60,81,0.0,2020-04-10 11:45:00.000
64,65,2020-04-10 16:00:00,393,2.9,682,88,28.6,63,82,0.0,2020-04-10 12:00:00.000
65,66,2020-04-10 16:15:00,331,2.8,641,81,28.2,67,82,0.0,2020-04-10 12:15:00.000
66,67,2020-04-10 16:30:00,267,2.7,591,73,27.9,71,82,0.0,2020-04-10 12:30:00.000
67,68,2020-04-10 16:45:00,205,2.6,528,64,27.5,75,82,0.0,2020-04-10 12:45:00.000
68,69,2020-04-10 17:00:00,145,2.5,447,53,27.1,78,82,0.0,2020-04-10 13:00:00.000
69,70,2020-04-10 17:15:00,88,2.3,339,40,26.6,82,82,0.0,2020-04-10 13:15:00.000
70,71,2020-04-10 17:30:00,40,2.2,165,24,26.0,86,82,0.0,2020-04-10 13:30:00.000
71,72,2020-04-10 17:45:00,7,2.0,13,5,25.5,89,82,0.0,2020-04-10 13:45:00.000
72,73,2020-04-10 18:00:00,0,1.9,0,0,25.0,93,82,0.0,2020-04-10 14:00:00.000
73,74,2020-04-10 18:15:00,0,1.9,0,0,24.7,97,82,0.0,2020-04-10 14:15:00.000
74,75,2020-04-10 18:30:00,0,1.9,0,0,24.4,101,82,0.0,2020-04-10 14:30:00.000
75,76,2020-04-10 18:45:00,0,1.8,0,0,24.2,104,82,0.0,2020-04-10 14:45:00.000
76,77,2020-04-10 19:00:00,0,1.8,0,0,23.9,108,82,0.0,2020-04-10 15:00:00.000
77,78,2020-04-10 19:15:00,0,1.9,0,0,23.9,112,81,0.0,2020-04-10 15:15:00.000
78,79,2020-04-10 19:30:00,0,2.0,0,0,23.8,115,81,0.0,2020-04-10 15:30:00.000
79,80,2020-04-10 19:45:00,0,2.0,0,0,23.7,119,81,0.0,2020-04-10 15:45:00.000
80,81,2020-04-10 20:00:00,0,2.1,0,0,23.7,123,80,0.0,2020-04-10 16:00:00.000
81,82,2020-04-10 20:15:00,0,2.0,0,0,23.6,126,80,0.0,2020-04-10 16:15:00.000
82,83,2020-04-10 20:30:00,0,1.9,0,0,23.5,130,79,0.0,2020-04-10 16:30:00.000
83,84,2020-04-10 20:45:00,0,1.9,0,0,23.4,134,78,0.0,2020-04-10 16:45:00.000
84,85,2020-04-10 21:00:00,0,1.8,0,0,23.4,137,78,0.0,2020-04-10 17:00:00.000
85,86,2020-04-10 21:15:00,0,1.8,0,0,23.3,141,77,0.0,2020-04-10 17:15:00.000
86,87,2020-04-10 21:30:00,0,1.8,0,0,23.3,145,75,0.0,2020-04-10 17:30:00.000
87,88,2020-04-10 21:45:00,0,1.8,0,0,23.2,148,74,0.0,2020-04-10 17:45:00.000
88,89,2020-04-10 22:00:00,0,1.8,0,0,23.2,152,72,0.0,2020-04-10 18:00:00.000
89,90,2020-04-10 22:15:00,0,1.8,0,0,23.2,156,69,0.0,2020-04-10 18:15:00.000
90,91,2020-04-10 22:30:00,0,1.8,0,0,23.1,159,66,0.0,2020-04-10 18:30:00.000
91,92,2020-04-10 22:45:00,0,1.7,0,0,23.1,162,61,0.0,2020-04-10 18:45:00.000
92,93,2020-04-10 23:00:00,0,1.7,0,0,23.1,165,54,0.0,2020-04-10 19:00:00.000
93,94,2020-04-10 23:15:00,0,1.7,0,0,23.0,168,43,0.0,2020-04-10 19:15:00.000
94,95,2020-04-10 23:30:00,0,1.7,0,0,22.9,170,26,0.0,2020-04-10 19:30:00.000
95,96,2020-04-10 23:45:00,0,1.7,0,0,22.9,171,3,0.0,2020-04-10 19:45:00.000
