,BLOCK_ID,DATA_DATETIME,GHI,WIND_SPEED,DNI,DHI,TEMPERATURE,ZENITH,AZIMUTH,CLOUD_OPACITY,ENTRY_TIME
0,1,2019-07-22 00:00:00,0,1.6,0,0,21.6,159,-5,0.0,2019-07-21 20:00:00.000
1,2,2019-07-22 00:15:00,0,1.6,0,0,21.6,158,-14,0.0,2019-07-21 20:15:00.000
2,3,2019-07-22 00:30:00,0,1.6,0,0,21.6,157,-23,0.0,2019-07-21 20:30:00.000
3,4,2019-07-22 00:45:00,0,1.6,0,0,21.5,155,-31,0.0,2019-07-21 20:45:00.000
4,5,2019-07-22 01:00:00,0,1.5,0,0,21.5,153,-37,0.0,2019-07-21 21:00:00.000
5,6,2019-07-22 01:15:00,0,1.6,0,0,21.5,151,-42,0.0,2019-07-21 21:15:00.000
6,7,2019-07-22 01:30:00,0,1.6,0,0,21.5,148,-47,0.0,2019-07-21 21:30:00.000
7,8,2019-07-22 01:45:00,0,1.6,0,0,21.5,145,-51,0.0,2019-07-21 21:45:00.000
8,9,2019-07-22 02:00:00,0,1.6,0,0,21.5,142,-54,0.0,2019-07-21 22:00:00.000
9,10,2019-07-22 02:15:00,0,1.6,0,0,21.5,139,-57,0.0,2019-07-21 22:15:00.000
10,11,2019-07-22 02:30:00,0,1.5,0,0,21.4,136,-59,0.0,2019-07-21 22:30:00.000
11,12,2019-07-22 02:45:00,0,1.5,0,0,21.4,133,-61,0.0,2019-07-21 22:45:00.000
12,13,2019-07-22 03:00:00,0,1.5,0,0,21.3,129,-62,0.0,2019-07-21 23:00:00.000
13,14,2019-07-22 03:15:00,0,1.5,0,0,21.3,126,-64,0.0,2019-07-21 23:15:00.000
14,15,2019-07-22 03:30:00,0,1.5,0,0,21.3,123,-65,0.0,2019-07-21 23:30:00.000
15,16,2019-07-22 03:45:00,0,1.5,0,0,21.2,119,-66,0.0,2019-07-21 23:45:00.000
16,17,2019-07-22 04:00:00,0,1.5,0,0,21.2,116,-67,0.0,2019-07-22 00:00:00.000
17,18,2019-07-22 04:15:00,0,1.5,0,0,21.2,112,-67,0.0,2019-07-22 00:15:00.000
18,19,2019-07-22 04:30:00,0,1.4,0,0,21.1,109,-68,0.0,2019-07-22 00:30:00.000
19,20,2019-07-22 04:45:00,0,1.4,0,0,21.1,105,-68,0.0,2019-07-22 00:45:00.000
20,21,2019-07-22 05:00:00,0,1.4,0,0,21.0,102,-69,0.0,2019-07-22 01:00:00.000
21,22,2019-07-22 05:15:00,0,1.4,0,0,21.0,98,-69,0.0,2019-07-22 01:15:00.000
22,23,2019-07-22 05:30:00,0,1.3,0,0,20.9,95,-69,0.0,2019-07-22 01:30:00.000
23,24,2019-07-22 05:45:00,0,1.3,0,0,20.9,91,-69,0.0,2019-07-22 01:45:00.000
24,25,2019-07-22 06:00:00,16,1.3,55,12,21.0,88,-69,0.0,2019-07-22 02:00:00.000
25,26,2019-07-22 06:15:00,54,1.3,258,28,21.3,84,-69,0.4,2019-07-22 02:15:00.000
26,27,2019-07-22 06:30:00,101,1.3,368,42,21.7,81,-69,1.2,2019-07-22 02:30:00.000
27,28,2019-07-22 06:45:00,156,1.3,483,50,22.1,77,-69,0.0,2019-07-22 02:45:00.000
28,29,2019-07-22 07:00:00,211,1.3,554,57,22.6,74,-69,0.0,2019-07-22 03:00:00.000
29,30,2019-07-22 07:15:00,268,1.3,609,64,23.2,70,-68,0.0,2019-07-22 03:15:00.000
30,31,2019-07-22 07:30:00,326,1.3,652,70,23.9,67,-68,0.0,2019-07-22 03:30:00.000
31,32,2019-07-22 07:45:00,382,1.4,687,75,24.5,63,-67,0.0,2019-07-22 03:45:00.000
32,33,2019-07-22 08:00:00,437,1.4,716,79,25.1,60,-66,0.0,2019-07-22 04:00:00.000
33,34,2019-07-22 08:15:00,491,1.6,741,83,25.5,57,-65,0.0,2019-07-22 04:15:00.000
34,35,2019-07-22 08:30:00,543,1.8,762,87,25.8,53,-64,0.0,2019-07-22 04:30:00.000
35,36,2019-07-22 08:45:00,593,1.9,780,90,26.1,50,-63,0.0,2019-07-22 04:45:00.000
36,37,2019-07-22 09:00:00,640,2.1,796,92,26.4,47,-62,0.0,2019-07-22 05:00:00.000
37,38,2019-07-22 09:15:00,681,2.2,794,103,26.7,43,-60,0.5,2019-07-22 05:15:00.000
38,39,2019-07-22 09:30:00,726,2.3,822,97,27.0,40,-58,0.0,2019-07-22 05:30:00.000
39,40,2019-07-22 09:45:00,760,2.4,819,105,27.2,37,-55,0.4,2019-07-22 05:45:00.000
40,41,2019-07-22 10:00:00,761,2.5,703,177,27.5,34,-52,4.6,2019-07-22 06:00:00.000
41,42,2019-07-22 10:15:00,801,2.6,750,158,27.7,31,-48,3.3,2019-07-22 06:15:00.000
42,43,2019-07-22 10:30:00,853,2.7,849,106,27.9,28,-44,0.2,2019-07-22 06:30:00.000
43,44,2019-07-22 10:45:00,877,2.8,861,102,28.2,26,-38,0.0,2019-07-22 06:45:00.000
44,45,2019-07-22 11:00:00,895,2.8,865,103,28.4,24,-32,0.0,2019-07-22 07:00:00.000
45,46,2019-07-22 11:15:00,909,2.9,868,103,28.5,22,-24,0.0,2019-07-22 07:15:00.000
46,47,2019-07-22 11:30:00,918,3.0,871,103,28.7,21,-15,0.0,2019-07-22 07:30:00.000
47,48,2019-07-22 11:45:00,923,3.1,874,103,28.8,20,-5,0.0,2019-07-22 07:45:00.000
48,49,2019-07-22 12:00:00,924,3.1,875,102,28.9,20,5,0.0,2019-07-22 08:00:00.000
49,50,2019-07-22 12:15:00,920,3.2,875,102,28.9,21,15,0.0,2019-07-22 08:15:00.000
50,51,2019-07-22 12:30:00,911,3.2,874,101,28.9,22,24,0.0,2019-07-22 08:30:00.000
51,52,2019-07-22 12:45:00,898,3.3,873,100,29.0,24,32,0.0,2019-07-22 08:45:00.000
52,53,2019-07-22 13:00:00,880,3.2,870,98,29.0,26,39,0.0,2019-07-22 09:00:00.000
53,54,2019-07-22 13:15:00,858,3.0,866,97,29.0,28,44,0.0,2019-07-22 09:15:00.000
54,55,2019-07-22 13:30:00,832,2.7,861,96,28.9,31,49,0.0,2019-07-22 09:30:00.000
55,56,2019-07-22 13:45:00,802,2.5,854,95,28.9,34,52,0.0,2019-07-22 09:45:00.000
56,57,2019-07-22 14:00:00,768,2.3,846,93,28.9,37,55,0.0,2019-07-22 10:00:00.000
57,58,2019-07-22 14:15:00,730,2.3,836,92,28.8,40,58,0.0,2019-07-22 10:15:00.000
58,59,2019-07-22 14:30:00,688,2.3,824,90,28.7,43,60,0.0,2019-07-22 10:30:00.000
59,60,2019-07-22 14:45:00,644,2.3,811,88,28.6,47,62,0.0,2019-07-22 10:45:00.000
60,61,2019-07-22 15:00:00,596,2.3,796,85,28.5,50,63,0.0,2019-07-22 11:00:00.000
61,62,2019-07-22 15:15:00,546,2.3,778,82,28.3,53,65,0.0,2019-07-22 11:15:00.000
62,63,2019-07-22 15:30:00,493,2.2,758,79,28.1,57,66,0.0,2019-07-22 11:30:00.000
63,64,2019-07-22 15:45:00,439,2.1,733,75,27.9,60,67,0.0,2019-07-22 11:45:00.000
64,65,2019-07-22 16:00:00,383,2.1,703,71,27.7,64,67,0.0,2019-07-22 12:00:00.000
65,66,2019-07-22 16:15:00,325,2.0,667,66,27.4,67,68,0.0,2019-07-22 12:15:00.000
66,67,2019-07-22 16:30:00,268,1.9,624,61,27.1,71,68,0.0,2019-07-22 12:30:00.000
67,68,2019-07-22 16:45:00,210,1.8,569,54,26.8,74,69,0.0,2019-07-22 12:45:00.000
68,69,2019-07-22 17:00:00,154,1.8,498,47,26.4,78,69,0.0,2019-07-22 13:00:00.000
69,70,2019-07-22 17:15:00,99,1.7,370,40,25.7,81,69,2.0,2019-07-22 13:15:00.000
70,71,2019-07-22 17:30:00,52,1.7,251,28,25.0,85,69,1.4,2019-07-22 13:30:00.000
71,72,2019-07-22 17:45:00,15,1.7,53,10,24.3,88,69,0.0,2019-07-22 13:45:00.000
72,73,2019-07-22 18:00:00,0,1.7,0,0,23.7,92,69,0.0,2019-07-22 14:00:00.000
73,74,2019-07-22 18:15:00,0,1.7,0,0,23.5,95,69,0.0,2019-07-22 14:15:00.000
74,75,2019-07-22 18:30:00,0,1.7,0,0,23.2,99,69,0.0,2019-07-22 14:30:00.000
75,76,2019-07-22 18:45:00,0,1.8,0,0,23.0,102,69,0.0,2019-07-22 14:45:00.000
76,77,2019-07-22 19:00:00,0,1.8,0,0,22.8,106,68,0.0,2019-07-22 15:00:00.000
77,78,2019-07-22 19:15:00,0,1.7,0,0,22.8,109,68,0.0,2019-07-22 15:15:00.000
78,79,2019-07-22 19:30:00,0,1.7,0,0,22.7,113,67,0.0,2019-07-22 15:30:00.000
79,80,2019-07-22 19:45:00,0,1.7,0,0,22.7,116,67,0.0,2019-07-22 15:45:00.000
80,81,2019-07-22 20:00:00,0,1.6,0,0,22.7,120,66,0.0,2019-07-22 16:00:00.000
81,82,2019-07-22 20:15:00,0,1.6,0,0,22.6,123,65,0.0,2019-07-22 16:15:00.000
82,83,2019-07-22 20:30:00,0,1.6,0,0,22.5,126,64,0.0,2019-07-22 16:30:00.000
83,84,2019-07-22 20:45:00,0,1.6,0,0,22.5,130,62,0.0,2019-07-22 16:45:00.000
84,85,2019-07-22 21:00:00,0,1.6,0,0,22.4,133,61,0.0,2019-07-22 17:00:00.000
85,86,2019-07-22 21:15:00,0,1.6,0,0,22.4,136,59,0.0,2019-07-22 17:15:00.000
86,87,2019-07-22 21:30:00,0,1.5,0,0,22.3,139,57,0.0,2019-07-22 17:30:00.000
87,88,2019-07-22 21:45:00,0,1.5,0,0,22.3,142,54,0.0,2019-07-22 17:45:00.000
88,89,2019-07-22 22:00:00,0,1.5,0,0,22.3,145,51,0.0,2019-07-22 18:00:00.000
89,90,2019-07-22 22:15:00,0,1.4,0,0,22.2,148,47,0.0,2019-07-22 18:15:00.000
90,91,2019-07-22 22:30:00,0,1.4,0,0,22.2,151,42,0.0,2019-07-22 18:30:00.000
91,92,2019-07-22 22:45:00,0,1.3,0,0,22.1,153,37,0.0,2019-07-22 18:45:00.000
92,93,2019-07-22 23:00:00,0,1.3,0,0,22.1,155,30,0.0,2019-07-22 19:00:00.000
93,94,2019-07-22 23:15:00,0,1.3,0,0,22.1,157,23,0.0,2019-07-22 19:15:00.000
94,95,2019-07-22 23:30:00,0,1.2,0,0,22.1,158,14,0.0,2019-07-22 19:30:00.000
95,96,2019-07-22 23:45:00,0,1.2,0,0,22.0,159,5,0.0,2019-07-22 19:45:00.000
