,BLOCK_ID,DATA_DATETIME,GHI,WIND_SPEED,DNI,DHI,TEMPERATURE,ZENITH,AZIMUTH,CLOUD_OPACITY,ENTRY_TIME
0,1,2020-08-08 00:00:00,0,1.1,0,0,22.8,163,-7,81.0,2020-08-07 20:00:00.000
1,2,2020-08-08 00:15:00,0,1.1,0,0,22.7,162,-18,88.6,2020-08-07 20:15:00.000
2,3,2020-08-08 00:30:00,0,1.1,0,0,22.7,160,-29,49.0,2020-08-07 20:30:00.000
3,4,2020-08-08 00:45:00,0,1.0,0,0,22.6,158,-37,38.8,2020-08-07 20:45:00.000
4,5,2020-08-08 01:00:00,0,1.0,0,0,22.6,156,-44,45.4,2020-08-07 21:00:00.000
5,6,2020-08-08 01:15:00,0,1.1,0,0,22.6,153,-49,56.4,2020-08-07 21:15:00.000
6,7,2020-08-08 01:30:00,0,1.1,0,0,22.5,150,-54,62.9,2020-08-07 21:30:00.000
7,8,2020-08-08 01:45:00,0,1.1,0,0,22.5,147,-57,67.2,2020-08-07 21:45:00.000
8,9,2020-08-08 02:00:00,0,1.1,0,0,22.5,144,-60,58.0,2020-08-07 22:00:00.000
9,10,2020-08-08 02:15:00,0,1.1,0,0,22.4,141,-63,43.2,2020-08-07 22:15:00.000
10,11,2020-08-08 02:30:00,0,1.1,0,0,22.3,137,-65,45.2,2020-08-07 22:30:00.000
11,12,2020-08-08 02:45:00,0,1.1,0,0,22.2,134,-66,44.9,2020-08-07 22:45:00.000
12,13,2020-08-08 03:00:00,0,1.1,0,0,22.1,131,-68,47.0,2020-08-07 23:00:00.000
13,14,2020-08-08 03:15:00,0,1.1,0,0,22.0,127,-69,63.8,2020-08-07 23:15:00.000
14,15,2020-08-08 03:30:00,0,1.1,0,0,21.9,124,-70,69.6,2020-08-07 23:30:00.000
15,16,2020-08-08 03:45:00,0,1.1,0,0,21.8,120,-71,68.5,2020-08-07 23:45:00.000
16,17,2020-08-08 04:00:00,0,1.1,0,0,21.8,116,-71,60.2,2020-08-08 00:00:00.000
17,18,2020-08-08 04:15:00,0,1.1,0,0,21.7,113,-72,62.9,2020-08-08 00:15:00.000
18,19,2020-08-08 04:30:00,0,1.0,0,0,21.7,109,-72,62.6,2020-08-08 00:30:00.000
19,20,2020-08-08 04:45:00,0,1.0,0,0,21.6,106,-73,51.0,2020-08-08 00:45:00.000
20,21,2020-08-08 05:00:00,0,1.0,0,0,21.6,102,-73,54.4,2020-08-08 01:00:00.000
21,22,2020-08-08 05:15:00,0,1.0,0,0,21.6,99,-73,50.3,2020-08-08 01:15:00.000
22,23,2020-08-08 05:30:00,0,1.0,0,0,21.5,95,-73,68.0,2020-08-08 01:30:00.000
23,24,2020-08-08 05:45:00,0,1.0,0,0,21.5,91,-74,74.7,2020-08-08 01:45:00.000
24,25,2020-08-08 06:00:00,7,1.0,0,7,21.6,88,-74,57.8,2020-08-08 02:00:00.000
25,26,2020-08-08 06:15:00,45,1.0,107,31,22.0,84,-74,27.3,2020-08-08 02:15:00.000
26,27,2020-08-08 06:30:00,107,1.1,414,39,22.5,81,-73,0.0,2020-08-08 02:30:00.000
27,28,2020-08-08 06:45:00,159,1.2,463,55,22.9,77,-73,1.8,2020-08-08 02:45:00.000
28,29,2020-08-08 07:00:00,204,1.2,417,85,23.4,73,-73,6.8,2020-08-08 03:00:00.000
29,30,2020-08-08 07:15:00,263,1.2,490,92,24.1,70,-73,5.6,2020-08-08 03:15:00.000
30,31,2020-08-08 07:30:00,336,1.1,661,69,24.8,66,-72,0.0,2020-08-08 03:30:00.000
31,32,2020-08-08 07:45:00,347,1.1,431,153,25.5,63,-72,11.4,2020-08-08 03:45:00.000
32,33,2020-08-08 08:00:00,381,1.2,346,202,26.1,59,-71,15.7,2020-08-08 04:00:00.000
33,34,2020-08-08 08:15:00,462,1.3,514,170,26.5,56,-70,8.8,2020-08-08 04:15:00.000
34,35,2020-08-08 08:30:00,449,1.5,291,272,26.9,52,-70,19.6,2020-08-08 04:30:00.000
35,36,2020-08-08 08:45:00,509,1.7,359,269,27.3,49,-69,16.7,2020-08-08 04:45:00.000
36,37,2020-08-08 09:00:00,615,1.9,611,183,27.7,45,-67,6.6,2020-08-08 05:00:00.000
37,38,2020-08-08 09:15:00,703,2.0,809,98,27.9,42,-66,0.0,2020-08-08 05:15:00.000
38,39,2020-08-08 09:30:00,745,2.2,820,101,28.2,38,-64,0.0,2020-08-08 05:30:00.000
39,40,2020-08-08 09:45:00,740,2.3,685,180,28.5,35,-62,5.4,2020-08-08 05:45:00.000
40,41,2020-08-08 10:00:00,703,2.5,451,319,28.8,32,-59,14.0,2020-08-08 06:00:00.000
41,42,2020-08-08 10:15:00,793,2.6,654,218,28.9,28,-55,6.4,2020-08-08 06:15:00.000
42,43,2020-08-08 10:30:00,866,2.8,818,127,29.1,25,-51,1.0,2020-08-08 06:30:00.000
43,44,2020-08-08 10:45:00,895,3.0,846,114,29.2,23,-45,0.2,2020-08-08 06:45:00.000
44,45,2020-08-08 11:00:00,915,3.1,857,110,29.4,20,-38,0.0,2020-08-08 07:00:00.000
45,46,2020-08-08 11:15:00,853,3.3,624,260,29.4,18,-29,8.1,2020-08-08 07:15:00.000
46,47,2020-08-08 11:30:00,830,3.5,535,318,29.5,17,-18,11.4,2020-08-08 07:30:00.000
47,48,2020-08-08 11:45:00,832,3.7,530,322,29.5,16,-6,11.6,2020-08-08 07:45:00.000
48,49,2020-08-08 12:00:00,834,3.8,535,319,29.5,16,8,11.4,2020-08-08 08:00:00.000
49,50,2020-08-08 12:15:00,937,3.8,863,110,29.5,17,20,0.0,2020-08-08 08:15:00.000
50,51,2020-08-08 12:30:00,927,3.9,862,110,29.6,18,31,0.0,2020-08-08 08:30:00.000
51,52,2020-08-08 12:45:00,913,3.9,859,109,29.6,21,39,0.0,2020-08-08 08:45:00.000
52,53,2020-08-08 13:00:00,895,3.9,855,108,29.6,23,46,0.0,2020-08-08 09:00:00.000
53,54,2020-08-08 13:15:00,872,3.7,850,107,29.5,26,52,0.0,2020-08-08 09:15:00.000
54,55,2020-08-08 13:30:00,845,3.5,843,107,29.5,29,56,0.0,2020-08-08 09:30:00.000
55,56,2020-08-08 13:45:00,813,3.4,832,108,29.4,32,59,0.0,2020-08-08 09:45:00.000
56,57,2020-08-08 14:00:00,777,3.2,819,109,29.4,35,62,0.0,2020-08-08 10:00:00.000
57,58,2020-08-08 14:15:00,737,3.2,805,109,29.3,39,64,0.0,2020-08-08 10:15:00.000
58,59,2020-08-08 14:30:00,694,3.2,790,108,29.2,42,66,0.0,2020-08-08 10:30:00.000
59,60,2020-08-08 14:45:00,649,3.2,775,105,29.1,46,68,0.0,2020-08-08 10:45:00.000
60,61,2020-08-08 15:00:00,600,3.2,759,102,29.0,49,69,0.0,2020-08-08 11:00:00.000
61,62,2020-08-08 15:15:00,549,3.1,740,99,28.8,53,70,0.0,2020-08-08 11:15:00.000
62,63,2020-08-08 15:30:00,495,3.1,717,94,28.6,56,71,0.0,2020-08-08 11:30:00.000
63,64,2020-08-08 15:45:00,439,3.1,690,90,28.4,60,71,0.0,2020-08-08 11:45:00.000
64,65,2020-08-08 16:00:00,382,3.1,658,85,28.1,63,72,0.0,2020-08-08 12:00:00.000
65,66,2020-08-08 16:15:00,324,3.0,620,79,27.9,67,73,0.0,2020-08-08 12:15:00.000
66,67,2020-08-08 16:30:00,265,2.9,573,72,27.6,70,73,0.0,2020-08-08 12:30:00.000
67,68,2020-08-08 16:45:00,207,2.9,514,64,27.3,74,73,0.0,2020-08-08 12:45:00.000
68,69,2020-08-08 17:00:00,150,2.8,440,54,26.9,77,73,0.0,2020-08-08 13:00:00.000
69,70,2020-08-08 17:15:00,96,2.6,343,43,26.5,81,74,0.0,2020-08-08 13:15:00.000
70,71,2020-08-08 17:30:00,44,2.4,78,35,26.0,85,74,11.4,2020-08-08 13:30:00.000
71,72,2020-08-08 17:45:00,10,2.2,0,10,25.5,88,74,24.7,2020-08-08 13:45:00.000
72,73,2020-08-08 18:00:00,0,2.0,0,0,25.2,92,74,16.0,2020-08-08 14:00:00.000
73,74,2020-08-08 18:15:00,0,2.0,0,0,25.0,95,74,51.7,2020-08-08 14:15:00.000
74,75,2020-08-08 18:30:00,0,1.9,0,0,24.8,99,73,54.8,2020-08-08 14:30:00.000
75,76,2020-08-08 18:45:00,0,1.9,0,0,24.6,103,73,59.3,2020-08-08 14:45:00.000
76,77,2020-08-08 19:00:00,0,1.8,0,0,24.5,106,73,61.6,2020-08-08 15:00:00.000
77,78,2020-08-08 19:15:00,0,1.8,0,0,24.4,110,72,62.1,2020-08-08 15:15:00.000
78,79,2020-08-08 19:30:00,0,1.9,0,0,24.3,113,72,59.2,2020-08-08 15:30:00.000
79,80,2020-08-08 19:45:00,0,1.9,0,0,24.3,117,71,61.2,2020-08-08 15:45:00.000
80,81,2020-08-08 20:00:00,0,1.9,0,0,24.2,121,71,60.8,2020-08-08 16:00:00.000
81,82,2020-08-08 20:15:00,0,1.8,0,0,24.3,124,70,56.1,2020-08-08 16:15:00.000
82,83,2020-08-08 20:30:00,0,1.7,0,0,24.3,128,69,48.4,2020-08-08 16:30:00.000
83,84,2020-08-08 20:45:00,0,1.6,0,0,24.3,131,68,52.0,2020-08-08 16:45:00.000
84,85,2020-08-08 21:00:00,0,1.4,0,0,24.3,134,66,55.8,2020-08-08 17:00:00.000
85,86,2020-08-08 21:15:00,0,1.4,0,0,24.3,138,65,51.3,2020-08-08 17:15:00.000
86,87,2020-08-08 21:30:00,0,1.3,0,0,24.3,141,63,55.2,2020-08-08 17:30:00.000
87,88,2020-08-08 21:45:00,0,1.2,0,0,24.3,145,60,52.4,2020-08-08 17:45:00.000
88,89,2020-08-08 22:00:00,0,1.1,0,0,24.3,148,57,53.4,2020-08-08 18:00:00.000
89,90,2020-08-08 22:15:00,0,1.1,0,0,24.2,151,54,50.3,2020-08-08 18:15:00.000
90,91,2020-08-08 22:30:00,0,1.1,0,0,24.2,154,49,62.2,2020-08-08 18:30:00.000
91,92,2020-08-08 22:45:00,0,1.1,0,0,24.1,157,43,64.3,2020-08-08 18:45:00.000
92,93,2020-08-08 23:00:00,0,1.1,0,0,24.0,159,36,40.8,2020-08-08 19:00:00.000
93,94,2020-08-08 23:15:00,0,1.2,0,0,23.9,161,28,50.3,2020-08-08 19:15:00.000
94,95,2020-08-08 23:30:00,0,1.3,0,0,23.8,162,17,50.6,2020-08-08 19:30:00.000
95,96,2020-08-08 23:45:00,0,1.3,0,0,23.6,163,5,66.9,2020-08-08 19:45:00.000
