,BLOCK_ID,DATA_DATETIME,GHI,WIND_SPEED,DNI,DHI,TEMPERATURE,ZENITH,AZIMUTH,CLOUD_OPACITY,ENTRY_TIME
0,1,2019-12-04 00:00:00,0,1.0,0,0,23.7,158,-165,30.0,2019-12-03 20:00:00.000
1,2,2019-12-04 00:15:00,0,1.0,0,0,23.6,157,-156,30.0,2019-12-03 20:15:00.000
2,3,2019-12-04 00:30:00,0,1.0,0,0,23.6,155,-149,30.0,2019-12-03 20:30:00.000
3,4,2019-12-04 00:45:00,0,1.0,0,0,23.6,153,-143,30.0,2019-12-03 20:45:00.000
4,5,2019-12-04 01:00:00,0,1.0,0,0,23.6,150,-138,30.7,2019-12-03 21:00:00.000
5,6,2019-12-04 01:15:00,0,1.0,0,0,23.5,148,-133,30.8,2019-12-03 21:15:00.000
6,7,2019-12-04 01:30:00,0,0.9,0,0,23.5,145,-129,30.8,2019-12-03 21:30:00.000
7,8,2019-12-04 01:45:00,0,0.9,0,0,23.5,142,-126,30.8,2019-12-03 21:45:00.000
8,9,2019-12-04 02:00:00,0,0.8,0,0,23.5,139,-124,6.2,2019-12-03 22:00:00.000
9,10,2019-12-04 02:15:00,0,0.8,0,0,23.4,136,-122,0.0,2019-12-03 22:15:00.000
10,11,2019-12-04 02:30:00,0,0.8,0,0,23.4,133,-120,0.0,2019-12-03 22:30:00.000
11,12,2019-12-04 02:45:00,0,0.8,0,0,23.4,129,-118,0.0,2019-12-03 22:45:00.000
12,13,2019-12-04 03:00:00,0,0.8,0,0,23.4,126,-117,0.0,2019-12-03 23:00:00.000
13,14,2019-12-04 03:15:00,0,0.8,0,0,23.3,123,-116,0.0,2019-12-03 23:15:00.000
14,15,2019-12-04 03:30:00,0,0.8,0,0,23.3,119,-115,0.0,2019-12-03 23:30:00.000
15,16,2019-12-04 03:45:00,0,0.9,0,0,23.3,116,-114,0.0,2019-12-03 23:45:00.000
16,17,2019-12-04 04:00:00,0,0.9,0,0,23.2,112,-114,0.0,2019-12-04 00:00:00.000
17,18,2019-12-04 04:15:00,0,0.8,0,0,23.2,109,-113,0.0,2019-12-04 00:15:00.000
18,19,2019-12-04 04:30:00,0,0.8,0,0,23.2,105,-113,0.0,2019-12-04 00:30:00.000
19,20,2019-12-04 04:45:00,0,0.7,0,0,23.1,102,-112,0.0,2019-12-04 00:45:00.000
20,21,2019-12-04 05:00:00,0,0.7,0,0,23.1,98,-112,0.0,2019-12-04 01:00:00.000
21,22,2019-12-04 05:15:00,0,0.7,0,0,23.1,95,-112,0.0,2019-12-04 01:15:00.000
22,23,2019-12-04 05:30:00,0,0.6,0,0,23.2,92,-112,17.6,2019-12-04 01:30:00.000
23,24,2019-12-04 05:45:00,12,0.6,0,12,23.2,88,-112,21.7,2019-12-04 01:45:00.000
24,25,2019-12-04 06:00:00,50,0.6,137,36,23.3,85,-112,9.8,2019-12-04 02:00:00.000
25,26,2019-12-04 06:15:00,89,0.6,139,68,23.6,81,-112,14.3,2019-12-04 02:15:00.000
26,27,2019-12-04 06:30:00,132,0.6,150,100,24.0,78,-113,17.4,2019-12-04 02:30:00.000
27,28,2019-12-04 06:45:00,182,0.6,209,126,24.3,74,-113,16.5,2019-12-04 02:45:00.000
28,29,2019-12-04 07:00:00,218,0.7,151,169,24.7,71,-114,21.7,2019-12-04 03:00:00.000
29,30,2019-12-04 07:15:00,257,0.7,138,205,25.3,67,-114,24.0,2019-12-04 03:15:00.000
30,31,2019-12-04 07:30:00,314,0.7,204,223,25.9,64,-115,21.5,2019-12-04 03:30:00.000
31,32,2019-12-04 07:45:00,349,0.8,179,262,26.5,61,-116,23.6,2019-12-04 03:45:00.000
32,33,2019-12-04 08:00:00,368,0.8,98,315,27.0,57,-117,28.5,2019-12-04 04:00:00.000
33,34,2019-12-04 08:15:00,403,0.7,119,335,27.5,54,-118,29.0,2019-12-04 04:15:00.000
34,35,2019-12-04 08:30:00,390,0.7,0,390,28.0,51,-120,37.3,2019-12-04 04:30:00.000
35,36,2019-12-04 08:45:00,639,0.7,684,178,28.4,47,-121,4.8,2019-12-04 04:45:00.000
36,37,2019-12-04 09:00:00,581,0.6,323,351,28.9,44,-123,19.0,2019-12-04 05:00:00.000
37,38,2019-12-04 09:15:00,610,0.6,308,379,29.5,41,-126,19.8,2019-12-04 05:15:00.000
38,39,2019-12-04 09:30:00,609,0.5,223,434,30.0,38,-128,24.0,2019-12-04 05:30:00.000
39,40,2019-12-04 09:45:00,704,0.5,414,366,30.5,35,-132,15.9,2019-12-04 05:45:00.000
40,41,2019-12-04 10:00:00,809,0.5,672,242,31.0,33,-136,6.9,2019-12-04 06:00:00.000
41,42,2019-12-04 10:15:00,786,0.5,517,338,31.2,30,-140,12.2,2019-12-04 06:15:00.000
42,43,2019-12-04 10:30:00,779,0.6,444,387,31.3,28,-146,15.1,2019-12-04 06:30:00.000
43,44,2019-12-04 10:45:00,799,0.7,455,390,31.5,26,-152,14.6,2019-12-04 06:45:00.000
44,45,2019-12-04 11:00:00,780,0.8,373,440,31.7,24,-159,17.7,2019-12-04 07:00:00.000
45,46,2019-12-04 11:15:00,778,0.8,348,458,31.7,23,-168,18.6,2019-12-04 07:15:00.000
46,47,2019-12-04 11:30:00,794,0.8,379,444,31.7,23,-176,17.2,2019-12-04 07:30:00.000
47,48,2019-12-04 11:45:00,818,0.9,446,407,31.7,23,175,14.6,2019-12-04 07:45:00.000
48,49,2019-12-04 12:00:00,873,0.9,612,311,31.7,23,166,8.5,2019-12-04 08:00:00.000
49,50,2019-12-04 12:15:00,874,0.9,644,289,31.6,25,158,7.3,2019-12-04 08:15:00.000
50,51,2019-12-04 12:30:00,912,0.9,815,182,31.5,26,151,1.7,2019-12-04 08:30:00.000
51,52,2019-12-04 12:45:00,825,0.8,583,312,31.4,28,144,9.2,2019-12-04 08:45:00.000
52,53,2019-12-04 13:00:00,875,0.8,822,168,31.3,31,139,1.1,2019-12-04 09:00:00.000
53,54,2019-12-04 13:15:00,829,0.7,749,200,31.1,33,135,3.3,2019-12-04 09:15:00.000
54,55,2019-12-04 13:30:00,745,0.7,554,296,31.0,36,131,9.6,2019-12-04 09:30:00.000
55,56,2019-12-04 13:45:00,675,0.7,425,343,30.8,39,128,14.3,2019-12-04 09:45:00.000
56,57,2019-12-04 14:00:00,626,0.7,372,349,30.7,42,125,16.1,2019-12-04 10:00:00.000
57,58,2019-12-04 14:15:00,604,0.6,415,310,30.5,45,123,14.1,2019-12-04 10:15:00.000
58,59,2019-12-04 14:30:00,536,0.6,304,332,30.3,48,121,18.4,2019-12-04 10:30:00.000
59,60,2019-12-04 14:45:00,468,0.6,204,341,30.1,51,119,22.7,2019-12-04 10:45:00.000
60,61,2019-12-04 15:00:00,455,0.6,297,283,29.9,55,118,17.6,2019-12-04 11:00:00.000
61,62,2019-12-04 15:15:00,414,0.5,300,254,29.6,58,117,16.8,2019-12-04 11:15:00.000
62,63,2019-12-04 15:30:00,366,0.6,282,231,29.2,61,116,16.8,2019-12-04 11:30:00.000
63,64,2019-12-04 15:45:00,316,0.6,254,207,28.9,65,115,17.1,2019-12-04 11:45:00.000
64,65,2019-12-04 16:00:00,261,0.7,199,187,28.5,68,114,18.7,2019-12-04 12:00:00.000
65,66,2019-12-04 16:15:00,212,0.7,172,158,28.1,72,114,18.5,2019-12-04 12:15:00.000
66,67,2019-12-04 16:30:00,164,0.8,136,128,27.6,75,113,18.5,2019-12-04 12:30:00.000
67,68,2019-12-04 16:45:00,122,0.9,148,92,27.2,78,113,14.7,2019-12-04 12:45:00.000
68,69,2019-12-04 17:00:00,74,0.9,58,66,26.7,82,112,16.5,2019-12-04 13:00:00.000
69,70,2019-12-04 17:15:00,32,0.9,0,32,26.3,85,112,26.4,2019-12-04 13:15:00.000
70,71,2019-12-04 17:30:00,5,1.0,0,5,25.8,89,112,38.8,2019-12-04 13:30:00.000
71,72,2019-12-04 17:45:00,0,1.0,0,0,25.3,92,112,40.5,2019-12-04 13:45:00.000
72,73,2019-12-04 18:00:00,0,1.0,0,0,24.9,96,112,34.5,2019-12-04 14:00:00.000
73,74,2019-12-04 18:15:00,0,1.0,0,0,24.8,99,112,11.8,2019-12-04 14:15:00.000
74,75,2019-12-04 18:30:00,0,1.0,0,0,24.7,103,112,12.7,2019-12-04 14:30:00.000
75,76,2019-12-04 18:45:00,0,1.1,0,0,24.6,106,113,8.0,2019-12-04 14:45:00.000
76,77,2019-12-04 19:00:00,0,1.1,0,0,24.5,110,113,8.0,2019-12-04 15:00:00.000
77,78,2019-12-04 19:15:00,0,1.1,0,0,24.4,113,114,7.1,2019-12-04 15:15:00.000
78,79,2019-12-04 19:30:00,0,1.1,0,0,24.4,117,114,7.0,2019-12-04 15:30:00.000
79,80,2019-12-04 19:45:00,0,1.3,0,0,24.3,120,115,7.0,2019-12-04 15:45:00.000
80,81,2019-12-04 20:00:00,0,1.3,0,0,24.3,123,116,25.5,2019-12-04 16:00:00.000
81,82,2019-12-04 20:15:00,0,1.3,0,0,24.2,127,117,30.2,2019-12-04 16:15:00.000
82,83,2019-12-04 20:30:00,0,1.3,0,0,24.1,130,119,17.8,2019-12-04 16:30:00.000
83,84,2019-12-04 20:45:00,0,1.2,0,0,24.0,133,120,9.5,2019-12-04 16:45:00.000
84,85,2019-12-04 21:00:00,0,1.2,0,0,24.0,136,122,9.0,2019-12-04 17:00:00.000
85,86,2019-12-04 21:15:00,0,1.1,0,0,23.9,140,125,30.9,2019-12-04 17:15:00.000
86,87,2019-12-04 21:30:00,0,1.1,0,0,23.9,143,127,31.0,2019-12-04 17:30:00.000
87,88,2019-12-04 21:45:00,0,1.0,0,0,23.8,145,130,47.8,2019-12-04 17:45:00.000
88,89,2019-12-04 22:00:00,0,1.0,0,0,23.8,148,134,51.4,2019-12-04 18:00:00.000
89,90,2019-12-04 22:15:00,0,1.0,0,0,23.7,151,139,31.8,2019-12-04 18:15:00.000
90,91,2019-12-04 22:30:00,0,0.9,0,0,23.6,153,144,27.9,2019-12-04 18:30:00.000
91,92,2019-12-04 22:45:00,0,0.9,0,0,23.6,155,151,30.1,2019-12-04 18:45:00.000
92,93,2019-12-04 23:00:00,0,0.9,0,0,23.5,157,158,30.0,2019-12-04 19:00:00.000
93,94,2019-12-04 23:15:00,0,0.9,0,0,23.5,158,167,27.2,2019-12-04 19:15:00.000
94,95,2019-12-04 23:30:00,0,0.8,0,0,23.5,158,176,27.8,2019-12-04 19:30:00.000
95,96,2019-12-04 23:45:00,0,0.8,0,0,23.4,158,-174,30.2,2019-12-04 19:45:00.000
