,BLOCK_ID,DATA_DATETIME,GHI,WIND_SPEED,DNI,DHI,TEMPERATURE,ZENITH,AZIMUTH,CLOUD_OPACITY,ENTRY_TIME
0,1,2021-04-11 00:00:00,0,0.7,0,0,23.6,171,-21,70.4,2021-04-10 20:00:00.000
1,2,2021-04-11 00:15:00,0,0.7,0,0,23.6,169,-40,75.2,2021-04-10 20:15:00.000
2,3,2021-04-11 00:30:00,0,0.8,0,0,23.5,167,-52,57.6,2021-04-10 20:30:00.000
3,4,2021-04-11 00:45:00,0,0.8,0,0,23.4,163,-60,47.1,2021-04-10 20:45:00.000
4,5,2021-04-11 01:00:00,0,0.8,0,0,23.4,160,-65,54.6,2021-04-10 21:00:00.000
5,6,2021-04-11 01:15:00,0,0.9,0,0,23.4,157,-69,50.9,2021-04-10 21:15:00.000
6,7,2021-04-11 01:30:00,0,0.9,0,0,23.4,153,-72,50.0,2021-04-10 21:30:00.000
7,8,2021-04-11 01:45:00,0,0.9,0,0,23.4,150,-74,53.1,2021-04-10 21:45:00.000
8,9,2021-04-11 02:00:00,0,0.9,0,0,23.4,146,-75,42.6,2021-04-10 22:00:00.000
9,10,2021-04-11 02:15:00,0,0.9,0,0,23.3,142,-77,46.6,2021-04-10 22:15:00.000
10,11,2021-04-11 02:30:00,0,0.9,0,0,23.3,139,-78,21.6,2021-04-10 22:30:00.000
11,12,2021-04-11 02:45:00,0,0.9,0,0,23.2,135,-79,17.5,2021-04-10 22:45:00.000
12,13,2021-04-11 03:00:00,0,0.8,0,0,23.2,131,-79,12.8,2021-04-10 23:00:00.000
13,14,2021-04-11 03:15:00,0,0.8,0,0,23.2,128,-80,14.0,2021-04-10 23:15:00.000
14,15,2021-04-11 03:30:00,0,0.7,0,0,23.2,124,-80,0.0,2021-04-10 23:30:00.000
15,16,2021-04-11 03:45:00,0,0.7,0,0,23.3,120,-81,21.0,2021-04-10 23:45:00.000
16,17,2021-04-11 04:00:00,0,0.7,0,0,23.3,116,-81,0.0,2021-04-11 00:00:00.000
17,18,2021-04-11 04:15:00,0,0.7,0,0,23.3,113,-81,0.0,2021-04-11 00:15:00.000
18,19,2021-04-11 04:30:00,0,0.7,0,0,23.3,109,-82,19.2,2021-04-11 00:30:00.000
19,20,2021-04-11 04:45:00,0,0.7,0,0,23.2,105,-82,0.0,2021-04-11 00:45:00.000
20,21,2021-04-11 05:00:00,0,0.7,0,0,23.2,102,-82,0.0,2021-04-11 01:00:00.000
21,22,2021-04-11 05:15:00,0,0.7,0,0,23.2,98,-82,0.0,2021-04-11 01:15:00.000
22,23,2021-04-11 05:30:00,0,0.8,0,0,23.1,94,-82,0.0,2021-04-11 01:30:00.000
23,24,2021-04-11 05:45:00,2,0.8,0,2,23.1,91,-82,4.5,2021-04-11 01:45:00.000
24,25,2021-04-11 06:00:00,23,0.8,5,23,23.1,87,-82,13.4,2021-04-11 02:00:00.000
25,26,2021-04-11 06:15:00,58,0.8,21,55,23.4,83,-82,18.3,2021-04-11 02:15:00.000
26,27,2021-04-11 06:30:00,97,0.8,40,90,23.8,79,-82,21.4,2021-04-11 02:30:00.000
27,28,2021-04-11 06:45:00,131,0.8,0,131,24.1,76,-82,27.9,2021-04-11 02:45:00.000
28,29,2021-04-11 07:00:00,177,0.8,28,168,24.5,72,-82,27.6,2021-04-11 03:00:00.000
29,30,2021-04-11 07:15:00,227,0.8,71,201,25.1,68,-82,25.8,2021-04-11 03:15:00.000
30,31,2021-04-11 07:30:00,261,0.8,36,246,25.7,64,-82,29.2,2021-04-11 03:30:00.000
31,32,2021-04-11 07:45:00,301,0.8,36,283,26.2,61,-82,30.1,2021-04-11 03:45:00.000
32,33,2021-04-11 08:00:00,326,0.8,15,319,26.8,57,-81,33.6,2021-04-11 04:00:00.000
33,34,2021-04-11 08:15:00,345,0.8,0,345,27.4,53,-81,37.4,2021-04-11 04:15:00.000
34,35,2021-04-11 08:30:00,423,0.8,65,380,28.0,50,-80,30.4,2021-04-11 04:30:00.000
35,36,2021-04-11 08:45:00,578,0.8,428,280,28.6,46,-80,12.5,2021-04-11 04:45:00.000
36,37,2021-04-11 09:00:00,699,0.8,729,158,29.1,42,-79,1.8,2021-04-11 05:00:00.000
37,38,2021-04-11 09:15:00,759,0.6,793,138,29.4,39,-78,0.0,2021-04-11 05:15:00.000
38,39,2021-04-11 09:30:00,802,0.5,805,142,29.7,35,-77,0.0,2021-04-11 05:30:00.000
39,40,2021-04-11 09:45:00,842,0.5,815,145,30.0,31,-76,0.0,2021-04-11 05:45:00.000
40,41,2021-04-11 10:00:00,878,0.5,824,148,30.3,28,-74,0.0,2021-04-11 06:00:00.000
41,42,2021-04-11 10:15:00,910,0.6,831,151,30.3,24,-72,0.0,2021-04-11 06:15:00.000
42,43,2021-04-11 10:30:00,937,0.6,836,153,30.3,20,-69,0.0,2021-04-11 06:30:00.000
43,44,2021-04-11 10:45:00,958,0.7,838,156,30.4,17,-65,0.0,2021-04-11 06:45:00.000
44,45,2021-04-11 11:00:00,975,0.7,839,160,30.4,14,-58,0.0,2021-04-11 07:00:00.000
45,46,2021-04-11 11:15:00,986,0.7,839,162,30.6,11,-48,0.0,2021-04-11 07:15:00.000
46,47,2021-04-11 11:30:00,994,0.8,838,164,30.8,8,-31,0.0,2021-04-11 07:30:00.000
47,48,2021-04-11 11:45:00,866,0.8,462,407,31.0,7,-4,13.1,2021-04-11 07:45:00.000
48,49,2021-04-11 12:00:00,774,0.8,255,521,31.1,8,24,22.2,2021-04-11 08:00:00.000
49,50,2021-04-11 12:15:00,904,0.8,584,328,31.0,10,44,8.5,2021-04-11 08:15:00.000
50,51,2021-04-11 12:30:00,874,0.8,529,359,31.0,13,56,10.4,2021-04-11 08:30:00.000
51,52,2021-04-11 12:45:00,879,0.8,588,315,30.9,16,63,8.4,2021-04-11 08:45:00.000
52,53,2021-04-11 13:00:00,938,0.7,825,161,30.8,20,68,0.0,2021-04-11 09:00:00.000
53,54,2021-04-11 13:15:00,913,0.7,819,159,30.7,23,71,0.0,2021-04-11 09:15:00.000
54,55,2021-04-11 13:30:00,882,0.7,811,157,30.5,27,74,0.0,2021-04-11 09:30:00.000
55,56,2021-04-11 13:45:00,846,0.6,796,159,30.4,30,76,0.0,2021-04-11 09:45:00.000
56,57,2021-04-11 14:00:00,806,0.6,778,161,30.2,34,77,0.0,2021-04-11 10:00:00.000
57,58,2021-04-11 14:15:00,762,0.6,758,161,30.0,38,78,0.0,2021-04-11 10:15:00.000
58,59,2021-04-11 14:30:00,715,0.7,738,159,29.8,41,79,0.0,2021-04-11 10:30:00.000
59,60,2021-04-11 14:45:00,665,0.7,722,154,29.7,45,80,0.0,2021-04-11 10:45:00.000
60,61,2021-04-11 15:00:00,612,0.7,703,147,29.4,49,80,0.0,2021-04-11 11:00:00.000
61,62,2021-04-11 15:15:00,557,0.8,681,140,29.2,52,81,0.0,2021-04-11 11:15:00.000
62,63,2021-04-11 15:30:00,499,0.8,656,132,28.9,56,81,0.0,2021-04-11 11:30:00.000
63,64,2021-04-11 15:45:00,440,0.9,627,123,28.6,60,81,0.0,2021-04-11 11:45:00.000
64,65,2021-04-11 16:00:00,379,0.9,592,113,28.2,63,82,0.0,2021-04-11 12:00:00.000
65,66,2021-04-11 16:15:00,317,1.0,550,103,27.8,67,82,0.0,2021-04-11 12:15:00.000
66,67,2021-04-11 16:30:00,255,1.0,499,91,27.4,71,82,0.0,2021-04-11 12:30:00.000
67,68,2021-04-11 16:45:00,194,1.1,434,77,26.9,75,82,0.0,2021-04-11 12:45:00.000
68,69,2021-04-11 17:00:00,135,1.2,354,62,26.5,78,82,0.0,2021-04-11 13:00:00.000
69,70,2021-04-11 17:15:00,49,1.2,0,49,26.0,82,82,40.1,2021-04-11 13:15:00.000
70,71,2021-04-11 17:30:00,17,1.2,0,17,25.5,86,82,55.4,2021-04-11 13:30:00.000
71,72,2021-04-11 17:45:00,1,1.2,0,1,25.0,89,82,89.3,2021-04-11 13:45:00.000
72,73,2021-04-11 18:00:00,0,1.3,0,0,24.6,93,82,88.4,2021-04-11 14:00:00.000
73,74,2021-04-11 18:15:00,0,1.3,0,0,24.4,97,82,97.0,2021-04-11 14:15:00.000
74,75,2021-04-11 18:30:00,0,1.4,0,0,24.3,101,82,89.8,2021-04-11 14:30:00.000
75,76,2021-04-11 18:45:00,0,1.4,0,0,24.1,104,82,84.6,2021-04-11 14:45:00.000
76,77,2021-04-11 19:00:00,0,1.4,0,0,24.0,108,82,76.0,2021-04-11 15:00:00.000
77,78,2021-04-11 19:15:00,0,1.4,0,0,23.9,112,81,77.9,2021-04-11 15:15:00.000
78,79,2021-04-11 19:30:00,0,1.4,0,0,23.8,115,81,93.6,2021-04-11 15:30:00.000
79,80,2021-04-11 19:45:00,0,1.3,0,0,23.7,119,81,91.9,2021-04-11 15:45:00.000
80,81,2021-04-11 20:00:00,0,1.3,0,0,23.6,123,80,85.6,2021-04-11 16:00:00.000
81,82,2021-04-11 20:15:00,0,1.3,0,0,23.6,126,80,89.2,2021-04-11 16:15:00.000
82,83,2021-04-11 20:30:00,0,1.3,0,0,23.5,130,79,95.2,2021-04-11 16:30:00.000
83,84,2021-04-11 20:45:00,0,1.4,0,0,23.5,134,78,97.0,2021-04-11 16:45:00.000
84,85,2021-04-11 21:00:00,0,1.4,0,0,23.4,137,78,97.0,2021-04-11 17:00:00.000
85,86,2021-04-11 21:15:00,0,1.4,0,0,23.4,141,77,97.0,2021-04-11 17:15:00.000
86,87,2021-04-11 21:30:00,0,1.4,0,0,23.4,145,75,97.0,2021-04-11 17:30:00.000
87,88,2021-04-11 21:45:00,0,1.3,0,0,23.4,148,74,97.0,2021-04-11 17:45:00.000
88,89,2021-04-11 22:00:00,0,1.3,0,0,23.4,152,72,96.2,2021-04-11 18:00:00.000
89,90,2021-04-11 22:15:00,0,1.3,0,0,23.4,156,69,93.0,2021-04-11 18:15:00.000
90,91,2021-04-11 22:30:00,0,1.2,0,0,23.3,159,66,88.5,2021-04-11 18:30:00.000
91,92,2021-04-11 22:45:00,0,1.2,0,0,23.3,162,61,80.0,2021-04-11 18:45:00.000
92,93,2021-04-11 23:00:00,0,1.2,0,0,23.3,165,54,59.6,2021-04-11 19:00:00.000
93,94,2021-04-11 23:15:00,0,1.2,0,0,23.2,168,43,58.6,2021-04-11 19:15:00.000
94,95,2021-04-11 23:30:00,0,1.2,0,0,23.2,170,26,65.6,2021-04-11 19:30:00.000
95,96,2021-04-11 23:45:00,0,1.2,0,0,23.2,171,3,47.9,2021-04-11 19:45:00.000
