,BLOCK_ID,DATA_DATETIME,GHI,WIND_SPEED,DNI,DHI,TEMPERATURE,ZENITH,AZIMUTH,CLOUD_OPACITY,ENTRY_TIME
0,1,2019-09-26 00:00:00,0,0.3,0,0,20.7,174,-88,0.0,2019-09-25 20:00:00.000
1,2,2019-09-26 00:15:00,0,0.4,0,0,20.6,171,-89,0.0,2019-09-25 20:15:00.000
2,3,2019-09-26 00:30:00,0,0.4,0,0,20.6,167,-89,0.0,2019-09-25 20:30:00.000
3,4,2019-09-26 00:45:00,0,0.4,0,0,20.6,163,-89,0.0,2019-09-25 20:45:00.000
4,5,2019-09-26 01:00:00,0,0.5,0,0,20.5,159,-90,0.0,2019-09-25 21:00:00.000
5,6,2019-09-26 01:15:00,0,0.5,0,0,20.6,156,-90,0.0,2019-09-25 21:15:00.000
6,7,2019-09-26 01:30:00,0,0.4,0,0,20.6,152,-90,0.0,2019-09-25 21:30:00.000
7,8,2019-09-26 01:45:00,0,0.4,0,0,20.6,148,-90,0.0,2019-09-25 21:45:00.000
8,9,2019-09-26 02:00:00,0,0.4,0,0,20.6,144,-90,0.0,2019-09-25 22:00:00.000
9,10,2019-09-26 02:15:00,0,0.4,0,0,20.6,141,-90,0.0,2019-09-25 22:15:00.000
10,11,2019-09-26 02:30:00,0,0.4,0,0,20.6,137,-90,0.0,2019-09-25 22:30:00.000
11,12,2019-09-26 02:45:00,0,0.4,0,0,20.6,133,-90,0.0,2019-09-25 22:45:00.000
12,13,2019-09-26 03:00:00,0,0.3,0,0,20.5,129,-90,0.0,2019-09-25 23:00:00.000
13,14,2019-09-26 03:15:00,0,0.3,0,0,20.5,126,-90,0.0,2019-09-25 23:15:00.000
14,15,2019-09-26 03:30:00,0,0.3,0,0,20.5,122,-90,0.0,2019-09-25 23:30:00.000
15,16,2019-09-26 03:45:00,0,0.2,0,0,20.5,118,-90,0.0,2019-09-25 23:45:00.000
16,17,2019-09-26 04:00:00,0,0.2,0,0,20.5,114,-90,0.0,2019-09-26 00:00:00.000
17,18,2019-09-26 04:15:00,0,0.2,0,0,20.5,111,-90,0.0,2019-09-26 00:15:00.000
18,19,2019-09-26 04:30:00,0,0.2,0,0,20.5,107,-90,0.0,2019-09-26 00:30:00.000
19,20,2019-09-26 04:45:00,0,0.1,0,0,20.5,103,-90,0.0,2019-09-26 00:45:00.000
20,21,2019-09-26 05:00:00,0,0.1,0,0,20.6,99,-90,0.0,2019-09-26 01:00:00.000
21,22,2019-09-26 05:15:00,0,0.1,0,0,20.6,96,-90,0.0,2019-09-26 01:15:00.000
22,23,2019-09-26 05:30:00,0,0.1,0,0,20.7,92,-90,0.0,2019-09-26 01:30:00.000
23,24,2019-09-26 05:45:00,15,0.1,45,11,20.8,88,-91,0.0,2019-09-26 01:45:00.000
24,25,2019-09-26 06:00:00,55,0.1,232,30,21.1,84,-91,0.0,2019-09-26 02:00:00.000
25,26,2019-09-26 06:15:00,107,0.1,367,46,21.9,81,-91,0.0,2019-09-26 02:15:00.000
26,27,2019-09-26 06:30:00,165,0.0,464,59,22.9,77,-91,0.0,2019-09-26 02:30:00.000
27,28,2019-09-26 06:45:00,226,0.0,539,69,23.8,73,-91,0.0,2019-09-26 02:45:00.000
28,29,2019-09-26 07:00:00,289,0.2,598,78,24.7,69,-91,0.0,2019-09-26 03:00:00.000
29,30,2019-09-26 07:15:00,352,0.4,646,85,25.7,66,-91,0.0,2019-09-26 03:15:00.000
30,31,2019-09-26 07:30:00,415,0.7,685,92,26.6,62,-91,0.0,2019-09-26 03:30:00.000
31,32,2019-09-26 07:45:00,477,0.9,719,97,27.6,58,-91,0.0,2019-09-26 03:45:00.000
32,33,2019-09-26 08:00:00,539,1.2,748,102,28.4,54,-91,0.0,2019-09-26 04:00:00.000
33,34,2019-09-26 08:15:00,596,1.4,771,106,28.8,50,-91,0.0,2019-09-26 04:15:00.000
34,35,2019-09-26 08:30:00,651,1.6,791,110,29.2,47,-91,0.0,2019-09-26 04:30:00.000
35,36,2019-09-26 08:45:00,703,1.8,807,113,29.6,43,-91,0.0,2019-09-26 04:45:00.000
36,37,2019-09-26 09:00:00,752,1.9,821,117,29.9,39,-92,0.0,2019-09-26 05:00:00.000
37,38,2019-09-26 09:15:00,797,2.1,832,120,30.2,36,-92,0.0,2019-09-26 05:15:00.000
38,39,2019-09-26 09:30:00,838,2.2,842,122,30.4,32,-92,0.0,2019-09-26 05:30:00.000
39,40,2019-09-26 09:45:00,875,2.4,849,125,30.7,28,-92,0.0,2019-09-26 05:45:00.000
40,41,2019-09-26 10:00:00,899,2.5,828,145,30.9,24,-93,0.9,2019-09-26 06:00:00.000
41,42,2019-09-26 10:15:00,855,2.6,605,289,31.1,21,-93,8.6,2019-09-26 06:15:00.000
42,43,2019-09-26 10:30:00,937,2.6,793,178,31.3,17,-94,2.3,2019-09-26 06:30:00.000
43,44,2019-09-26 10:45:00,973,2.6,851,144,31.6,13,-95,0.4,2019-09-26 06:45:00.000
44,45,2019-09-26 11:00:00,991,2.6,865,137,31.8,9,-97,0.0,2019-09-26 07:00:00.000
45,46,2019-09-26 11:15:00,1000,2.6,865,139,31.9,6,-103,0.0,2019-09-26 07:15:00.000
46,47,2019-09-26 11:30:00,1005,2.5,865,141,32.1,2,-129,0.0,2019-09-26 07:30:00.000
47,48,2019-09-26 11:45:00,1004,2.5,864,141,32.2,2,126,0.0,2019-09-26 07:45:00.000
48,49,2019-09-26 12:00:00,999,2.4,862,141,32.3,6,102,0.0,2019-09-26 08:00:00.000
49,50,2019-09-26 12:15:00,989,2.3,860,141,32.3,10,97,0.0,2019-09-26 08:15:00.000
50,51,2019-09-26 12:30:00,974,2.1,856,141,32.3,13,95,0.0,2019-09-26 08:30:00.000
51,52,2019-09-26 12:45:00,954,2.0,852,140,32.3,17,94,0.0,2019-09-26 08:45:00.000
52,53,2019-09-26 13:00:00,930,1.8,846,139,32.3,21,93,0.0,2019-09-26 09:00:00.000
53,54,2019-09-26 13:15:00,901,1.7,839,137,32.2,25,93,0.0,2019-09-26 09:15:00.000
54,55,2019-09-26 13:30:00,867,1.6,829,137,32.2,28,92,0.0,2019-09-26 09:30:00.000
55,56,2019-09-26 13:45:00,828,1.5,813,139,32.1,32,92,0.0,2019-09-26 09:45:00.000
56,57,2019-09-26 14:00:00,785,1.5,794,141,32.0,36,92,0.0,2019-09-26 10:00:00.000
57,58,2019-09-26 14:15:00,738,1.4,773,142,31.9,40,92,0.0,2019-09-26 10:15:00.000
58,59,2019-09-26 14:30:00,688,1.3,752,141,31.7,43,92,0.0,2019-09-26 10:30:00.000
59,60,2019-09-26 14:45:00,636,1.2,733,136,31.6,47,91,0.0,2019-09-26 10:45:00.000
60,61,2019-09-26 15:00:00,581,1.2,712,131,31.4,51,91,0.0,2019-09-26 11:00:00.000
61,62,2019-09-26 15:15:00,523,1.3,687,124,31.1,55,91,0.0,2019-09-26 11:15:00.000
62,63,2019-09-26 15:30:00,463,1.3,658,117,30.8,58,91,0.0,2019-09-26 11:30:00.000
63,64,2019-09-26 15:45:00,402,1.4,625,109,30.4,62,91,0.0,2019-09-26 11:45:00.000
64,65,2019-09-26 16:00:00,340,1.5,586,100,30.0,66,91,0.0,2019-09-26 12:00:00.000
65,66,2019-09-26 16:15:00,277,1.5,537,89,29.5,70,91,0.0,2019-09-26 12:15:00.000
66,67,2019-09-26 16:30:00,215,1.5,478,78,29.0,73,91,0.0,2019-09-26 12:30:00.000
67,68,2019-09-26 16:45:00,155,1.5,404,64,28.5,77,91,0.0,2019-09-26 12:45:00.000
68,69,2019-09-26 17:00:00,93,1.5,199,59,27.9,81,91,7.1,2019-09-26 13:00:00.000
69,70,2019-09-26 17:15:00,45,1.4,62,39,27.0,85,91,9.2,2019-09-26 13:15:00.000
70,71,2019-09-26 17:30:00,12,1.4,28,10,26.1,88,91,0.0,2019-09-26 13:30:00.000
71,72,2019-09-26 17:45:00,0,1.3,0,0,25.2,92,91,0.0,2019-09-26 13:45:00.000
72,73,2019-09-26 18:00:00,0,1.3,0,0,24.5,96,91,0.0,2019-09-26 14:00:00.000
73,74,2019-09-26 18:15:00,0,1.3,0,0,24.2,100,91,0.0,2019-09-26 14:15:00.000
74,75,2019-09-26 18:30:00,0,1.3,0,0,23.9,103,91,0.0,2019-09-26 14:30:00.000
75,76,2019-09-26 18:45:00,0,1.3,0,0,23.6,107,91,0.0,2019-09-26 14:45:00.000
76,77,2019-09-26 19:00:00,0,1.3,0,0,23.4,111,91,0.0,2019-09-26 15:00:00.000
77,78,2019-09-26 19:15:00,0,1.2,0,0,23.3,115,90,0.0,2019-09-26 15:15:00.000
78,79,2019-09-26 19:30:00,0,1.2,0,0,23.2,118,90,0.0,2019-09-26 15:30:00.000
79,80,2019-09-26 19:45:00,0,1.1,0,0,23.1,122,90,0.0,2019-09-26 15:45:00.000
80,81,2019-09-26 20:00:00,0,1.1,0,0,23.0,126,90,0.0,2019-09-26 16:00:00.000
81,82,2019-09-26 20:15:00,0,1.0,0,0,22.9,130,90,0.0,2019-09-26 16:15:00.000
82,83,2019-09-26 20:30:00,0,1.0,0,0,22.9,133,90,0.0,2019-09-26 16:30:00.000
83,84,2019-09-26 20:45:00,0,0.9,0,0,22.8,137,90,0.0,2019-09-26 16:45:00.000
84,85,2019-09-26 21:00:00,0,0.9,0,0,22.7,141,90,0.0,2019-09-26 17:00:00.000
85,86,2019-09-26 21:15:00,0,0.8,0,0,22.7,145,90,0.0,2019-09-26 17:15:00.000
86,87,2019-09-26 21:30:00,0,0.7,0,0,22.6,148,90,0.0,2019-09-26 17:30:00.000
87,88,2019-09-26 21:45:00,0,0.6,0,0,22.6,152,90,0.0,2019-09-26 17:45:00.000
88,89,2019-09-26 22:00:00,0,0.5,0,0,22.5,156,90,0.0,2019-09-26 18:00:00.000
89,90,2019-09-26 22:15:00,0,0.5,0,0,22.5,160,91,0.0,2019-09-26 18:15:00.000
90,91,2019-09-26 22:30:00,0,0.4,0,0,22.4,163,91,0.0,2019-09-26 18:30:00.000
91,92,2019-09-26 22:45:00,0,0.4,0,0,22.4,167,91,0.0,2019-09-26 18:45:00.000
92,93,2019-09-26 23:00:00,0,0.3,0,0,22.3,171,91,0.0,2019-09-26 19:00:00.000
93,94,2019-09-26 23:15:00,0,0.4,0,0,22.3,175,92,0.0,2019-09-26 19:15:00.000
94,95,2019-09-26 23:30:00,0,0.4,0,0,22.2,178,96,0.0,2019-09-26 19:30:00.000
95,96,2019-09-26 23:45:00,0,0.4,0,0,22.2,178,-96,0.0,2019-09-26 19:45:00.000
