,BLOCK_ID,DATA_DATETIME,GHI,WIND_SPEED,DNI,DHI,TEMPERATURE,ZENITH,AZIMUTH,CLOUD_OPACITY,ENTRY_TIME
0,1,2020-01-30 00:00:00,0,1.7,0,0,22.7,162,-179,0.0,2020-01-29 20:00:00.000
1,2,2020-01-30 00:15:00,0,1.7,0,0,22.7,162,-167,0.0,2020-01-29 20:15:00.000
2,3,2020-01-30 00:30:00,0,1.7,0,0,22.7,161,-157,0.0,2020-01-29 20:30:00.000
3,4,2020-01-30 00:45:00,0,1.7,0,0,22.6,159,-148,0.0,2020-01-29 20:45:00.000
4,5,2020-01-30 01:00:00,0,1.7,0,0,22.6,157,-140,0.0,2020-01-29 21:00:00.000
5,6,2020-01-30 01:15:00,0,1.7,0,0,22.7,154,-134,0.0,2020-01-29 21:15:00.000
6,7,2020-01-30 01:30:00,0,1.7,0,0,22.7,151,-129,0.0,2020-01-29 21:30:00.000
7,8,2020-01-30 01:45:00,0,1.6,0,0,22.7,148,-125,0.0,2020-01-29 21:45:00.000
8,9,2020-01-30 02:00:00,0,1.6,0,0,22.8,145,-122,0.0,2020-01-29 22:00:00.000
9,10,2020-01-30 02:15:00,0,1.6,0,0,22.8,142,-120,0.0,2020-01-29 22:15:00.000
10,11,2020-01-30 02:30:00,0,1.6,0,0,22.7,139,-118,0.0,2020-01-29 22:30:00.000
11,12,2020-01-30 02:45:00,0,1.6,0,0,22.7,135,-116,0.0,2020-01-29 22:45:00.000
12,13,2020-01-30 03:00:00,0,1.6,0,0,22.7,132,-114,0.0,2020-01-29 23:00:00.000
13,14,2020-01-30 03:15:00,0,1.6,0,0,22.7,129,-113,0.0,2020-01-29 23:15:00.000
14,15,2020-01-30 03:30:00,0,1.6,0,0,22.6,125,-112,0.0,2020-01-29 23:30:00.000
15,16,2020-01-30 03:45:00,0,1.6,0,0,22.6,122,-111,0.0,2020-01-29 23:45:00.000
16,17,2020-01-30 04:00:00,0,1.6,0,0,22.6,118,-110,0.0,2020-01-30 00:00:00.000
17,18,2020-01-30 04:15:00,0,1.6,0,0,22.6,115,-110,0.0,2020-01-30 00:15:00.000
18,19,2020-01-30 04:30:00,0,1.5,0,0,22.6,111,-109,0.0,2020-01-30 00:30:00.000
19,20,2020-01-30 04:45:00,0,1.5,0,0,22.6,108,-109,0.0,2020-01-30 00:45:00.000
20,21,2020-01-30 05:00:00,0,1.5,0,0,22.6,104,-109,0.0,2020-01-30 01:00:00.000
21,22,2020-01-30 05:15:00,0,1.5,0,0,22.6,100,-108,0.0,2020-01-30 01:15:00.000
22,23,2020-01-30 05:30:00,0,1.5,0,0,22.5,97,-108,0.0,2020-01-30 01:30:00.000
23,24,2020-01-30 05:45:00,0,1.5,0,0,22.5,93,-108,0.0,2020-01-30 01:45:00.000
24,25,2020-01-30 06:00:00,4,1.5,10,3,22.6,90,-108,0.0,2020-01-30 02:00:00.000
25,26,2020-01-30 06:15:00,38,1.5,196,20,23.0,86,-108,0.0,2020-01-30 02:15:00.000
26,27,2020-01-30 06:30:00,87,1.5,410,34,23.4,83,-108,0.0,2020-01-30 02:30:00.000
27,28,2020-01-30 06:45:00,144,1.5,520,45,23.8,79,-109,0.0,2020-01-30 02:45:00.000
28,29,2020-01-30 07:00:00,205,1.6,603,54,24.3,76,-109,0.0,2020-01-30 03:00:00.000
29,30,2020-01-30 07:15:00,268,1.7,666,62,25.0,72,-109,0.0,2020-01-30 03:15:00.000
30,31,2020-01-30 07:30:00,331,1.8,715,69,25.8,68,-110,0.0,2020-01-30 03:30:00.000
31,32,2020-01-30 07:45:00,394,1.9,755,75,26.5,65,-110,0.0,2020-01-30 03:45:00.000
32,33,2020-01-30 08:00:00,456,2.0,788,80,27.2,61,-111,0.0,2020-01-30 04:00:00.000
33,34,2020-01-30 08:15:00,516,2.0,815,84,27.6,58,-112,0.0,2020-01-30 04:15:00.000
34,35,2020-01-30 08:30:00,575,2.1,838,89,28.1,55,-113,0.0,2020-01-30 04:30:00.000
35,36,2020-01-30 08:45:00,611,2.1,765,132,28.5,51,-114,3.1,2020-01-30 04:45:00.000
36,37,2020-01-30 09:00:00,615,2.1,570,232,28.9,48,-116,10.1,2020-01-30 05:00:00.000
37,38,2020-01-30 09:15:00,680,2.1,661,209,29.3,44,-117,7.3,2020-01-30 05:15:00.000
38,39,2020-01-30 09:30:00,671,2.1,481,309,29.7,41,-119,14.1,2020-01-30 05:30:00.000
39,40,2020-01-30 09:45:00,702,2.1,472,327,30.1,38,-121,15.0,2020-01-30 05:45:00.000
40,41,2020-01-30 10:00:00,781,2.1,621,270,30.5,35,-124,9.5,2020-01-30 06:00:00.000
41,42,2020-01-30 10:15:00,802,2.0,593,298,30.7,32,-128,10.7,2020-01-30 06:15:00.000
42,43,2020-01-30 10:30:00,821,2.0,570,321,30.9,29,-132,11.6,2020-01-30 06:30:00.000
43,44,2020-01-30 10:45:00,865,1.9,640,291,31.2,26,-137,9.2,2020-01-30 06:45:00.000
44,45,2020-01-30 11:00:00,875,1.9,612,314,31.3,24,-143,10.2,2020-01-30 07:00:00.000
45,46,2020-01-30 11:15:00,990,2.0,936,119,31.4,22,-151,0.0,2020-01-30 07:15:00.000
46,47,2020-01-30 11:30:00,1001,2.0,937,121,31.4,20,-160,0.0,2020-01-30 07:30:00.000
47,48,2020-01-30 11:45:00,1008,2.1,938,121,31.4,19,-170,0.0,2020-01-30 07:45:00.000
48,49,2020-01-30 12:00:00,1010,2.1,939,121,31.4,19,179,0.0,2020-01-30 08:00:00.000
49,50,2020-01-30 12:15:00,1007,2.2,939,121,31.5,19,168,0.0,2020-01-30 08:15:00.000
50,51,2020-01-30 12:30:00,999,2.3,937,120,31.5,20,158,0.0,2020-01-30 08:30:00.000
51,52,2020-01-30 12:45:00,986,2.4,935,119,31.6,22,149,0.0,2020-01-30 08:45:00.000
52,53,2020-01-30 13:00:00,968,2.5,931,118,31.5,24,142,0.0,2020-01-30 09:00:00.000
53,54,2020-01-30 13:15:00,946,2.7,927,117,31.3,27,136,0.0,2020-01-30 09:15:00.000
54,55,2020-01-30 13:30:00,918,2.9,919,116,31.1,29,131,0.0,2020-01-30 09:30:00.000
55,56,2020-01-30 13:45:00,886,3.0,907,118,30.9,32,127,0.0,2020-01-30 09:45:00.000
56,57,2020-01-30 14:00:00,848,3.1,893,119,30.7,35,124,0.0,2020-01-30 10:00:00.000
57,58,2020-01-30 14:15:00,807,3.0,877,120,30.4,38,121,0.0,2020-01-30 10:15:00.000
58,59,2020-01-30 14:30:00,762,2.9,860,120,30.2,42,119,0.0,2020-01-30 10:30:00.000
59,60,2020-01-30 14:45:00,715,2.7,845,117,29.9,45,117,0.0,2020-01-30 10:45:00.000
60,61,2020-01-30 15:00:00,664,2.6,828,113,29.7,48,115,0.0,2020-01-30 11:00:00.000
61,62,2020-01-30 15:15:00,610,2.6,808,109,29.3,52,114,0.0,2020-01-30 11:15:00.000
62,63,2020-01-30 15:30:00,553,2.6,785,105,29.0,55,113,0.0,2020-01-30 11:30:00.000
63,64,2020-01-30 15:45:00,494,2.5,759,99,28.7,59,112,0.0,2020-01-30 11:45:00.000
64,65,2020-01-30 16:00:00,434,2.5,729,93,28.4,62,111,0.0,2020-01-30 12:00:00.000
65,66,2020-01-30 16:15:00,372,2.5,692,87,28.0,66,110,0.0,2020-01-30 12:15:00.000
66,67,2020-01-30 16:30:00,309,2.5,647,79,27.7,69,110,0.0,2020-01-30 12:30:00.000
67,68,2020-01-30 16:45:00,247,2.5,593,70,27.4,73,109,0.0,2020-01-30 12:45:00.000
68,69,2020-01-30 17:00:00,185,2.5,524,61,27.0,76,109,0.0,2020-01-30 13:00:00.000
69,70,2020-01-30 17:15:00,126,2.4,434,49,26.5,80,108,0.0,2020-01-30 13:15:00.000
70,71,2020-01-30 17:30:00,68,2.3,224,41,26.1,83,108,5.6,2020-01-30 13:30:00.000
71,72,2020-01-30 17:45:00,22,2.3,0,22,25.7,87,108,20.5,2020-01-30 13:45:00.000
72,73,2020-01-30 18:00:00,1,2.2,0,1,25.3,91,108,30.1,2020-01-30 14:00:00.000
73,74,2020-01-30 18:15:00,0,2.1,0,0,25.0,94,108,3.3,2020-01-30 14:15:00.000
74,75,2020-01-30 18:30:00,0,2.1,0,0,24.7,98,108,0.0,2020-01-30 14:30:00.000
75,76,2020-01-30 18:45:00,0,2.1,0,0,24.4,101,108,0.0,2020-01-30 14:45:00.000
76,77,2020-01-30 19:00:00,0,2.0,0,0,24.2,105,109,0.0,2020-01-30 15:00:00.000
77,78,2020-01-30 19:15:00,0,1.9,0,0,24.1,108,109,0.0,2020-01-30 15:15:00.000
78,79,2020-01-30 19:30:00,0,1.8,0,0,24.0,112,109,0.0,2020-01-30 15:30:00.000
79,80,2020-01-30 19:45:00,0,1.7,0,0,23.9,115,110,0.0,2020-01-30 15:45:00.000
80,81,2020-01-30 20:00:00,0,1.6,0,0,23.8,119,110,0.0,2020-01-30 16:00:00.000
81,82,2020-01-30 20:15:00,0,1.6,0,0,23.8,122,111,0.0,2020-01-30 16:15:00.000
82,83,2020-01-30 20:30:00,0,1.7,0,0,23.7,126,112,0.0,2020-01-30 16:30:00.000
83,84,2020-01-30 20:45:00,0,1.7,0,0,23.6,129,113,0.0,2020-01-30 16:45:00.000
84,85,2020-01-30 21:00:00,0,1.7,0,0,23.6,133,114,0.0,2020-01-30 17:00:00.000
85,86,2020-01-30 21:15:00,0,1.7,0,0,23.5,136,116,0.0,2020-01-30 17:15:00.000
86,87,2020-01-30 21:30:00,0,1.7,0,0,23.5,140,118,0.0,2020-01-30 17:30:00.000
87,88,2020-01-30 21:45:00,0,1.6,0,0,23.4,143,120,0.0,2020-01-30 17:45:00.000
88,89,2020-01-30 22:00:00,0,1.6,0,0,23.4,146,123,0.0,2020-01-30 18:00:00.000
89,90,2020-01-30 22:15:00,0,1.6,0,0,23.4,149,126,0.0,2020-01-30 18:15:00.000
90,91,2020-01-30 22:30:00,0,1.6,0,0,23.3,152,130,0.0,2020-01-30 18:30:00.000
91,92,2020-01-30 22:45:00,0,1.6,0,0,23.3,155,135,0.0,2020-01-30 18:45:00.000
92,93,2020-01-30 23:00:00,0,1.6,0,0,23.3,157,141,0.0,2020-01-30 19:00:00.000
93,94,2020-01-30 23:15:00,0,1.6,0,0,23.3,160,149,0.0,2020-01-30 19:15:00.000
94,95,2020-01-30 23:30:00,0,1.6,0,0,23.2,161,158,0.0,2020-01-30 19:30:00.000
95,96,2020-01-30 23:45:00,0,1.6,0,0,23.2,162,169,0.0,2020-01-30 19:45:00.000
