,BLOCK_ID,DATA_DATETIME,GHI,WIND_SPEED,DNI,DHI,TEMPERATURE,ZENITH,AZIMUTH,CLOUD_OPACITY,ENTRY_TIME
0,1,2020-02-23 00:00:00,0,2.7,0,0,23.4,170,-179,0.0,2020-02-22 20:00:00.000
1,2,2020-02-23 00:15:00,0,2.7,0,0,23.4,169,-159,0.0,2020-02-22 20:15:00.000
2,3,2020-02-23 00:30:00,0,2.7,0,0,23.3,167,-143,0.0,2020-02-22 20:30:00.000
3,4,2020-02-23 00:45:00,0,2.7,0,0,23.3,165,-132,0.0,2020-02-22 20:45:00.000
4,5,2020-02-23 01:00:00,0,2.7,0,0,23.3,162,-124,0.0,2020-02-22 21:00:00.000
5,6,2020-02-23 01:15:00,0,2.7,0,0,23.4,159,-119,0.0,2020-02-22 21:15:00.000
6,7,2020-02-23 01:30:00,0,2.7,0,0,23.4,155,-115,0.0,2020-02-22 21:30:00.000
7,8,2020-02-23 01:45:00,0,2.7,0,0,23.4,152,-112,0.0,2020-02-22 21:45:00.000
8,9,2020-02-23 02:00:00,0,2.7,0,0,23.5,148,-109,53.6,2020-02-22 22:00:00.000
9,10,2020-02-23 02:15:00,0,2.8,0,0,23.5,145,-108,72.6,2020-02-22 22:15:00.000
10,11,2020-02-23 02:30:00,0,2.8,0,0,23.5,141,-106,70.7,2020-02-22 22:30:00.000
11,12,2020-02-23 02:45:00,0,2.9,0,0,23.5,138,-105,67.0,2020-02-22 22:45:00.000
12,13,2020-02-23 03:00:00,0,2.9,0,0,23.4,134,-104,67.0,2020-02-22 23:00:00.000
13,14,2020-02-23 03:15:00,0,2.9,0,0,23.4,130,-103,60.4,2020-02-22 23:15:00.000
14,15,2020-02-23 03:30:00,0,2.9,0,0,23.4,127,-103,60.4,2020-02-22 23:30:00.000
15,16,2020-02-23 03:45:00,0,2.9,0,0,23.4,123,-102,70.1,2020-02-22 23:45:00.000
16,17,2020-02-23 04:00:00,0,2.9,0,0,23.4,119,-102,65.1,2020-02-23 00:00:00.000
17,18,2020-02-23 04:15:00,0,2.9,0,0,23.4,116,-101,38.3,2020-02-23 00:15:00.000
18,19,2020-02-23 04:30:00,0,2.9,0,0,23.4,112,-101,35.8,2020-02-23 00:30:00.000
19,20,2020-02-23 04:45:00,0,3.0,0,0,23.5,108,-101,54.3,2020-02-23 00:45:00.000
20,21,2020-02-23 05:00:00,0,2.9,0,0,23.5,105,-101,53.4,2020-02-23 01:00:00.000
21,22,2020-02-23 05:15:00,0,2.9,0,0,23.5,101,-101,52.0,2020-02-23 01:15:00.000
22,23,2020-02-23 05:30:00,0,2.8,0,0,23.4,97,-101,48.5,2020-02-23 01:30:00.000
23,24,2020-02-23 05:45:00,0,2.7,0,0,23.4,94,-100,66.0,2020-02-23 01:45:00.000
24,25,2020-02-23 06:00:00,0,2.7,0,0,23.4,90,-101,74.4,2020-02-23 02:00:00.000
25,26,2020-02-23 06:15:00,14,2.7,0,14,23.6,86,-101,65.1,2020-02-23 02:15:00.000
26,27,2020-02-23 06:30:00,66,2.8,78,55,23.9,83,-101,16.6,2020-02-23 02:30:00.000
27,28,2020-02-23 06:45:00,117,2.8,169,83,24.1,79,-101,13.3,2020-02-23 02:45:00.000
28,29,2020-02-23 07:00:00,156,2.8,125,126,24.4,75,-101,19.5,2020-02-23 03:00:00.000
29,30,2020-02-23 07:15:00,211,2.9,180,152,24.8,72,-101,18.6,2020-02-23 03:15:00.000
30,31,2020-02-23 07:30:00,309,2.9,522,111,25.3,68,-102,4.3,2020-02-23 03:30:00.000
31,32,2020-02-23 07:45:00,332,2.9,332,184,25.8,64,-102,14.4,2020-02-23 03:45:00.000
32,33,2020-02-23 08:00:00,416,2.9,510,166,26.2,61,-102,7.4,2020-02-23 04:00:00.000
33,34,2020-02-23 08:15:00,506,3.0,709,118,26.6,57,-103,1.0,2020-02-23 04:15:00.000
34,35,2020-02-23 08:30:00,527,3.1,556,196,27.0,53,-104,7.4,2020-02-23 04:30:00.000
35,36,2020-02-23 08:45:00,591,3.1,628,187,27.3,50,-104,5.6,2020-02-23 04:45:00.000
36,37,2020-02-23 09:00:00,497,3.2,146,397,27.7,46,-105,26.9,2020-02-23 05:00:00.000
37,38,2020-02-23 09:15:00,651,3.3,499,281,28.1,42,-106,11.2,2020-02-23 05:15:00.000
38,39,2020-02-23 09:30:00,771,3.4,795,151,28.4,39,-108,1.2,2020-02-23 05:30:00.000
39,40,2020-02-23 09:45:00,824,3.5,841,137,28.8,35,-109,0.0,2020-02-23 05:45:00.000
40,41,2020-02-23 10:00:00,863,3.5,849,141,29.1,32,-111,0.0,2020-02-23 06:00:00.000
41,42,2020-02-23 10:15:00,782,3.6,485,356,29.4,28,-114,12.9,2020-02-23 06:15:00.000
42,43,2020-02-23 10:30:00,695,3.6,195,519,29.7,25,-117,25.2,2020-02-23 06:30:00.000
43,44,2020-02-23 10:45:00,819,3.6,452,399,30.0,22,-121,14.4,2020-02-23 06:45:00.000
44,45,2020-02-23 11:00:00,825,3.6,420,427,30.2,18,-127,15.7,2020-02-23 07:00:00.000
45,46,2020-02-23 11:15:00,976,3.7,813,194,30.3,16,-135,2.0,2020-02-23 07:15:00.000
46,47,2020-02-23 11:30:00,995,3.8,836,181,30.4,13,-147,1.4,2020-02-23 07:30:00.000
47,48,2020-02-23 11:45:00,941,3.8,649,305,30.5,12,-162,7.4,2020-02-23 07:45:00.000
48,49,2020-02-23 12:00:00,890,3.9,504,395,30.6,11,179,12.6,2020-02-23 08:00:00.000
49,50,2020-02-23 12:15:00,890,4.0,509,392,30.6,12,161,12.3,2020-02-23 08:15:00.000
50,51,2020-02-23 12:30:00,811,4.0,330,490,30.6,13,146,19.5,2020-02-23 08:30:00.000
51,52,2020-02-23 12:45:00,636,4.1,139,503,30.6,16,135,35.9,2020-02-23 08:45:00.000
52,53,2020-02-23 13:00:00,886,4.2,586,331,30.5,19,127,9.2,2020-02-23 09:00:00.000
53,54,2020-02-23 13:15:00,847,4.3,529,355,30.4,22,121,11.3,2020-02-23 09:15:00.000
54,55,2020-02-23 13:30:00,883,4.5,718,234,30.3,25,117,4.7,2020-02-23 09:30:00.000
55,56,2020-02-23 13:45:00,814,4.6,574,309,30.1,28,114,9.2,2020-02-23 09:45:00.000
56,57,2020-02-23 14:00:00,843,4.7,786,177,30.0,32,111,2.1,2020-02-23 10:00:00.000
57,58,2020-02-23 14:15:00,793,4.6,731,196,29.9,35,109,3.7,2020-02-23 10:15:00.000
58,59,2020-02-23 14:30:00,718,4.6,603,250,29.7,39,107,7.8,2020-02-23 10:30:00.000
59,60,2020-02-23 14:45:00,715,4.5,754,159,29.6,43,106,2.2,2020-02-23 10:45:00.000
60,61,2020-02-23 15:00:00,668,4.4,755,146,29.4,46,105,1.6,2020-02-23 11:00:00.000
61,62,2020-02-23 15:15:00,506,4.3,292,317,29.2,50,104,19.0,2020-02-23 11:15:00.000
62,63,2020-02-23 15:30:00,393,4.3,58,358,28.9,53,103,30.7,2020-02-23 11:30:00.000
63,64,2020-02-23 15:45:00,291,4.2,0,291,28.7,57,103,42.6,2020-02-23 11:45:00.000
64,65,2020-02-23 16:00:00,270,4.2,0,270,28.4,61,102,39.3,2020-02-23 12:00:00.000
65,66,2020-02-23 16:15:00,305,4.2,199,217,28.1,64,102,20.5,2020-02-23 12:15:00.000
66,67,2020-02-23 16:30:00,239,4.3,98,203,27.8,68,101,24.5,2020-02-23 12:30:00.000
67,68,2020-02-23 16:45:00,201,4.3,137,159,27.5,72,101,20.4,2020-02-23 12:45:00.000
68,69,2020-02-23 17:00:00,149,4.3,78,129,27.2,75,101,22.0,2020-02-23 13:00:00.000
69,70,2020-02-23 17:15:00,85,4.2,0,85,26.8,79,101,34.3,2020-02-23 13:15:00.000
70,71,2020-02-23 17:30:00,58,4.1,4,57,26.4,83,101,21.6,2020-02-23 13:30:00.000
71,72,2020-02-23 17:45:00,23,4.0,0,23,26.0,87,100,28.0,2020-02-23 13:45:00.000
72,73,2020-02-23 18:00:00,1,3.9,0,1,25.6,90,100,52.0,2020-02-23 14:00:00.000
73,74,2020-02-23 18:15:00,0,3.8,0,0,25.4,94,100,51.7,2020-02-23 14:15:00.000
74,75,2020-02-23 18:30:00,0,3.7,0,0,25.2,98,100,52.2,2020-02-23 14:30:00.000
75,76,2020-02-23 18:45:00,0,3.6,0,0,25.0,101,100,35.4,2020-02-23 14:45:00.000
76,77,2020-02-23 19:00:00,0,3.5,0,0,24.9,105,101,0.0,2020-02-23 15:00:00.000
77,78,2020-02-23 19:15:00,0,3.3,0,0,24.8,109,101,0.0,2020-02-23 15:15:00.000
78,79,2020-02-23 19:30:00,0,3.2,0,0,24.7,112,101,0.0,2020-02-23 15:30:00.000
79,80,2020-02-23 19:45:00,0,3.0,0,0,24.6,116,101,0.0,2020-02-23 15:45:00.000
80,81,2020-02-23 20:00:00,0,2.9,0,0,24.6,120,102,0.0,2020-02-23 16:00:00.000
81,82,2020-02-23 20:15:00,0,2.8,0,0,24.5,123,102,0.0,2020-02-23 16:15:00.000
82,83,2020-02-23 20:30:00,0,2.7,0,0,24.4,127,102,0.0,2020-02-23 16:30:00.000
83,84,2020-02-23 20:45:00,0,2.6,0,0,24.3,131,103,0.0,2020-02-23 16:45:00.000
84,85,2020-02-23 21:00:00,0,2.5,0,0,24.3,134,104,0.0,2020-02-23 17:00:00.000
85,86,2020-02-23 21:15:00,0,2.5,0,0,24.2,138,105,0.0,2020-02-23 17:15:00.000
86,87,2020-02-23 21:30:00,0,2.5,0,0,24.1,142,106,0.0,2020-02-23 17:30:00.000
87,88,2020-02-23 21:45:00,0,2.5,0,0,24.0,145,107,0.0,2020-02-23 17:45:00.000
88,89,2020-02-23 22:00:00,0,2.4,0,0,24.0,149,109,0.0,2020-02-23 18:00:00.000
89,90,2020-02-23 22:15:00,0,2.4,0,0,23.9,152,111,0.0,2020-02-23 18:15:00.000
90,91,2020-02-23 22:30:00,0,2.4,0,0,23.9,156,114,0.0,2020-02-23 18:30:00.000
91,92,2020-02-23 22:45:00,0,2.3,0,0,23.8,159,118,0.0,2020-02-23 18:45:00.000
92,93,2020-02-23 23:00:00,0,2.3,0,0,23.8,162,124,0.0,2020-02-23 19:00:00.000
93,94,2020-02-23 23:15:00,0,2.3,0,0,23.7,165,132,0.0,2020-02-23 19:15:00.000
94,95,2020-02-23 23:30:00,0,2.3,0,0,23.7,168,143,0.0,2020-02-23 19:30:00.000
95,96,2020-02-23 23:45:00,0,2.2,0,0,23.6,170,160,0.0,2020-02-23 19:45:00.000
