,BLOCK_ID,DATA_DATETIME,GHI,WIND_SPEED,DNI,DHI,TEMPERATURE,ZENITH,AZIMUTH,CLOUD_OPACITY,ENTRY_TIME
0,1,2019-03-10 00:00:00,0,3.1,0,0,26.1,176,-170,51.8,2019-03-09 20:00:00.000
1,2,2019-03-10 00:15:00,0,3.0,0,0,26.0,174,-135,59.4,2019-03-09 20:15:00.000
2,3,2019-03-10 00:30:00,0,2.8,0,0,25.9,171,-118,48.2,2019-03-09 20:30:00.000
3,4,2019-03-10 00:45:00,0,2.7,0,0,25.8,167,-110,52.0,2019-03-09 20:45:00.000
4,5,2019-03-10 01:00:00,0,2.6,0,0,25.7,164,-106,52.8,2019-03-09 21:00:00.000
5,6,2019-03-10 01:15:00,0,2.5,0,0,25.7,160,-103,53.0,2019-03-09 21:15:00.000
6,7,2019-03-10 01:30:00,0,2.3,0,0,25.6,156,-101,53.0,2019-03-09 21:30:00.000
7,8,2019-03-10 01:45:00,0,2.2,0,0,25.5,153,-100,53.0,2019-03-09 21:45:00.000
8,9,2019-03-10 02:00:00,0,2.2,0,0,25.5,149,-98,39.4,2019-03-09 22:00:00.000
9,10,2019-03-10 02:15:00,0,2.2,0,0,25.5,145,-98,36.3,2019-03-09 22:15:00.000
10,11,2019-03-10 02:30:00,0,2.2,0,0,25.5,142,-97,36.8,2019-03-09 22:30:00.000
11,12,2019-03-10 02:45:00,0,2.2,0,0,25.6,138,-97,36.8,2019-03-09 22:45:00.000
12,13,2019-03-10 03:00:00,0,2.3,0,0,25.6,134,-96,36.8,2019-03-09 23:00:00.000
13,14,2019-03-10 03:15:00,0,2.3,0,0,25.6,130,-96,36.8,2019-03-09 23:15:00.000
14,15,2019-03-10 03:30:00,0,2.4,0,0,25.7,127,-96,36.8,2019-03-09 23:30:00.000
15,16,2019-03-10 03:45:00,0,2.4,0,0,25.7,123,-95,36.2,2019-03-09 23:45:00.000
16,17,2019-03-10 04:00:00,0,2.5,0,0,25.8,119,-95,36.7,2019-03-10 00:00:00.000
17,18,2019-03-10 04:15:00,0,2.5,0,0,25.8,115,-95,36.8,2019-03-10 00:15:00.000
18,19,2019-03-10 04:30:00,0,2.6,0,0,25.8,112,-95,36.8,2019-03-10 00:30:00.000
19,20,2019-03-10 04:45:00,0,2.7,0,0,25.9,108,-95,36.8,2019-03-10 00:45:00.000
20,21,2019-03-10 05:00:00,0,2.7,0,0,25.9,104,-95,70.0,2019-03-10 01:00:00.000
21,22,2019-03-10 05:15:00,0,2.5,0,0,26.0,101,-95,42.1,2019-03-10 01:15:00.000
22,23,2019-03-10 05:30:00,0,2.4,0,0,26.1,97,-95,44.9,2019-03-10 01:30:00.000
23,24,2019-03-10 05:45:00,0,2.2,0,0,26.1,93,-95,59.8,2019-03-10 01:45:00.000
24,25,2019-03-10 06:00:00,3,2.1,0,3,26.2,89,-95,60.6,2019-03-10 02:00:00.000
25,26,2019-03-10 06:15:00,21,1.9,11,20,26.3,86,-95,61.7,2019-03-10 02:15:00.000
26,27,2019-03-10 06:30:00,76,1.8,66,66,26.4,82,-95,21.5,2019-03-10 02:30:00.000
27,28,2019-03-10 06:45:00,113,1.6,40,105,26.4,78,-95,27.1,2019-03-10 02:45:00.000
28,29,2019-03-10 07:00:00,180,1.5,224,118,26.5,74,-95,18.3,2019-03-10 03:00:00.000
29,30,2019-03-10 07:15:00,184,1.4,0,184,26.6,71,-95,35.2,2019-03-10 03:15:00.000
30,31,2019-03-10 07:30:00,254,1.3,108,210,26.7,67,-95,27.3,2019-03-10 03:30:00.000
31,32,2019-03-10 07:45:00,265,1.2,11,260,26.7,63,-96,35.8,2019-03-10 03:45:00.000
32,33,2019-03-10 08:00:00,322,1.1,44,299,26.8,59,-96,32.6,2019-03-10 04:00:00.000
33,34,2019-03-10 08:15:00,280,1.2,0,280,26.8,56,-96,47.9,2019-03-10 04:15:00.000
34,35,2019-03-10 08:30:00,452,1.3,271,284,26.7,52,-97,24.9,2019-03-10 04:30:00.000
35,36,2019-03-10 08:45:00,545,1.4,377,294,26.7,48,-97,17.0,2019-03-10 04:45:00.000
36,37,2019-03-10 09:00:00,639,1.4,563,235,26.7,44,-97,10.3,2019-03-10 05:00:00.000
37,38,2019-03-10 09:15:00,762,1.5,871,102,26.7,41,-98,0.0,2019-03-10 05:15:00.000
38,39,2019-03-10 09:30:00,810,1.6,882,105,26.6,37,-99,0.0,2019-03-10 05:30:00.000
39,40,2019-03-10 09:45:00,854,1.7,892,108,26.6,33,-100,0.0,2019-03-10 05:45:00.000
40,41,2019-03-10 10:00:00,893,1.8,901,111,26.6,30,-101,0.0,2019-03-10 06:00:00.000
41,42,2019-03-10 10:15:00,909,1.8,839,155,26.6,26,-102,2.1,2019-03-10 06:15:00.000
42,43,2019-03-10 10:30:00,943,1.9,855,151,26.5,22,-104,1.8,2019-03-10 06:30:00.000
43,44,2019-03-10 10:45:00,934,2.0,750,224,26.5,19,-107,5.2,2019-03-10 06:45:00.000
44,45,2019-03-10 11:00:00,913,2.1,630,305,26.5,15,-111,9.3,2019-03-10 07:00:00.000
45,46,2019-03-10 11:15:00,919,2.1,607,326,26.5,12,-118,10.1,2019-03-10 07:15:00.000
46,47,2019-03-10 11:30:00,802,2.2,297,508,26.6,9,-129,22.5,2019-03-10 07:30:00.000
47,48,2019-03-10 11:45:00,772,2.3,218,556,26.6,6,-152,25.8,2019-03-10 07:45:00.000
48,49,2019-03-10 12:00:00,865,2.4,426,440,26.6,6,171,17.1,2019-03-10 08:00:00.000
49,50,2019-03-10 12:15:00,880,2.4,470,413,26.6,7,140,15.3,2019-03-10 08:15:00.000
50,51,2019-03-10 12:30:00,875,2.5,475,408,26.7,10,123,15.0,2019-03-10 08:30:00.000
51,52,2019-03-10 12:45:00,821,2.6,368,463,26.7,13,114,19.2,2019-03-10 08:45:00.000
52,53,2019-03-10 13:00:00,857,2.6,493,385,26.7,17,109,14.1,2019-03-10 09:00:00.000
53,54,2019-03-10 13:15:00,374,2.7,0,374,26.7,20,106,61.7,2019-03-10 09:15:00.000
54,55,2019-03-10 13:30:00,373,2.8,0,373,26.8,24,103,60.4,2019-03-10 09:30:00.000
55,56,2019-03-10 13:45:00,165,2.9,0,165,26.8,28,101,81.8,2019-03-10 09:45:00.000
56,57,2019-03-10 14:00:00,175,2.9,0,175,26.8,31,100,80.0,2019-03-10 10:00:00.000
57,58,2019-03-10 14:15:00,286,3.0,0,286,26.8,35,99,65.1,2019-03-10 10:15:00.000
58,59,2019-03-10 14:30:00,278,3.0,0,278,26.8,39,98,64.3,2019-03-10 10:30:00.000
59,60,2019-03-10 14:45:00,150,3.1,0,150,26.8,42,98,79.1,2019-03-10 10:45:00.000
60,61,2019-03-10 15:00:00,223,3.2,0,223,26.8,46,97,67.0,2019-03-10 11:00:00.000
61,62,2019-03-10 15:15:00,211,3.2,0,211,26.8,50,97,65.6,2019-03-10 11:15:00.000
62,63,2019-03-10 15:30:00,221,3.3,0,221,26.9,54,96,60.6,2019-03-10 11:30:00.000
63,64,2019-03-10 15:45:00,291,3.3,0,291,26.9,57,96,41.7,2019-03-10 11:45:00.000
64,65,2019-03-10 16:00:00,277,3.4,0,277,26.9,61,96,36.5,2019-03-10 12:00:00.000
65,66,2019-03-10 16:15:00,174,3.5,0,174,26.9,65,95,53.6,2019-03-10 12:15:00.000
66,67,2019-03-10 16:30:00,168,3.5,0,168,26.9,68,95,44.6,2019-03-10 12:30:00.000
67,68,2019-03-10 16:45:00,152,3.6,0,152,26.9,72,95,38.0,2019-03-10 12:45:00.000
68,69,2019-03-10 17:00:00,38,3.7,0,38,26.9,76,95,80.3,2019-03-10 13:00:00.000
69,70,2019-03-10 17:15:00,71,3.7,0,71,26.9,80,95,40.2,2019-03-10 13:15:00.000
70,71,2019-03-10 17:30:00,41,3.7,0,41,26.9,83,95,37.9,2019-03-10 13:30:00.000
71,72,2019-03-10 17:45:00,17,3.7,0,17,26.9,87,95,32.0,2019-03-10 13:45:00.000
72,73,2019-03-10 18:00:00,1,3.6,0,1,26.9,91,95,22.2,2019-03-10 14:00:00.000
73,74,2019-03-10 18:15:00,0,3.6,0,0,26.9,95,95,22.8,2019-03-10 14:15:00.000
74,75,2019-03-10 18:30:00,0,3.7,0,0,26.8,98,95,33.0,2019-03-10 14:30:00.000
75,76,2019-03-10 18:45:00,0,3.7,0,0,26.8,102,95,41.4,2019-03-10 14:45:00.000
76,77,2019-03-10 19:00:00,0,3.7,0,0,26.8,106,95,33.0,2019-03-10 15:00:00.000
77,78,2019-03-10 19:15:00,0,3.7,0,0,26.8,110,95,47.1,2019-03-10 15:15:00.000
78,79,2019-03-10 19:30:00,0,3.7,0,0,26.8,113,95,47.0,2019-03-10 15:30:00.000
79,80,2019-03-10 19:45:00,0,3.7,0,0,26.8,117,95,45.1,2019-03-10 15:45:00.000
80,81,2019-03-10 20:00:00,0,3.7,0,0,26.8,121,95,39.3,2019-03-10 16:00:00.000
81,82,2019-03-10 20:15:00,0,3.8,0,0,26.8,125,95,37.0,2019-03-10 16:15:00.000
82,83,2019-03-10 20:30:00,0,3.9,0,0,26.8,128,95,37.0,2019-03-10 16:30:00.000
83,84,2019-03-10 20:45:00,0,4.0,0,0,26.9,132,96,35.2,2019-03-10 16:45:00.000
84,85,2019-03-10 21:00:00,0,4.0,0,0,26.9,136,96,37.0,2019-03-10 17:00:00.000
85,86,2019-03-10 21:15:00,0,4.1,0,0,26.9,139,96,35.9,2019-03-10 17:15:00.000
86,87,2019-03-10 21:30:00,0,4.2,0,0,26.9,143,97,36.3,2019-03-10 17:30:00.000
87,88,2019-03-10 21:45:00,0,4.3,0,0,26.9,147,97,32.4,2019-03-10 17:45:00.000
88,89,2019-03-10 22:00:00,0,4.4,0,0,27.0,151,98,34.3,2019-03-10 18:00:00.000
89,90,2019-03-10 22:15:00,0,4.5,0,0,27.0,154,99,36.2,2019-03-10 18:15:00.000
90,91,2019-03-10 22:30:00,0,4.6,0,0,27.0,158,101,36.2,2019-03-10 18:30:00.000
91,92,2019-03-10 22:45:00,0,4.7,0,0,27.0,162,103,34.8,2019-03-10 18:45:00.000
92,93,2019-03-10 23:00:00,0,4.8,0,0,27.0,165,106,23.7,2019-03-10 19:00:00.000
93,94,2019-03-10 23:15:00,0,4.8,0,0,27.0,169,111,36.0,2019-03-10 19:15:00.000
94,95,2019-03-10 23:30:00,0,4.9,0,0,27.0,172,121,36.0,2019-03-10 19:30:00.000
95,96,2019-03-10 23:45:00,0,4.9,0,0,27.0,175,145,37.0,2019-03-10 19:45:00.000
