,BLOCK_ID,DATA_DATETIME,GHI,WIND_SPEED,DNI,DHI,TEMPERATURE,ZENITH,AZIMUTH,CLOUD_OPACITY,ENTRY_TIME
0,1,2019-07-07 00:00:00,0,2.4,0,0,22.5,156,-6,0.0,2019-07-06 20:00:00.000
1,2,2019-07-07 00:15:00,0,2.4,0,0,22.4,156,-14,0.0,2019-07-06 20:15:00.000
2,3,2019-07-07 00:30:00,0,2.4,0,0,22.4,155,-22,0.0,2019-07-06 20:30:00.000
3,4,2019-07-07 00:45:00,0,2.4,0,0,22.3,153,-29,0.0,2019-07-06 20:45:00.000
4,5,2019-07-07 01:00:00,0,2.3,0,0,22.2,151,-35,0.0,2019-07-06 21:00:00.000
5,6,2019-07-07 01:15:00,0,2.3,0,0,22.2,149,-40,0.0,2019-07-06 21:15:00.000
6,7,2019-07-07 01:30:00,0,2.2,0,0,22.2,146,-44,0.0,2019-07-06 21:30:00.000
7,8,2019-07-07 01:45:00,0,2.2,0,0,22.2,143,-48,0.0,2019-07-06 21:45:00.000
8,9,2019-07-07 02:00:00,0,2.2,0,0,22.2,141,-51,0.0,2019-07-06 22:00:00.000
9,10,2019-07-07 02:15:00,0,2.2,0,0,22.2,138,-54,0.0,2019-07-06 22:15:00.000
10,11,2019-07-07 02:30:00,0,2.2,0,0,22.2,135,-56,0.0,2019-07-06 22:30:00.000
11,12,2019-07-07 02:45:00,0,2.2,0,0,22.2,131,-58,0.0,2019-07-06 22:45:00.000
12,13,2019-07-07 03:00:00,0,2.2,0,0,22.2,128,-60,0.0,2019-07-06 23:00:00.000
13,14,2019-07-07 03:15:00,0,2.1,0,0,22.2,125,-61,0.0,2019-07-06 23:15:00.000
14,15,2019-07-07 03:30:00,0,2.1,0,0,22.1,122,-62,0.0,2019-07-06 23:30:00.000
15,16,2019-07-07 03:45:00,0,2.1,0,0,22.1,118,-64,0.0,2019-07-06 23:45:00.000
16,17,2019-07-07 04:00:00,0,2.1,0,0,22.0,115,-64,0.0,2019-07-07 00:00:00.000
17,18,2019-07-07 04:15:00,0,2.1,0,0,22.0,112,-65,0.0,2019-07-07 00:15:00.000
18,19,2019-07-07 04:30:00,0,2.1,0,0,21.9,108,-66,0.0,2019-07-07 00:30:00.000
19,20,2019-07-07 04:45:00,0,2.2,0,0,21.9,105,-66,0.0,2019-07-07 00:45:00.000
20,21,2019-07-07 05:00:00,0,2.2,0,0,21.8,101,-67,0.0,2019-07-07 01:00:00.000
21,22,2019-07-07 05:15:00,0,2.2,0,0,21.8,98,-67,0.0,2019-07-07 01:15:00.000
22,23,2019-07-07 05:30:00,0,2.2,0,0,21.8,94,-67,0.0,2019-07-07 01:30:00.000
23,24,2019-07-07 05:45:00,1,2.2,2,1,21.8,91,-67,0.0,2019-07-07 01:45:00.000
24,25,2019-07-07 06:00:00,20,2.3,67,14,21.9,87,-67,0.0,2019-07-07 02:00:00.000
25,26,2019-07-07 06:15:00,58,2.3,259,30,22.1,84,-67,0.4,2019-07-07 02:15:00.000
26,27,2019-07-07 06:30:00,106,2.3,381,42,22.4,81,-67,0.2,2019-07-07 02:30:00.000
27,28,2019-07-07 06:45:00,158,2.4,475,52,22.7,77,-67,0.0,2019-07-07 02:45:00.000
28,29,2019-07-07 07:00:00,213,2.4,546,59,23.1,74,-66,0.0,2019-07-07 03:00:00.000
29,30,2019-07-07 07:15:00,269,2.5,601,66,23.5,70,-66,0.0,2019-07-07 03:15:00.000
30,31,2019-07-07 07:30:00,326,2.5,646,71,24.1,67,-65,0.0,2019-07-07 03:30:00.000
31,32,2019-07-07 07:45:00,382,2.6,683,76,24.6,63,-65,0.0,2019-07-07 03:45:00.000
32,33,2019-07-07 08:00:00,436,2.6,714,80,25.0,60,-64,0.0,2019-07-07 04:00:00.000
33,34,2019-07-07 08:15:00,489,2.7,739,83,25.3,57,-63,0.0,2019-07-07 04:15:00.000
34,35,2019-07-07 08:30:00,536,2.8,740,95,25.7,53,-62,0.7,2019-07-07 04:30:00.000
35,36,2019-07-07 08:45:00,584,2.9,753,100,26.0,50,-60,0.9,2019-07-07 04:45:00.000
36,37,2019-07-07 09:00:00,590,2.9,600,181,26.3,47,-59,7.1,2019-07-07 05:00:00.000
37,38,2019-07-07 09:15:00,629,3.0,604,192,26.5,44,-57,7.3,2019-07-07 05:15:00.000
38,39,2019-07-07 09:30:00,679,3.1,660,178,26.8,41,-54,5.6,2019-07-07 05:30:00.000
39,40,2019-07-07 09:45:00,734,3.1,749,142,27.1,38,-52,2.9,2019-07-07 05:45:00.000
40,41,2019-07-07 10:00:00,740,3.2,659,198,27.3,35,-48,6.3,2019-07-07 06:00:00.000
41,42,2019-07-07 10:15:00,780,3.4,709,178,27.5,32,-45,4.8,2019-07-07 06:15:00.000
42,43,2019-07-07 10:30:00,814,3.5,751,161,27.7,30,-40,3.5,2019-07-07 06:30:00.000
43,44,2019-07-07 10:45:00,851,3.6,811,130,27.9,27,-34,1.8,2019-07-07 06:45:00.000
44,45,2019-07-07 11:00:00,884,3.7,873,95,28.1,25,-28,0.0,2019-07-07 07:00:00.000
45,46,2019-07-07 11:15:00,897,3.8,878,93,28.2,24,-20,0.0,2019-07-07 07:15:00.000
46,47,2019-07-07 11:30:00,906,3.8,883,92,28.3,23,-12,0.0,2019-07-07 07:30:00.000
47,48,2019-07-07 11:45:00,910,3.9,884,92,28.4,22,-3,0.0,2019-07-07 07:45:00.000
48,49,2019-07-07 12:00:00,910,3.9,884,92,28.5,22,6,0.0,2019-07-07 08:00:00.000
49,50,2019-07-07 12:15:00,905,4.0,883,92,28.5,23,15,0.0,2019-07-07 08:15:00.000
50,51,2019-07-07 12:30:00,896,4.0,882,91,28.4,24,23,0.0,2019-07-07 08:30:00.000
51,52,2019-07-07 12:45:00,882,4.1,879,91,28.4,26,30,0.0,2019-07-07 08:45:00.000
52,53,2019-07-07 13:00:00,864,4.1,876,90,28.4,28,36,0.0,2019-07-07 09:00:00.000
53,54,2019-07-07 13:15:00,842,4.0,872,89,28.3,30,41,0.0,2019-07-07 09:15:00.000
54,55,2019-07-07 13:30:00,816,4.0,867,88,28.3,33,46,0.0,2019-07-07 09:30:00.000
55,56,2019-07-07 13:45:00,786,3.9,860,87,28.2,36,49,0.0,2019-07-07 09:45:00.000
56,57,2019-07-07 14:00:00,752,3.8,851,86,28.1,39,53,0.0,2019-07-07 10:00:00.000
57,58,2019-07-07 14:15:00,714,3.8,841,85,28.0,42,55,0.0,2019-07-07 10:15:00.000
58,59,2019-07-07 14:30:00,673,3.7,828,84,27.8,45,57,0.0,2019-07-07 10:30:00.000
59,60,2019-07-07 14:45:00,629,3.7,815,82,27.7,48,59,0.0,2019-07-07 10:45:00.000
60,61,2019-07-07 15:00:00,582,3.6,800,79,27.6,51,61,0.0,2019-07-07 11:00:00.000
61,62,2019-07-07 15:15:00,532,3.5,782,77,27.4,54,62,0.0,2019-07-07 11:15:00.000
62,63,2019-07-07 15:30:00,480,3.4,761,74,27.2,58,63,0.0,2019-07-07 11:30:00.000
63,64,2019-07-07 15:45:00,426,3.2,736,71,27.0,61,64,0.0,2019-07-07 11:45:00.000
64,65,2019-07-07 16:00:00,371,3.1,706,67,26.7,64,65,0.0,2019-07-07 12:00:00.000
65,66,2019-07-07 16:15:00,315,2.9,669,63,26.4,68,66,0.0,2019-07-07 12:15:00.000
66,67,2019-07-07 16:30:00,258,2.7,624,58,26.1,71,66,0.0,2019-07-07 12:30:00.000
67,68,2019-07-07 16:45:00,201,2.5,567,52,25.8,75,67,0.0,2019-07-07 12:45:00.000
68,69,2019-07-07 17:00:00,146,2.3,494,45,25.3,78,67,0.0,2019-07-07 13:00:00.000
69,70,2019-07-07 17:15:00,92,2.1,357,39,24.7,82,67,2.4,2019-07-07 13:15:00.000
70,71,2019-07-07 17:30:00,46,2.0,216,26,24.1,85,67,1.6,2019-07-07 13:30:00.000
71,72,2019-07-07 17:45:00,11,1.8,38,8,23.4,89,67,0.0,2019-07-07 13:45:00.000
72,73,2019-07-07 18:00:00,0,1.7,0,0,22.9,92,67,0.0,2019-07-07 14:00:00.000
73,74,2019-07-07 18:15:00,0,1.7,0,0,22.6,95,67,0.0,2019-07-07 14:15:00.000
74,75,2019-07-07 18:30:00,0,1.7,0,0,22.4,99,67,0.0,2019-07-07 14:30:00.000
75,76,2019-07-07 18:45:00,0,1.7,0,0,22.1,102,67,0.0,2019-07-07 14:45:00.000
76,77,2019-07-07 19:00:00,0,1.7,0,0,21.9,106,66,0.0,2019-07-07 15:00:00.000
77,78,2019-07-07 19:15:00,0,1.6,0,0,21.8,109,66,0.0,2019-07-07 15:15:00.000
78,79,2019-07-07 19:30:00,0,1.6,0,0,21.8,113,65,0.0,2019-07-07 15:30:00.000
79,80,2019-07-07 19:45:00,0,1.5,0,0,21.7,116,64,0.0,2019-07-07 15:45:00.000
80,81,2019-07-07 20:00:00,0,1.5,0,0,21.6,119,63,0.0,2019-07-07 16:00:00.000
81,82,2019-07-07 20:15:00,0,1.5,0,0,21.6,123,62,0.0,2019-07-07 16:15:00.000
82,83,2019-07-07 20:30:00,0,1.4,0,0,21.5,126,61,0.0,2019-07-07 16:30:00.000
83,84,2019-07-07 20:45:00,0,1.4,0,0,21.4,129,59,0.0,2019-07-07 16:45:00.000
84,85,2019-07-07 21:00:00,0,1.4,0,0,21.3,132,58,0.0,2019-07-07 17:00:00.000
85,86,2019-07-07 21:15:00,0,1.4,0,0,21.3,136,56,0.0,2019-07-07 17:15:00.000
86,87,2019-07-07 21:30:00,0,1.4,0,0,21.3,139,53,0.0,2019-07-07 17:30:00.000
87,88,2019-07-07 21:45:00,0,1.4,0,0,21.2,142,50,0.0,2019-07-07 17:45:00.000
88,89,2019-07-07 22:00:00,0,1.4,0,0,21.2,144,47,0.0,2019-07-07 18:00:00.000
89,90,2019-07-07 22:15:00,0,1.4,0,0,21.2,147,43,0.0,2019-07-07 18:15:00.000
90,91,2019-07-07 22:30:00,0,1.4,0,0,21.1,150,39,0.0,2019-07-07 18:30:00.000
91,92,2019-07-07 22:45:00,0,1.4,0,0,21.1,152,33,0.0,2019-07-07 18:45:00.000
92,93,2019-07-07 23:00:00,0,1.4,0,0,21.1,154,27,0.0,2019-07-07 19:00:00.000
93,94,2019-07-07 23:15:00,0,1.4,0,0,21.1,155,20,0.0,2019-07-07 19:15:00.000
94,95,2019-07-07 23:30:00,0,1.4,0,0,21.1,156,12,0.0,2019-07-07 19:30:00.000
95,96,2019-07-07 23:45:00,0,1.4,0,0,21.1,157,3,0.0,2019-07-07 19:45:00.000
