,BLOCK_ID,DATA_DATETIME,GHI,WIND_SPEED,DNI,DHI,TEMPERATURE,ZENITH,AZIMUTH,CLOUD_OPACITY,ENTRY_TIME
0,1,2018-10-08 00:00:00,0,3.6,0,0,26.3,172,-124,0.0,2018-10-07 20:00:00.000
1,2,2018-10-08 00:15:00,0,3.6,0,0,26.2,169,-113,0.0,2018-10-07 20:15:00.000
2,3,2018-10-08 00:30:00,0,3.7,0,0,26.2,165,-108,0.0,2018-10-07 20:30:00.000
3,4,2018-10-08 00:45:00,0,3.7,0,0,26.2,162,-104,0.0,2018-10-07 20:45:00.000
4,5,2018-10-08 01:00:00,0,3.7,0,0,26.1,158,-102,0.0,2018-10-07 21:00:00.000
5,6,2018-10-08 01:15:00,0,3.7,0,0,26.1,154,-100,0.0,2018-10-07 21:15:00.000
6,7,2018-10-08 01:30:00,0,3.7,0,0,26.1,151,-99,0.0,2018-10-07 21:30:00.000
7,8,2018-10-08 01:45:00,0,3.7,0,0,26.0,147,-98,0.0,2018-10-07 21:45:00.000
8,9,2018-10-08 02:00:00,0,3.7,0,0,26.0,143,-98,0.0,2018-10-07 22:00:00.000
9,10,2018-10-08 02:15:00,0,3.7,0,0,26.0,139,-97,0.0,2018-10-07 22:15:00.000
10,11,2018-10-08 02:30:00,0,3.7,0,0,26.0,136,-97,0.0,2018-10-07 22:30:00.000
11,12,2018-10-08 02:45:00,0,3.7,0,0,26.1,132,-96,0.0,2018-10-07 22:45:00.000
12,13,2018-10-08 03:00:00,0,3.7,0,0,26.1,128,-96,0.0,2018-10-07 23:00:00.000
13,14,2018-10-08 03:15:00,0,3.7,0,0,26.1,124,-96,0.0,2018-10-07 23:15:00.000
14,15,2018-10-08 03:30:00,0,3.7,0,0,26.1,121,-96,0.0,2018-10-07 23:30:00.000
15,16,2018-10-08 03:45:00,0,3.7,0,0,26.1,117,-95,0.0,2018-10-07 23:45:00.000
16,17,2018-10-08 04:00:00,0,3.7,0,0,26.1,113,-95,0.0,2018-10-08 00:00:00.000
17,18,2018-10-08 04:15:00,0,3.7,0,0,26.2,110,-95,0.0,2018-10-08 00:15:00.000
18,19,2018-10-08 04:30:00,0,3.7,0,0,26.2,106,-95,0.0,2018-10-08 00:30:00.000
19,20,2018-10-08 04:45:00,0,3.7,0,0,26.2,102,-95,0.0,2018-10-08 00:45:00.000
20,21,2018-10-08 05:00:00,0,3.7,0,0,26.2,98,-95,0.0,2018-10-08 01:00:00.000
21,22,2018-10-08 05:15:00,0,3.7,0,0,26.3,95,-95,0.0,2018-10-08 01:15:00.000
22,23,2018-10-08 05:30:00,0,3.7,0,0,26.4,91,-95,0.0,2018-10-08 01:30:00.000
23,24,2018-10-08 05:45:00,23,3.6,79,16,26.4,87,-95,0.0,2018-10-08 01:45:00.000
24,25,2018-10-08 06:00:00,55,3.6,58,49,26.5,83,-95,14.8,2018-10-08 02:00:00.000
25,26,2018-10-08 06:15:00,99,3.6,111,78,26.6,80,-95,16.7,2018-10-08 02:15:00.000
26,27,2018-10-08 06:30:00,174,3.5,435,66,26.7,76,-95,2.0,2018-10-08 02:30:00.000
27,28,2018-10-08 06:45:00,238,3.5,543,72,26.8,72,-96,0.0,2018-10-08 02:45:00.000
28,29,2018-10-08 07:00:00,300,3.5,599,80,26.8,68,-96,0.0,2018-10-08 03:00:00.000
29,30,2018-10-08 07:15:00,363,3.5,644,88,26.9,65,-96,0.0,2018-10-08 03:15:00.000
30,31,2018-10-08 07:30:00,424,3.4,681,94,27.0,61,-96,0.0,2018-10-08 03:30:00.000
31,32,2018-10-08 07:45:00,485,3.4,712,100,27.1,57,-97,0.0,2018-10-08 03:45:00.000
32,33,2018-10-08 08:00:00,544,3.4,738,105,27.1,54,-97,0.0,2018-10-08 04:00:00.000
33,34,2018-10-08 08:15:00,601,3.4,760,110,27.1,50,-97,0.0,2018-10-08 04:15:00.000
34,35,2018-10-08 08:30:00,654,3.4,778,114,27.1,46,-98,0.0,2018-10-08 04:30:00.000
35,36,2018-10-08 08:45:00,705,3.4,793,119,27.1,42,-98,0.0,2018-10-08 04:45:00.000
36,37,2018-10-08 09:00:00,752,3.4,807,122,27.1,39,-99,0.0,2018-10-08 05:00:00.000
37,38,2018-10-08 09:15:00,796,3.4,818,126,27.1,35,-100,0.0,2018-10-08 05:15:00.000
38,39,2018-10-08 09:30:00,836,3.3,827,129,27.1,31,-101,0.0,2018-10-08 05:30:00.000
39,40,2018-10-08 09:45:00,871,3.3,835,132,27.0,28,-103,0.0,2018-10-08 05:45:00.000
40,41,2018-10-08 10:00:00,903,3.3,841,134,27.0,24,-104,0.0,2018-10-08 06:00:00.000
41,42,2018-10-08 10:15:00,924,3.3,827,149,27.0,20,-107,0.6,2018-10-08 06:15:00.000
42,43,2018-10-08 10:30:00,934,3.4,789,179,27.0,17,-111,1.9,2018-10-08 06:30:00.000
43,44,2018-10-08 10:45:00,576,3.4,72,506,27.0,13,-116,40.4,2018-10-08 06:45:00.000
44,45,2018-10-08 11:00:00,852,3.4,664,197,27.0,10,-126,13.0,2018-10-08 07:00:00.000
45,46,2018-10-08 11:15:00,973,3.4,786,193,27.0,7,-143,1.2,2018-10-08 07:15:00.000
46,47,2018-10-08 11:30:00,971,3.5,766,209,27.0,6,-173,1.6,2018-10-08 07:30:00.000
47,48,2018-10-08 11:45:00,562,3.5,0,562,27.1,7,154,42.9,2018-10-08 07:45:00.000
48,49,2018-10-08 12:00:00,891,3.5,647,253,27.1,9,132,8.8,2018-10-08 08:00:00.000
49,50,2018-10-08 12:15:00,849,3.6,462,397,27.1,12,120,12.1,2018-10-08 08:15:00.000
50,51,2018-10-08 12:30:00,926,3.6,728,224,27.1,15,113,2.5,2018-10-08 08:30:00.000
51,52,2018-10-08 12:45:00,929,3.7,793,179,27.1,19,108,0.0,2018-10-08 08:45:00.000
52,53,2018-10-08 13:00:00,903,3.7,785,178,27.1,22,105,0.0,2018-10-08 09:00:00.000
53,54,2018-10-08 13:15:00,842,3.8,671,240,27.2,26,103,3.6,2018-10-08 09:15:00.000
54,55,2018-10-08 13:30:00,839,3.9,767,174,27.2,30,102,0.0,2018-10-08 09:30:00.000
55,56,2018-10-08 13:45:00,801,3.9,760,167,27.2,33,101,0.0,2018-10-08 09:45:00.000
56,57,2018-10-08 14:00:00,760,4.0,752,161,27.2,37,100,0.0,2018-10-08 10:00:00.000
57,58,2018-10-08 14:15:00,715,4.0,742,153,27.2,41,99,0.0,2018-10-08 10:15:00.000
58,59,2018-10-08 14:30:00,666,4.0,729,146,27.2,45,98,0.0,2018-10-08 10:30:00.000
59,60,2018-10-08 14:45:00,613,4.1,710,141,27.2,48,98,0.0,2018-10-08 10:45:00.000
60,61,2018-10-08 15:00:00,550,4.1,650,150,27.2,52,97,1.3,2018-10-08 11:00:00.000
61,62,2018-10-08 15:15:00,421,4.1,309,251,27.2,56,97,15.4,2018-10-08 11:15:00.000
62,63,2018-10-08 15:30:00,347,4.1,178,253,27.1,59,97,21.6,2018-10-08 11:30:00.000
63,64,2018-10-08 15:45:00,271,4.2,101,224,27.1,63,96,29.2,2018-10-08 11:45:00.000
64,65,2018-10-08 16:00:00,114,4.2,0,114,27.1,67,96,64.6,2018-10-08 12:00:00.000
65,66,2018-10-08 16:15:00,88,4.2,0,88,27.1,71,96,65.6,2018-10-08 12:15:00.000
66,67,2018-10-08 16:30:00,79,4.3,0,79,27.1,74,96,59.0,2018-10-08 12:30:00.000
67,68,2018-10-08 16:45:00,100,4.3,11,98,27.1,78,96,26.9,2018-10-08 12:45:00.000
68,69,2018-10-08 17:00:00,54,4.3,0,54,27.1,82,95,32.9,2018-10-08 13:00:00.000
69,70,2018-10-08 17:15:00,32,4.3,12,31,27.1,86,95,10.9,2018-10-08 13:15:00.000
70,71,2018-10-08 17:30:00,5,4.3,8,4,27.1,89,95,0.0,2018-10-08 13:30:00.000
71,72,2018-10-08 17:45:00,0,4.2,0,0,27.1,93,95,0.0,2018-10-08 13:45:00.000
72,73,2018-10-08 18:00:00,0,4.2,0,0,27.1,97,95,0.0,2018-10-08 14:00:00.000
73,74,2018-10-08 18:15:00,0,4.2,0,0,27.1,101,95,0.0,2018-10-08 14:15:00.000
74,75,2018-10-08 18:30:00,0,4.2,0,0,27.0,104,95,0.0,2018-10-08 14:30:00.000
75,76,2018-10-08 18:45:00,0,4.2,0,0,27.0,108,95,0.0,2018-10-08 14:45:00.000
76,77,2018-10-08 19:00:00,0,4.2,0,0,27.0,112,96,0.0,2018-10-08 15:00:00.000
77,78,2018-10-08 19:15:00,0,4.2,0,0,27.0,115,96,0.0,2018-10-08 15:15:00.000
78,79,2018-10-08 19:30:00,0,4.2,0,0,27.0,119,96,0.0,2018-10-08 15:30:00.000
79,80,2018-10-08 19:45:00,0,4.2,0,0,27.0,123,96,0.0,2018-10-08 15:45:00.000
80,81,2018-10-08 20:00:00,0,4.2,0,0,27.0,127,96,0.0,2018-10-08 16:00:00.000
81,82,2018-10-08 20:15:00,0,4.2,0,0,27.0,130,97,0.0,2018-10-08 16:15:00.000
82,83,2018-10-08 20:30:00,0,4.2,0,0,26.9,134,97,0.0,2018-10-08 16:30:00.000
83,84,2018-10-08 20:45:00,0,4.2,0,0,26.9,138,97,0.0,2018-10-08 16:45:00.000
84,85,2018-10-08 21:00:00,0,4.2,0,0,26.9,142,98,0.0,2018-10-08 17:00:00.000
85,86,2018-10-08 21:15:00,0,4.2,0,0,26.9,145,99,0.0,2018-10-08 17:15:00.000
86,87,2018-10-08 21:30:00,0,4.2,0,0,26.8,149,99,0.0,2018-10-08 17:30:00.000
87,88,2018-10-08 21:45:00,0,4.3,0,0,26.8,153,101,0.0,2018-10-08 17:45:00.000
88,89,2018-10-08 22:00:00,0,4.3,0,0,26.8,156,102,0.0,2018-10-08 18:00:00.000
89,90,2018-10-08 22:15:00,0,4.3,0,0,26.8,160,104,0.0,2018-10-08 18:15:00.000
90,91,2018-10-08 22:30:00,0,4.3,0,0,26.7,164,107,0.0,2018-10-08 18:30:00.000
91,92,2018-10-08 22:45:00,0,4.3,0,0,26.7,167,112,0.0,2018-10-08 18:45:00.000
92,93,2018-10-08 23:00:00,0,4.3,0,0,26.7,170,121,0.0,2018-10-08 19:00:00.000
93,94,2018-10-08 23:15:00,0,4.3,0,0,26.7,173,138,0.0,2018-10-08 19:15:00.000
94,95,2018-10-08 23:30:00,0,4.3,0,0,26.6,175,172,0.0,2018-10-08 19:30:00.000
95,96,2018-10-08 23:45:00,0,4.3,0,0,26.6,174,-149,0.0,2018-10-08 19:45:00.000
