,BLOCK_ID,DATA_DATETIME,GHI,WIND_SPEED,DNI,DHI,TEMPERATURE,ZENITH,AZIMUTH,CLOUD_OPACITY,ENTRY_TIME
0,1,2021-07-22 00:00:00,0,1.2,0,0,23.5,159,-5,72.0,2021-07-21 20:00:00.000
1,2,2021-07-22 00:15:00,0,1.1,0,0,23.5,158,-14,57.6,2021-07-21 20:15:00.000
2,3,2021-07-22 00:30:00,0,1.1,0,0,23.4,157,-23,61.0,2021-07-21 20:30:00.000
3,4,2021-07-22 00:45:00,0,1.1,0,0,23.4,155,-31,72.8,2021-07-21 20:45:00.000
4,5,2021-07-22 01:00:00,0,1.0,0,0,23.4,153,-37,91.0,2021-07-21 21:00:00.000
5,6,2021-07-22 01:15:00,0,1.1,0,0,23.3,151,-42,89.5,2021-07-21 21:15:00.000
6,7,2021-07-22 01:30:00,0,1.2,0,0,23.3,148,-47,90.0,2021-07-21 21:30:00.000
7,8,2021-07-22 01:45:00,0,1.2,0,0,23.2,145,-51,64.1,2021-07-21 21:45:00.000
8,9,2021-07-22 02:00:00,0,1.3,0,0,23.2,142,-54,79.8,2021-07-21 22:00:00.000
9,10,2021-07-22 02:15:00,0,1.3,0,0,23.2,139,-57,73.4,2021-07-21 22:15:00.000
10,11,2021-07-22 02:30:00,0,1.4,0,0,23.2,136,-59,77.6,2021-07-21 22:30:00.000
11,12,2021-07-22 02:45:00,0,1.5,0,0,23.2,133,-61,59.1,2021-07-21 22:45:00.000
12,13,2021-07-22 03:00:00,0,1.5,0,0,23.2,129,-62,78.0,2021-07-21 23:00:00.000
13,14,2021-07-22 03:15:00,0,1.4,0,0,23.2,126,-64,84.6,2021-07-21 23:15:00.000
14,15,2021-07-22 03:30:00,0,1.4,0,0,23.2,123,-65,84.4,2021-07-21 23:30:00.000
15,16,2021-07-22 03:45:00,0,1.3,0,0,23.2,119,-66,56.5,2021-07-21 23:45:00.000
16,17,2021-07-22 04:00:00,0,1.2,0,0,23.2,116,-67,68.4,2021-07-22 00:00:00.000
17,18,2021-07-22 04:15:00,0,1.1,0,0,23.2,112,-67,62.3,2021-07-22 00:15:00.000
18,19,2021-07-22 04:30:00,0,1.1,0,0,23.2,109,-68,56.8,2021-07-22 00:30:00.000
19,20,2021-07-22 04:45:00,0,1.0,0,0,23.1,105,-68,57.3,2021-07-22 00:45:00.000
20,21,2021-07-22 05:00:00,0,1.0,0,0,23.1,102,-69,33.2,2021-07-22 01:00:00.000
21,22,2021-07-22 05:15:00,0,1.0,0,0,23.1,98,-69,53.4,2021-07-22 01:15:00.000
22,23,2021-07-22 05:30:00,0,1.1,0,0,23.1,95,-69,47.8,2021-07-22 01:30:00.000
23,24,2021-07-22 05:45:00,0,1.2,0,0,23.0,91,-69,44.8,2021-07-22 01:45:00.000
24,25,2021-07-22 06:00:00,7,1.2,0,7,23.1,88,-69,51.4,2021-07-22 02:00:00.000
25,26,2021-07-22 06:15:00,47,1.3,100,34,23.4,84,-69,16.8,2021-07-22 02:15:00.000
26,27,2021-07-22 06:30:00,102,1.4,390,40,23.7,81,-69,0.0,2021-07-22 02:30:00.000
27,28,2021-07-22 06:45:00,147,1.5,399,62,24.0,77,-69,3.9,2021-07-22 02:45:00.000
28,29,2021-07-22 07:00:00,182,1.5,274,106,24.3,74,-69,13.0,2021-07-22 03:00:00.000
29,30,2021-07-22 07:15:00,231,1.6,312,127,24.6,70,-68,12.9,2021-07-22 03:15:00.000
30,31,2021-07-22 07:30:00,314,1.6,571,87,24.9,67,-68,3.0,2021-07-22 03:30:00.000
31,32,2021-07-22 07:45:00,378,1.7,672,78,25.3,63,-67,0.0,2021-07-22 03:45:00.000
32,33,2021-07-22 08:00:00,433,1.7,701,83,25.6,60,-66,0.0,2021-07-22 04:00:00.000
33,34,2021-07-22 08:15:00,463,1.7,596,134,25.9,57,-65,4.9,2021-07-22 04:15:00.000
34,35,2021-07-22 08:30:00,538,1.7,745,92,26.1,53,-64,0.0,2021-07-22 04:30:00.000
35,36,2021-07-22 08:45:00,587,1.7,762,96,26.4,50,-63,0.0,2021-07-22 04:45:00.000
36,37,2021-07-22 09:00:00,634,1.7,777,99,26.7,47,-62,0.0,2021-07-22 05:00:00.000
37,38,2021-07-22 09:15:00,663,1.8,731,132,26.9,43,-60,2.1,2021-07-22 05:15:00.000
38,39,2021-07-22 09:30:00,639,1.8,500,257,27.1,40,-58,11.0,2021-07-22 05:30:00.000
39,40,2021-07-22 09:45:00,678,1.8,524,259,27.3,37,-55,10.3,2021-07-22 05:45:00.000
40,41,2021-07-22 10:00:00,709,1.9,532,267,27.5,34,-52,10.2,2021-07-22 06:00:00.000
41,42,2021-07-22 10:15:00,743,1.8,564,260,27.5,31,-48,9.2,2021-07-22 06:15:00.000
42,43,2021-07-22 10:30:00,648,1.8,246,432,27.4,28,-44,23.2,2021-07-22 06:30:00.000
43,44,2021-07-22 10:45:00,687,1.7,298,419,27.4,26,-38,20.6,2021-07-22 06:45:00.000
44,45,2021-07-22 11:00:00,797,1.7,562,283,27.3,24,-32,9.6,2021-07-22 07:00:00.000
45,46,2021-07-22 11:15:00,870,1.8,757,168,27.3,22,-24,2.7,2021-07-22 07:15:00.000
46,47,2021-07-22 11:30:00,829,1.9,597,270,27.2,21,-15,8.2,2021-07-22 07:30:00.000
47,48,2021-07-22 11:45:00,793,2.1,499,324,27.2,20,-5,12.6,2021-07-22 07:45:00.000
48,49,2021-07-22 12:00:00,711,2.1,302,428,27.2,20,5,21.6,2021-07-22 08:00:00.000
49,50,2021-07-22 12:15:00,598,2.1,52,549,27.2,21,15,33.7,2021-07-22 08:15:00.000
50,51,2021-07-22 12:30:00,692,2.1,260,451,27.2,22,24,22.6,2021-07-22 08:30:00.000
51,52,2021-07-22 12:45:00,880,2.1,834,118,27.3,24,32,0.0,2021-07-22 08:45:00.000
52,53,2021-07-22 13:00:00,863,2.1,831,116,27.3,26,39,0.0,2021-07-22 09:00:00.000
53,54,2021-07-22 13:15:00,841,2.2,827,115,27.3,28,44,0.0,2021-07-22 09:15:00.000
54,55,2021-07-22 13:30:00,815,2.2,821,113,27.4,31,49,0.0,2021-07-22 09:30:00.000
55,56,2021-07-22 13:45:00,785,2.3,814,111,27.4,34,52,0.0,2021-07-22 09:45:00.000
56,57,2021-07-22 14:00:00,751,2.4,806,109,27.5,37,55,0.0,2021-07-22 10:00:00.000
57,58,2021-07-22 14:15:00,691,2.4,706,151,27.5,40,58,3.3,2021-07-22 10:15:00.000
58,59,2021-07-22 14:30:00,375,2.4,98,302,27.5,43,60,44.6,2021-07-22 10:30:00.000
59,60,2021-07-22 14:45:00,404,2.4,37,380,27.5,47,62,35.7,2021-07-22 10:45:00.000
60,61,2021-07-22 15:00:00,323,2.4,24,307,27.5,50,63,44.8,2021-07-22 11:00:00.000
61,62,2021-07-22 15:15:00,102,2.4,0,102,27.4,53,65,80.8,2021-07-22 11:15:00.000
62,63,2021-07-22 15:30:00,117,2.3,0,117,27.2,57,66,75.6,2021-07-22 11:30:00.000
63,64,2021-07-22 15:45:00,207,2.3,0,207,27.1,60,67,51.8,2021-07-22 11:45:00.000
64,65,2021-07-22 16:00:00,193,2.2,0,193,26.9,64,67,48.3,2021-07-22 12:00:00.000
65,66,2021-07-22 16:15:00,89,2.1,0,89,26.5,67,68,72.2,2021-07-22 12:15:00.000
66,67,2021-07-22 16:30:00,94,2.0,0,94,26.2,71,68,63.8,2021-07-22 12:30:00.000
67,68,2021-07-22 16:45:00,49,1.9,0,49,25.8,74,69,76.7,2021-07-22 12:45:00.000
68,69,2021-07-22 17:00:00,41,1.8,0,41,25.4,78,69,72.6,2021-07-22 13:00:00.000
69,70,2021-07-22 17:15:00,46,1.7,0,46,25.2,81,69,52.9,2021-07-22 13:15:00.000
70,71,2021-07-22 17:30:00,28,1.6,0,28,24.9,85,69,45.6,2021-07-22 13:30:00.000
71,72,2021-07-22 17:45:00,5,1.5,0,5,24.6,88,69,69.7,2021-07-22 13:45:00.000
72,73,2021-07-22 18:00:00,0,1.4,0,0,24.3,92,69,61.6,2021-07-22 14:00:00.000
73,74,2021-07-22 18:15:00,0,1.4,0,0,24.2,95,69,67.3,2021-07-22 14:15:00.000
74,75,2021-07-22 18:30:00,0,1.5,0,0,24.1,99,69,84.8,2021-07-22 14:30:00.000
75,76,2021-07-22 18:45:00,0,1.5,0,0,24.0,102,69,87.4,2021-07-22 14:45:00.000
76,77,2021-07-22 19:00:00,0,1.6,0,0,23.9,106,68,58.2,2021-07-22 15:00:00.000
77,78,2021-07-22 19:15:00,0,1.6,0,0,23.7,109,68,56.9,2021-07-22 15:15:00.000
78,79,2021-07-22 19:30:00,0,1.6,0,0,23.5,113,67,54.2,2021-07-22 15:30:00.000
79,80,2021-07-22 19:45:00,0,1.6,0,0,23.4,116,67,54.6,2021-07-22 15:45:00.000
80,81,2021-07-22 20:00:00,0,1.6,0,0,23.2,120,66,61.6,2021-07-22 16:00:00.000
81,82,2021-07-22 20:15:00,0,1.5,0,0,23.2,123,65,68.9,2021-07-22 16:15:00.000
82,83,2021-07-22 20:30:00,0,1.4,0,0,23.1,126,64,69.4,2021-07-22 16:30:00.000
83,84,2021-07-22 20:45:00,0,1.4,0,0,23.1,130,62,89.9,2021-07-22 16:45:00.000
84,85,2021-07-22 21:00:00,0,1.3,0,0,23.0,133,61,86.6,2021-07-22 17:00:00.000
85,86,2021-07-22 21:15:00,0,1.3,0,0,23.0,136,59,90.6,2021-07-22 17:15:00.000
86,87,2021-07-22 21:30:00,0,1.3,0,0,23.0,139,57,91.2,2021-07-22 17:30:00.000
87,88,2021-07-22 21:45:00,0,1.3,0,0,23.0,142,54,86.5,2021-07-22 17:45:00.000
88,89,2021-07-22 22:00:00,0,1.3,0,0,23.0,145,51,88.4,2021-07-22 18:00:00.000
89,90,2021-07-22 22:15:00,0,1.3,0,0,23.0,148,47,89.3,2021-07-22 18:15:00.000
90,91,2021-07-22 22:30:00,0,1.3,0,0,22.9,151,42,91.6,2021-07-22 18:30:00.000
91,92,2021-07-22 22:45:00,0,1.4,0,0,22.9,153,37,90.4,2021-07-22 18:45:00.000
92,93,2021-07-22 23:00:00,0,1.4,0,0,22.9,155,30,90.6,2021-07-22 19:00:00.000
93,94,2021-07-22 23:15:00,0,1.4,0,0,22.9,157,23,81.6,2021-07-22 19:15:00.000
94,95,2021-07-22 23:30:00,0,1.4,0,0,22.9,158,14,83.8,2021-07-22 19:30:00.000
95,96,2021-07-22 23:45:00,0,1.4,0,0,22.9,159,5,87.6,2021-07-22 19:45:00.000
