,BLOCK_ID,DATA_DATETIME,GHI,WIND_SPEED,DNI,DHI,TEMPERATURE,ZENITH,AZIMUTH,CLOUD_OPACITY,ENTRY_TIME
0,1,2019-04-19 00:00:00,0,2.7,0,0,26.8,168,-18,36.7,2019-04-18 20:00:00.000
1,2,2019-04-19 00:15:00,0,2.6,0,0,26.7,167,-33,36.8,2019-04-18 20:15:00.000
2,3,2019-04-19 00:30:00,0,2.6,0,0,26.7,164,-45,11.8,2019-04-18 20:30:00.000
3,4,2019-04-19 00:45:00,0,2.6,0,0,26.6,161,-53,36.8,2019-04-18 20:45:00.000
4,5,2019-04-19 01:00:00,0,2.5,0,0,26.6,158,-59,37.0,2019-04-18 21:00:00.000
5,6,2019-04-19 01:15:00,0,2.5,0,0,26.5,155,-63,0.0,2019-04-18 21:15:00.000
6,7,2019-04-19 01:30:00,0,2.4,0,0,26.5,152,-66,0.0,2019-04-18 21:30:00.000
7,8,2019-04-19 01:45:00,0,2.4,0,0,26.4,148,-69,0.0,2019-04-18 21:45:00.000
8,9,2019-04-19 02:00:00,0,2.4,0,0,26.4,145,-71,0.0,2019-04-18 22:00:00.000
9,10,2019-04-19 02:15:00,0,2.4,0,0,26.4,141,-72,0.0,2019-04-18 22:15:00.000
10,11,2019-04-19 02:30:00,0,2.3,0,0,26.4,138,-74,0.0,2019-04-18 22:30:00.000
11,12,2019-04-19 02:45:00,0,2.3,0,0,26.3,134,-75,0.0,2019-04-18 22:45:00.000
12,13,2019-04-19 03:00:00,0,2.3,0,0,26.3,130,-76,0.0,2019-04-18 23:00:00.000
13,14,2019-04-19 03:15:00,0,2.3,0,0,26.3,127,-76,0.0,2019-04-18 23:15:00.000
14,15,2019-04-19 03:30:00,0,2.3,0,0,26.3,123,-77,0.0,2019-04-18 23:30:00.000
15,16,2019-04-19 03:45:00,0,2.3,0,0,26.3,119,-78,0.0,2019-04-18 23:45:00.000
16,17,2019-04-19 04:00:00,0,2.3,0,0,26.3,116,-78,0.0,2019-04-19 00:00:00.000
17,18,2019-04-19 04:15:00,0,2.3,0,0,26.2,112,-78,0.0,2019-04-19 00:15:00.000
18,19,2019-04-19 04:30:00,0,2.3,0,0,26.2,108,-79,0.0,2019-04-19 00:30:00.000
19,20,2019-04-19 04:45:00,0,2.3,0,0,26.2,105,-79,0.0,2019-04-19 00:45:00.000
20,21,2019-04-19 05:00:00,0,2.3,0,0,26.2,101,-79,0.0,2019-04-19 01:00:00.000
21,22,2019-04-19 05:15:00,0,2.2,0,0,26.3,97,-79,0.0,2019-04-19 01:15:00.000
22,23,2019-04-19 05:30:00,0,2.2,0,0,26.4,94,-79,0.0,2019-04-19 01:30:00.000
23,24,2019-04-19 05:45:00,4,2.1,10,3,26.4,90,-79,0.0,2019-04-19 01:45:00.000
24,25,2019-04-19 06:00:00,33,2.1,149,20,26.5,86,-79,0.0,2019-04-19 02:00:00.000
25,26,2019-04-19 06:15:00,69,2.0,129,52,26.6,83,-79,13.0,2019-04-19 02:15:00.000
26,27,2019-04-19 06:30:00,113,2.0,169,80,26.7,79,-79,15.1,2019-04-19 02:30:00.000
27,28,2019-04-19 06:45:00,166,2.0,249,102,26.7,75,-79,13.6,2019-04-19 02:45:00.000
28,29,2019-04-19 07:00:00,213,2.0,255,133,26.8,72,-79,15.4,2019-04-19 03:00:00.000
29,30,2019-04-19 07:15:00,226,1.9,68,200,26.9,68,-79,28.0,2019-04-19 03:15:00.000
30,31,2019-04-19 07:30:00,289,1.9,169,215,27.0,64,-79,22.9,2019-04-19 03:30:00.000
31,32,2019-04-19 07:45:00,385,1.9,427,171,27.0,60,-78,11.7,2019-04-19 03:45:00.000
32,33,2019-04-19 08:00:00,494,1.9,738,90,27.1,57,-78,0.0,2019-04-19 04:00:00.000
33,34,2019-04-19 08:15:00,551,1.9,760,95,27.1,53,-77,0.0,2019-04-19 04:15:00.000
34,35,2019-04-19 08:30:00,606,1.9,780,99,27.1,49,-77,0.0,2019-04-19 04:30:00.000
35,36,2019-04-19 08:45:00,658,1.8,797,102,27.1,46,-76,0.0,2019-04-19 04:45:00.000
36,37,2019-04-19 09:00:00,707,1.8,811,106,27.1,42,-75,0.0,2019-04-19 05:00:00.000
37,38,2019-04-19 09:15:00,752,1.7,823,109,27.1,39,-74,0.0,2019-04-19 05:15:00.000
38,39,2019-04-19 09:30:00,787,1.7,804,129,27.2,35,-72,1.0,2019-04-19 05:30:00.000
39,40,2019-04-19 09:45:00,799,1.7,723,183,27.2,31,-70,4.0,2019-04-19 05:45:00.000
40,41,2019-04-19 10:00:00,783,1.6,566,283,27.2,28,-68,9.7,2019-04-19 06:00:00.000
41,42,2019-04-19 10:15:00,728,1.6,366,396,27.2,24,-65,18.8,2019-04-19 06:15:00.000
42,43,2019-04-19 10:30:00,451,1.6,11,440,27.2,21,-61,51.1,2019-04-19 06:30:00.000
43,44,2019-04-19 10:45:00,507,1.5,0,507,27.2,18,-56,46.3,2019-04-19 06:45:00.000
44,45,2019-04-19 11:00:00,600,1.5,9,591,27.2,15,-48,37.6,2019-04-19 07:00:00.000
45,46,2019-04-19 11:15:00,451,1.4,0,451,27.2,12,-36,53.6,2019-04-19 07:15:00.000
46,47,2019-04-19 11:30:00,389,1.4,0,389,27.2,11,-20,60.2,2019-04-19 07:30:00.000
47,48,2019-04-19 11:45:00,481,1.3,43,438,27.3,10,0,51.0,2019-04-19 07:45:00.000
48,49,2019-04-19 12:00:00,735,1.3,217,521,27.3,11,20,25.0,2019-04-19 08:00:00.000
49,50,2019-04-19 12:15:00,713,1.3,183,534,27.3,12,36,26.7,2019-04-19 08:15:00.000
50,51,2019-04-19 12:30:00,736,1.2,250,495,27.3,15,48,23.3,2019-04-19 08:30:00.000
51,52,2019-04-19 12:45:00,825,1.2,517,334,27.3,18,56,12.6,2019-04-19 08:45:00.000
52,53,2019-04-19 13:00:00,923,1.1,860,121,27.3,21,61,0.0,2019-04-19 09:00:00.000
53,54,2019-04-19 13:15:00,821,1.1,604,270,27.4,25,65,8.6,2019-04-19 09:15:00.000
54,55,2019-04-19 13:30:00,680,1.0,281,431,27.4,28,68,21.7,2019-04-19 09:30:00.000
55,56,2019-04-19 13:45:00,604,1.0,165,463,27.4,31,70,27.5,2019-04-19 09:45:00.000
56,57,2019-04-19 14:00:00,506,1.0,5,502,27.4,35,72,36.2,2019-04-19 10:00:00.000
57,58,2019-04-19 14:15:00,154,1.0,0,154,27.4,39,74,79.6,2019-04-19 10:15:00.000
58,59,2019-04-19 14:30:00,81,1.1,0,81,27.4,42,75,88.5,2019-04-19 10:30:00.000
59,60,2019-04-19 14:45:00,42,1.1,0,42,27.4,46,76,93.5,2019-04-19 10:45:00.000
60,61,2019-04-19 15:00:00,134,1.2,0,134,27.5,49,76,77.6,2019-04-19 11:00:00.000
61,62,2019-04-19 15:15:00,33,1.2,0,33,27.5,53,77,94.0,2019-04-19 11:15:00.000
62,63,2019-04-19 15:30:00,52,1.2,0,52,27.5,57,78,89.3,2019-04-19 11:30:00.000
63,64,2019-04-19 15:45:00,42,1.3,0,42,27.5,60,78,90.1,2019-04-19 11:45:00.000
64,65,2019-04-19 16:00:00,65,1.3,0,65,27.5,64,78,82.6,2019-04-19 12:00:00.000
65,66,2019-04-19 16:15:00,56,1.4,0,56,27.5,68,79,82.2,2019-04-19 12:15:00.000
66,67,2019-04-19 16:30:00,43,1.4,0,43,27.5,71,79,82.7,2019-04-19 12:30:00.000
67,68,2019-04-19 16:45:00,22,1.5,0,22,27.6,75,79,88.4,2019-04-19 12:45:00.000
68,69,2019-04-19 17:00:00,29,1.5,0,29,27.5,79,79,77.5,2019-04-19 13:00:00.000
69,70,2019-04-19 17:15:00,48,1.6,0,48,27.4,83,79,40.3,2019-04-19 13:15:00.000
70,71,2019-04-19 17:30:00,11,1.6,0,11,27.4,86,79,69.9,2019-04-19 13:30:00.000
71,72,2019-04-19 17:45:00,1,1.7,0,1,27.3,90,79,59.8,2019-04-19 13:45:00.000
72,73,2019-04-19 18:00:00,0,1.7,0,0,27.2,94,79,59.8,2019-04-19 14:00:00.000
73,74,2019-04-19 18:15:00,0,1.8,0,0,27.1,97,79,50.7,2019-04-19 14:15:00.000
74,75,2019-04-19 18:30:00,0,1.9,0,0,27.0,101,79,43.9,2019-04-19 14:30:00.000
75,76,2019-04-19 18:45:00,0,1.9,0,0,26.9,105,79,38.9,2019-04-19 14:45:00.000
76,77,2019-04-19 19:00:00,0,2.0,0,0,26.8,108,79,34.2,2019-04-19 15:00:00.000
77,78,2019-04-19 19:15:00,0,2.1,0,0,26.7,112,78,35.2,2019-04-19 15:15:00.000
78,79,2019-04-19 19:30:00,0,2.1,0,0,26.6,116,78,35.5,2019-04-19 15:30:00.000
79,80,2019-04-19 19:45:00,0,2.2,0,0,26.5,119,77,19.8,2019-04-19 15:45:00.000
80,81,2019-04-19 20:00:00,0,2.3,0,0,26.4,123,77,33.9,2019-04-19 16:00:00.000
81,82,2019-04-19 20:15:00,0,2.4,0,0,26.5,127,76,34.2,2019-04-19 16:15:00.000
82,83,2019-04-19 20:30:00,0,2.4,0,0,26.6,130,75,35.1,2019-04-19 16:30:00.000
83,84,2019-04-19 20:45:00,0,2.5,0,0,26.7,134,74,27.2,2019-04-19 16:45:00.000
84,85,2019-04-19 21:00:00,0,2.6,0,0,26.9,137,73,34.8,2019-04-19 17:00:00.000
85,86,2019-04-19 21:15:00,0,2.6,0,0,27.0,141,72,46.0,2019-04-19 17:15:00.000
86,87,2019-04-19 21:30:00,0,2.7,0,0,27.1,145,70,38.4,2019-04-19 17:30:00.000
87,88,2019-04-19 21:45:00,0,2.8,0,0,27.2,148,68,27.7,2019-04-19 17:45:00.000
88,89,2019-04-19 22:00:00,0,2.8,0,0,27.3,152,66,35.1,2019-04-19 18:00:00.000
89,90,2019-04-19 22:15:00,0,2.9,0,0,27.4,155,62,39.3,2019-04-19 18:15:00.000
90,91,2019-04-19 22:30:00,0,3.0,0,0,27.5,158,58,38.5,2019-04-19 18:30:00.000
91,92,2019-04-19 22:45:00,0,3.0,0,0,27.6,161,52,37.0,2019-04-19 18:45:00.000
92,93,2019-04-19 23:00:00,0,3.1,0,0,27.7,164,44,37.0,2019-04-19 19:00:00.000
93,94,2019-04-19 23:15:00,0,3.0,0,0,27.7,166,33,0.0,2019-04-19 19:15:00.000
94,95,2019-04-19 23:30:00,0,3.0,0,0,27.6,168,18,0.0,2019-04-19 19:30:00.000
95,96,2019-04-19 23:45:00,0,2.9,0,0,27.6,169,0,0.0,2019-04-19 19:45:00.000
