,BLOCK_ID,DATA_DATETIME,GHI,WIND_SPEED,DNI,DHI,TEMPERATURE,ZENITH,AZIMUTH,CLOUD_OPACITY,ENTRY_TIME
0,1,2021-07-25 00:00:00,0,1.1,0,0,22.6,159,-5,84.2,2021-07-24 20:00:00.000
1,2,2021-07-25 00:15:00,0,1.0,0,0,22.6,158,-15,85.7,2021-07-24 20:15:00.000
2,3,2021-07-25 00:30:00,0,1.0,0,0,22.7,157,-24,85.0,2021-07-24 20:30:00.000
3,4,2021-07-25 00:45:00,0,1.0,0,0,22.7,156,-31,81.9,2021-07-24 20:45:00.000
4,5,2021-07-25 01:00:00,0,1.0,0,0,22.7,153,-38,75.2,2021-07-24 21:00:00.000
5,6,2021-07-25 01:15:00,0,1.0,0,0,22.7,151,-43,56.6,2021-07-24 21:15:00.000
6,7,2021-07-25 01:30:00,0,1.0,0,0,22.7,148,-48,43.8,2021-07-24 21:30:00.000
7,8,2021-07-25 01:45:00,0,0.9,0,0,22.7,145,-52,67.9,2021-07-24 21:45:00.000
8,9,2021-07-25 02:00:00,0,0.9,0,0,22.7,142,-55,78.8,2021-07-24 22:00:00.000
9,10,2021-07-25 02:15:00,0,1.0,0,0,22.7,139,-57,86.3,2021-07-24 22:15:00.000
10,11,2021-07-25 02:30:00,0,1.0,0,0,22.7,136,-60,93.6,2021-07-24 22:30:00.000
11,12,2021-07-25 02:45:00,0,1.0,0,0,22.6,133,-61,91.9,2021-07-24 22:45:00.000
12,13,2021-07-25 03:00:00,0,1.1,0,0,22.6,130,-63,93.6,2021-07-24 23:00:00.000
13,14,2021-07-25 03:15:00,0,1.0,0,0,22.6,126,-64,61.5,2021-07-24 23:15:00.000
14,15,2021-07-25 03:30:00,0,1.0,0,0,22.6,123,-65,56.0,2021-07-24 23:30:00.000
15,16,2021-07-25 03:45:00,0,1.0,0,0,22.6,119,-66,61.9,2021-07-24 23:45:00.000
16,17,2021-07-25 04:00:00,0,1.0,0,0,22.6,116,-67,67.2,2021-07-25 00:00:00.000
17,18,2021-07-25 04:15:00,0,0.9,0,0,22.6,112,-68,68.7,2021-07-25 00:15:00.000
18,19,2021-07-25 04:30:00,0,0.9,0,0,22.7,109,-68,66.4,2021-07-25 00:30:00.000
19,20,2021-07-25 04:45:00,0,0.8,0,0,22.7,105,-69,64.1,2021-07-25 00:45:00.000
20,21,2021-07-25 05:00:00,0,0.8,0,0,22.7,102,-69,66.0,2021-07-25 01:00:00.000
21,22,2021-07-25 05:15:00,0,0.8,0,0,22.7,98,-70,63.0,2021-07-25 01:15:00.000
22,23,2021-07-25 05:30:00,0,0.8,0,0,22.8,95,-70,49.8,2021-07-25 01:30:00.000
23,24,2021-07-25 05:45:00,0,0.8,0,0,22.8,91,-70,66.3,2021-07-25 01:45:00.000
24,25,2021-07-25 06:00:00,8,0.8,0,8,22.8,88,-70,52.0,2021-07-25 02:00:00.000
25,26,2021-07-25 06:15:00,48,0.9,117,36,22.9,84,-70,7.1,2021-07-25 02:15:00.000
26,27,2021-07-25 06:30:00,92,0.9,231,55,23.0,81,-70,5.8,2021-07-25 02:30:00.000
27,28,2021-07-25 06:45:00,122,1.0,99,100,23.1,77,-70,18.7,2021-07-25 02:45:00.000
28,29,2021-07-25 07:00:00,175,1.0,202,118,23.2,74,-69,14.8,2021-07-25 03:00:00.000
29,30,2021-07-25 07:15:00,241,1.1,368,116,23.3,70,-69,8.1,2021-07-25 03:15:00.000
30,31,2021-07-25 07:30:00,294,1.2,414,132,23.5,67,-68,7.6,2021-07-25 03:30:00.000
31,32,2021-07-25 07:45:00,375,1.3,629,93,23.7,63,-68,0.0,2021-07-25 03:45:00.000
32,33,2021-07-25 08:00:00,430,1.4,660,99,23.9,60,-67,0.0,2021-07-25 04:00:00.000
33,34,2021-07-25 08:15:00,413,1.5,331,231,24.5,56,-66,14.6,2021-07-25 04:15:00.000
34,35,2021-07-25 08:30:00,416,1.7,190,302,25.1,53,-65,22.4,2021-07-25 04:30:00.000
35,36,2021-07-25 08:45:00,475,1.8,272,298,25.7,50,-64,19.1,2021-07-25 04:45:00.000
36,37,2021-07-25 09:00:00,621,2.0,693,142,26.2,46,-62,2.0,2021-07-25 05:00:00.000
37,38,2021-07-25 09:15:00,647,2.2,631,186,26.8,43,-61,4.6,2021-07-25 05:15:00.000
38,39,2021-07-25 09:30:00,711,2.4,739,142,27.4,40,-59,1.2,2021-07-25 05:30:00.000
39,40,2021-07-25 09:45:00,745,2.6,741,151,27.9,37,-56,1.5,2021-07-25 05:45:00.000
40,41,2021-07-25 10:00:00,738,2.8,605,235,28.4,34,-53,6.6,2021-07-25 06:00:00.000
41,42,2021-07-25 10:15:00,780,3.0,656,216,28.6,31,-49,5.0,2021-07-25 06:15:00.000
42,43,2021-07-25 10:30:00,804,3.1,661,220,28.8,28,-45,5.0,2021-07-25 06:30:00.000
43,44,2021-07-25 10:45:00,795,3.3,570,280,29.0,25,-39,8.5,2021-07-25 06:45:00.000
44,45,2021-07-25 11:00:00,815,3.3,585,278,29.2,23,-32,8.0,2021-07-25 07:00:00.000
45,46,2021-07-25 11:15:00,754,3.3,382,398,29.3,21,-24,16.2,2021-07-25 07:15:00.000
46,47,2021-07-25 11:30:00,843,3.3,612,269,29.4,20,-15,7.2,2021-07-25 07:30:00.000
47,48,2021-07-25 11:45:00,867,3.2,673,232,29.6,19,-5,5.0,2021-07-25 07:45:00.000
48,49,2021-07-25 12:00:00,860,3.2,651,246,29.7,20,6,5.8,2021-07-25 08:00:00.000
49,50,2021-07-25 12:15:00,895,3.2,777,165,29.6,20,16,1.5,2021-07-25 08:15:00.000
50,51,2021-07-25 12:30:00,812,3.3,542,307,29.6,22,25,9.8,2021-07-25 08:30:00.000
51,52,2021-07-25 12:45:00,803,3.3,550,298,29.6,23,33,9.4,2021-07-25 08:45:00.000
52,53,2021-07-25 13:00:00,854,3.3,768,162,29.6,26,40,1.6,2021-07-25 09:00:00.000
53,54,2021-07-25 13:15:00,847,3.2,810,132,29.5,28,45,0.0,2021-07-25 09:15:00.000
54,55,2021-07-25 13:30:00,820,3.1,803,130,29.4,31,49,0.0,2021-07-25 09:30:00.000
55,56,2021-07-25 13:45:00,789,3.1,793,130,29.3,34,53,0.0,2021-07-25 09:45:00.000
56,57,2021-07-25 14:00:00,755,3.0,781,129,29.2,37,56,0.0,2021-07-25 10:00:00.000
57,58,2021-07-25 14:15:00,716,2.9,767,128,29.0,40,59,0.0,2021-07-25 10:15:00.000
58,59,2021-07-25 14:30:00,616,2.8,518,237,28.7,43,61,8.8,2021-07-25 10:30:00.000
59,60,2021-07-25 14:45:00,397,2.7,17,385,28.5,46,63,37.2,2021-07-25 10:45:00.000
60,61,2021-07-25 15:00:00,360,2.6,0,360,28.2,50,64,38.2,2021-07-25 11:00:00.000
61,62,2021-07-25 15:15:00,278,2.5,0,278,28.1,53,65,48.1,2021-07-25 11:15:00.000
62,63,2021-07-25 15:30:00,208,2.4,0,208,27.9,57,66,56.8,2021-07-25 11:30:00.000
63,64,2021-07-25 15:45:00,115,2.3,0,115,27.7,60,67,73.2,2021-07-25 11:45:00.000
64,65,2021-07-25 16:00:00,81,2.2,0,81,27.5,64,68,78.2,2021-07-25 12:00:00.000
65,66,2021-07-25 16:15:00,234,2.1,74,205,27.3,67,69,25.6,2021-07-25 12:15:00.000
66,67,2021-07-25 16:30:00,196,2.1,79,169,27.0,71,69,23.8,2021-07-25 12:30:00.000
67,68,2021-07-25 16:45:00,67,2.0,0,67,26.8,74,69,65.6,2021-07-25 12:45:00.000
68,69,2021-07-25 17:00:00,66,1.9,0,66,26.5,78,70,54.8,2021-07-25 13:00:00.000
69,70,2021-07-25 17:15:00,78,1.8,62,68,26.0,81,70,16.5,2021-07-25 13:15:00.000
70,71,2021-07-25 17:30:00,42,1.8,39,38,25.4,85,70,12.2,2021-07-25 13:30:00.000
71,72,2021-07-25 17:45:00,11,1.7,0,11,24.9,88,70,20.9,2021-07-25 13:45:00.000
72,73,2021-07-25 18:00:00,0,1.7,0,0,24.5,92,70,19.8,2021-07-25 14:00:00.000
73,74,2021-07-25 18:15:00,0,1.6,0,0,24.3,95,70,29.3,2021-07-25 14:15:00.000
74,75,2021-07-25 18:30:00,0,1.6,0,0,24.1,99,70,32.0,2021-07-25 14:30:00.000
75,76,2021-07-25 18:45:00,0,1.6,0,0,23.9,102,69,31.6,2021-07-25 14:45:00.000
76,77,2021-07-25 19:00:00,0,1.6,0,0,23.7,106,69,30.9,2021-07-25 15:00:00.000
77,78,2021-07-25 19:15:00,0,1.7,0,0,23.7,109,69,50.8,2021-07-25 15:15:00.000
78,79,2021-07-25 19:30:00,0,1.7,0,0,23.6,113,68,20.0,2021-07-25 15:30:00.000
79,80,2021-07-25 19:45:00,0,1.7,0,0,23.6,116,67,79.4,2021-07-25 15:45:00.000
80,81,2021-07-25 20:00:00,0,1.7,0,0,23.5,120,67,67.6,2021-07-25 16:00:00.000
81,82,2021-07-25 20:15:00,0,1.7,0,0,23.5,123,66,55.6,2021-07-25 16:15:00.000
82,83,2021-07-25 20:30:00,0,1.6,0,0,23.4,126,64,47.6,2021-07-25 16:30:00.000
83,84,2021-07-25 20:45:00,0,1.6,0,0,23.3,130,63,48.2,2021-07-25 16:45:00.000
84,85,2021-07-25 21:00:00,0,1.6,0,0,23.3,133,61,38.4,2021-07-25 17:00:00.000
85,86,2021-07-25 21:15:00,0,1.6,0,0,23.2,136,60,29.9,2021-07-25 17:15:00.000
86,87,2021-07-25 21:30:00,0,1.6,0,0,23.2,140,57,14.8,2021-07-25 17:30:00.000
87,88,2021-07-25 21:45:00,0,1.5,0,0,23.2,143,55,12.0,2021-07-25 17:45:00.000
88,89,2021-07-25 22:00:00,0,1.5,0,0,23.1,146,52,12.8,2021-07-25 18:00:00.000
89,90,2021-07-25 22:15:00,0,1.5,0,0,23.1,149,48,16.8,2021-07-25 18:15:00.000
90,91,2021-07-25 22:30:00,0,1.6,0,0,23.0,151,43,30.4,2021-07-25 18:30:00.000
91,92,2021-07-25 22:45:00,0,1.6,0,0,23.0,154,38,33.7,2021-07-25 18:45:00.000
92,93,2021-07-25 23:00:00,0,1.6,0,0,23.0,156,31,36.8,2021-07-25 19:00:00.000
93,94,2021-07-25 23:15:00,0,1.6,0,0,23.0,158,23,31.5,2021-07-25 19:15:00.000
94,95,2021-07-25 23:30:00,0,1.5,0,0,22.9,159,14,17.0,2021-07-25 19:30:00.000
95,96,2021-07-25 23:45:00,0,1.5,0,0,22.9,159,5,15.7,2021-07-25 19:45:00.000
