,BLOCK_ID,DATA_DATETIME,GHI,WIND_SPEED,DNI,DHI,TEMPERATURE,ZENITH,AZIMUTH,CLOUD_OPACITY,ENTRY_TIME
0,1,2019-05-28 00:00:00,0,3.9,0,0,27.3,158,-11,0.0,2019-05-27 20:00:00.000
1,2,2019-05-28 00:15:00,0,3.9,0,0,27.3,157,-20,0.0,2019-05-27 20:15:00.000
2,3,2019-05-28 00:30:00,0,3.9,0,0,27.2,155,-27,0.0,2019-05-27 20:30:00.000
3,4,2019-05-28 00:45:00,0,4.0,0,0,27.2,153,-34,0.0,2019-05-27 20:45:00.000
4,5,2019-05-28 01:00:00,0,4.0,0,0,27.2,151,-40,0.0,2019-05-27 21:00:00.000
5,6,2019-05-28 01:15:00,0,4.1,0,0,27.2,149,-45,0.0,2019-05-27 21:15:00.000
6,7,2019-05-28 01:30:00,0,4.1,0,0,27.1,146,-49,0.0,2019-05-27 21:30:00.000
7,8,2019-05-28 01:45:00,0,4.1,0,0,27.1,143,-52,0.0,2019-05-27 21:45:00.000
8,9,2019-05-28 02:00:00,0,4.2,0,0,27.1,140,-55,0.0,2019-05-27 22:00:00.000
9,10,2019-05-28 02:15:00,0,4.2,0,0,27.1,137,-57,0.0,2019-05-27 22:15:00.000
10,11,2019-05-28 02:30:00,0,4.2,0,0,27.1,134,-59,0.0,2019-05-27 22:30:00.000
11,12,2019-05-28 02:45:00,0,4.2,0,0,27.1,130,-61,0.0,2019-05-27 22:45:00.000
12,13,2019-05-28 03:00:00,0,4.2,0,0,27.1,127,-63,0.0,2019-05-27 23:00:00.000
13,14,2019-05-28 03:15:00,0,4.2,0,0,27.1,124,-64,0.0,2019-05-27 23:15:00.000
14,15,2019-05-28 03:30:00,0,4.2,0,0,27.1,120,-65,0.0,2019-05-27 23:30:00.000
15,16,2019-05-28 03:45:00,0,4.2,0,0,27.1,117,-66,0.0,2019-05-27 23:45:00.000
16,17,2019-05-28 04:00:00,0,4.2,0,0,27.1,114,-67,0.0,2019-05-28 00:00:00.000
17,18,2019-05-28 04:15:00,0,4.2,0,0,27.1,110,-67,0.0,2019-05-28 00:15:00.000
18,19,2019-05-28 04:30:00,0,4.2,0,0,27.1,107,-68,0.0,2019-05-28 00:30:00.000
19,20,2019-05-28 04:45:00,0,4.2,0,0,27.1,103,-68,0.0,2019-05-28 00:45:00.000
20,21,2019-05-28 05:00:00,0,4.2,0,0,27.1,100,-68,0.0,2019-05-28 01:00:00.000
21,22,2019-05-28 05:15:00,0,4.1,0,0,27.2,96,-69,0.0,2019-05-28 01:15:00.000
22,23,2019-05-28 05:30:00,0,4.1,0,0,27.2,93,-69,0.0,2019-05-28 01:30:00.000
23,24,2019-05-28 05:45:00,6,4.0,17,5,27.3,89,-69,0.0,2019-05-28 01:45:00.000
24,25,2019-05-28 06:00:00,38,3.9,172,23,27.4,86,-69,0.0,2019-05-28 02:00:00.000
25,26,2019-05-28 06:15:00,66,3.8,47,60,27.4,82,-69,18.5,2019-05-28 02:15:00.000
26,27,2019-05-28 06:30:00,111,3.8,131,84,27.5,79,-69,16.7,2019-05-28 02:30:00.000
27,28,2019-05-28 06:45:00,166,3.7,268,98,27.5,75,-68,11.2,2019-05-28 02:45:00.000
28,29,2019-05-28 07:00:00,217,3.6,314,118,27.6,72,-68,11.0,2019-05-28 03:00:00.000
29,30,2019-05-28 07:15:00,267,3.6,346,138,27.6,68,-67,11.2,2019-05-28 03:15:00.000
30,31,2019-05-28 07:30:00,329,3.5,449,137,27.7,65,-67,7.8,2019-05-28 03:30:00.000
31,32,2019-05-28 07:45:00,410,3.4,651,97,27.8,61,-66,0.7,2019-05-28 03:45:00.000
32,33,2019-05-28 08:00:00,467,3.4,697,97,27.8,58,-65,0.0,2019-05-28 04:00:00.000
33,34,2019-05-28 08:15:00,519,3.4,720,102,27.8,55,-64,0.0,2019-05-28 04:15:00.000
34,35,2019-05-28 08:30:00,570,3.4,740,106,27.8,51,-63,0.0,2019-05-28 04:30:00.000
35,36,2019-05-28 08:45:00,618,3.4,757,110,27.7,48,-62,0.0,2019-05-28 04:45:00.000
36,37,2019-05-28 09:00:00,663,3.4,772,114,27.7,45,-60,0.0,2019-05-28 05:00:00.000
37,38,2019-05-28 09:15:00,705,3.3,784,117,27.7,41,-58,0.0,2019-05-28 05:15:00.000
38,39,2019-05-28 09:30:00,744,3.3,795,120,27.7,38,-55,0.0,2019-05-28 05:30:00.000
39,40,2019-05-28 09:45:00,779,3.3,804,123,27.7,35,-52,0.0,2019-05-28 05:45:00.000
40,41,2019-05-28 10:00:00,810,3.3,812,125,27.7,32,-49,0.0,2019-05-28 06:00:00.000
41,42,2019-05-28 10:15:00,838,3.3,819,126,27.6,30,-45,0.0,2019-05-28 06:15:00.000
42,43,2019-05-28 10:30:00,861,3.3,821,130,27.6,27,-40,0.0,2019-05-28 06:30:00.000
43,44,2019-05-28 10:45:00,878,3.3,816,138,27.6,25,-33,0.0,2019-05-28 06:45:00.000
44,45,2019-05-28 11:00:00,891,3.3,810,145,27.6,23,-26,0.0,2019-05-28 07:00:00.000
45,46,2019-05-28 11:15:00,885,3.2,758,181,27.6,22,-18,1.5,2019-05-28 07:15:00.000
46,47,2019-05-28 11:30:00,837,3.2,587,289,27.7,21,-8,7.3,2019-05-28 07:30:00.000
47,48,2019-05-28 11:45:00,850,3.1,624,266,27.7,21,2,6.0,2019-05-28 07:45:00.000
48,49,2019-05-28 12:00:00,821,3.1,545,312,27.8,21,11,9.0,2019-05-28 08:00:00.000
49,50,2019-05-28 12:15:00,779,3.0,440,371,27.8,22,20,12.9,2019-05-28 08:15:00.000
50,51,2019-05-28 12:30:00,773,3.0,452,359,27.9,24,29,12.4,2019-05-28 08:30:00.000
51,52,2019-05-28 12:45:00,744,2.9,407,377,27.9,26,35,14.1,2019-05-28 08:45:00.000
52,53,2019-05-28 13:00:00,683,2.9,287,429,27.9,28,41,19.3,2019-05-28 09:00:00.000
53,54,2019-05-28 13:15:00,612,2.8,159,475,28.0,31,46,25.5,2019-05-28 09:15:00.000
54,55,2019-05-28 13:30:00,568,2.8,104,481,28.0,33,50,28.4,2019-05-28 09:30:00.000
55,56,2019-05-28 13:45:00,461,2.7,0,461,28.1,36,53,39.4,2019-05-28 09:45:00.000
56,57,2019-05-28 14:00:00,408,2.7,0,408,28.1,39,56,43.6,2019-05-28 10:00:00.000
57,58,2019-05-28 14:15:00,282,2.7,0,282,28.1,42,58,58.6,2019-05-28 10:15:00.000
58,59,2019-05-28 14:30:00,310,2.8,0,310,28.1,46,60,51.6,2019-05-28 10:30:00.000
59,60,2019-05-28 14:45:00,298,2.9,0,298,28.1,49,62,50.0,2019-05-28 10:45:00.000
60,61,2019-05-28 15:00:00,279,2.9,0,279,28.1,52,63,48.7,2019-05-28 11:00:00.000
61,62,2019-05-28 15:15:00,364,3.0,96,309,28.1,56,64,26.5,2019-05-28 11:15:00.000
62,63,2019-05-28 15:30:00,323,3.0,78,283,28.2,59,65,26.9,2019-05-28 11:30:00.000
63,64,2019-05-28 15:45:00,213,3.1,0,213,28.2,63,66,45.6,2019-05-28 11:45:00.000
64,65,2019-05-28 16:00:00,131,3.1,0,131,28.2,66,67,60.3,2019-05-28 12:00:00.000
65,66,2019-05-28 16:15:00,153,3.2,0,153,28.2,69,68,44.7,2019-05-28 12:15:00.000
66,67,2019-05-28 16:30:00,124,3.2,0,124,28.2,73,68,43.2,2019-05-28 12:30:00.000
67,68,2019-05-28 16:45:00,83,3.3,0,83,28.2,76,68,49.2,2019-05-28 12:45:00.000
68,69,2019-05-28 17:00:00,50,3.4,0,50,28.2,80,69,55.2,2019-05-28 13:00:00.000
69,70,2019-05-28 17:15:00,15,3.5,0,15,28.1,83,69,73.5,2019-05-28 13:15:00.000
70,71,2019-05-28 17:30:00,19,3.6,23,17,28.1,87,69,14.7,2019-05-28 13:30:00.000
71,72,2019-05-28 17:45:00,1,3.7,1,1,28.0,90,69,0.0,2019-05-28 13:45:00.000
72,73,2019-05-28 18:00:00,0,3.8,0,0,27.9,94,69,0.0,2019-05-28 14:00:00.000
73,74,2019-05-28 18:15:00,0,3.9,0,0,27.9,97,68,0.0,2019-05-28 14:15:00.000
74,75,2019-05-28 18:30:00,0,4.0,0,0,27.8,101,68,0.0,2019-05-28 14:30:00.000
75,76,2019-05-28 18:45:00,0,4.1,0,0,27.7,104,68,5.4,2019-05-28 14:45:00.000
76,77,2019-05-28 19:00:00,0,4.2,0,0,27.7,108,67,18.0,2019-05-28 15:00:00.000
77,78,2019-05-28 19:15:00,0,4.3,0,0,27.6,111,67,27.6,2019-05-28 15:15:00.000
78,79,2019-05-28 19:30:00,0,4.4,0,0,27.6,115,66,19.8,2019-05-28 15:30:00.000
79,80,2019-05-28 19:45:00,0,4.5,0,0,27.5,118,65,19.7,2019-05-28 15:45:00.000
80,81,2019-05-28 20:00:00,0,4.6,0,0,27.5,121,64,3.9,2019-05-28 16:00:00.000
81,82,2019-05-28 20:15:00,0,4.6,0,0,27.5,125,63,0.0,2019-05-28 16:15:00.000
82,83,2019-05-28 20:30:00,0,4.7,0,0,27.5,128,62,0.0,2019-05-28 16:30:00.000
83,84,2019-05-28 20:45:00,0,4.7,0,0,27.6,131,60,0.0,2019-05-28 16:45:00.000
84,85,2019-05-28 21:00:00,0,4.7,0,0,27.6,135,59,0.0,2019-05-28 17:00:00.000
85,86,2019-05-28 21:15:00,0,4.7,0,0,27.7,138,56,0.0,2019-05-28 17:15:00.000
86,87,2019-05-28 21:30:00,0,4.7,0,0,27.7,141,54,0.0,2019-05-28 17:30:00.000
87,88,2019-05-28 21:45:00,0,4.8,0,0,27.7,144,51,0.0,2019-05-28 17:45:00.000
88,89,2019-05-28 22:00:00,0,4.8,0,0,27.8,147,47,0.0,2019-05-28 18:00:00.000
89,90,2019-05-28 22:15:00,0,4.8,0,0,27.8,149,43,0.0,2019-05-28 18:15:00.000
90,91,2019-05-28 22:30:00,0,4.8,0,0,27.8,152,38,0.0,2019-05-28 18:30:00.000
91,92,2019-05-28 22:45:00,0,4.8,0,0,27.9,154,32,0.0,2019-05-28 18:45:00.000
92,93,2019-05-28 23:00:00,0,4.9,0,0,27.9,156,25,0.0,2019-05-28 19:00:00.000
93,94,2019-05-28 23:15:00,0,4.9,0,0,27.9,157,17,0.0,2019-05-28 19:15:00.000
94,95,2019-05-28 23:30:00,0,4.9,0,0,27.8,158,8,0.0,2019-05-28 19:30:00.000
95,96,2019-05-28 23:45:00,0,4.9,0,0,27.8,158,-2,0.0,2019-05-28 19:45:00.000
