,BLOCK_ID,DATA_DATETIME,GHI,WIND_SPEED,DNI,DHI,TEMPERATURE,ZENITH,AZIMUTH,CLOUD_OPACITY,ENTRY_TIME
0,1,2020-11-09 00:00:00,0,0.2,0,0,22.7,162,-155,42.0,2020-11-08 20:00:00.000
1,2,2020-11-09 00:15:00,0,0.1,0,0,22.6,161,-146,46.6,2020-11-08 20:15:00.000
2,3,2020-11-09 00:30:00,0,0.0,0,0,22.5,158,-138,49.6,2020-11-08 20:30:00.000
3,4,2020-11-09 00:45:00,0,0.1,0,0,22.5,156,-132,59.2,2020-11-08 20:45:00.000
4,5,2020-11-09 01:00:00,0,0.1,0,0,22.4,153,-127,64.2,2020-11-08 21:00:00.000
5,6,2020-11-09 01:15:00,0,0.2,0,0,22.4,150,-123,38.9,2020-11-08 21:15:00.000
6,7,2020-11-09 01:30:00,0,0.2,0,0,22.3,146,-120,22.2,2020-11-08 21:30:00.000
7,8,2020-11-09 01:45:00,0,0.3,0,0,22.3,143,-117,48.9,2020-11-08 21:45:00.000
8,9,2020-11-09 02:00:00,0,0.4,0,0,22.2,140,-115,61.2,2020-11-08 22:00:00.000
9,10,2020-11-09 02:15:00,0,0.4,0,0,22.2,136,-114,59.8,2020-11-08 22:15:00.000
10,11,2020-11-09 02:30:00,0,0.4,0,0,22.1,133,-112,58.6,2020-11-08 22:30:00.000
11,12,2020-11-09 02:45:00,0,0.4,0,0,22.1,129,-111,63.4,2020-11-08 22:45:00.000
12,13,2020-11-09 03:00:00,0,0.5,0,0,22.1,126,-110,45.4,2020-11-08 23:00:00.000
13,14,2020-11-09 03:15:00,0,0.6,0,0,22.1,122,-109,41.6,2020-11-08 23:15:00.000
14,15,2020-11-09 03:30:00,0,0.6,0,0,22.0,119,-109,43.0,2020-11-08 23:30:00.000
15,16,2020-11-09 03:45:00,0,0.7,0,0,22.0,115,-108,44.2,2020-11-08 23:45:00.000
16,17,2020-11-09 04:00:00,0,0.8,0,0,22.0,112,-108,53.9,2020-11-09 00:00:00.000
17,18,2020-11-09 04:15:00,0,0.8,0,0,21.9,108,-107,61.9,2020-11-09 00:15:00.000
18,19,2020-11-09 04:30:00,0,0.8,0,0,21.9,104,-107,47.4,2020-11-09 00:30:00.000
19,20,2020-11-09 04:45:00,0,0.8,0,0,21.8,101,-107,43.2,2020-11-09 00:45:00.000
20,21,2020-11-09 05:00:00,0,0.8,0,0,21.8,97,-107,33.7,2020-11-09 01:00:00.000
21,22,2020-11-09 05:15:00,0,0.8,0,0,21.9,94,-107,40.0,2020-11-09 01:15:00.000
22,23,2020-11-09 05:30:00,1,0.8,0,1,21.9,90,-107,29.0,2020-11-09 01:30:00.000
23,24,2020-11-09 05:45:00,22,0.8,0,22,22.0,87,-107,27.9,2020-11-09 01:45:00.000
24,25,2020-11-09 06:00:00,67,0.8,144,48,22.2,83,-107,11.0,2020-11-09 02:00:00.000
25,26,2020-11-09 06:15:00,125,0.9,374,56,22.7,79,-107,1.5,2020-11-09 02:15:00.000
26,27,2020-11-09 06:30:00,175,1.0,368,84,23.2,76,-107,5.8,2020-11-09 02:30:00.000
27,28,2020-11-09 06:45:00,237,1.1,473,91,23.8,72,-108,3.7,2020-11-09 02:45:00.000
28,29,2020-11-09 07:00:00,305,1.2,600,86,24.4,69,-108,0.6,2020-11-09 03:00:00.000
29,30,2020-11-09 07:15:00,363,1.3,627,100,25.1,65,-109,1.2,2020-11-09 03:15:00.000
30,31,2020-11-09 07:30:00,391,1.4,467,168,25.8,61,-109,8.8,2020-11-09 03:30:00.000
31,32,2020-11-09 07:45:00,445,1.5,492,183,26.4,58,-110,8.8,2020-11-09 03:45:00.000
32,33,2020-11-09 08:00:00,508,1.7,564,181,27.0,54,-111,6.8,2020-11-09 04:00:00.000
33,34,2020-11-09 08:15:00,600,1.9,777,112,27.4,51,-112,0.0,2020-11-09 04:15:00.000
34,35,2020-11-09 08:30:00,653,2.2,796,116,27.7,48,-113,0.0,2020-11-09 04:30:00.000
35,36,2020-11-09 08:45:00,696,2.5,785,133,28.0,44,-115,0.9,2020-11-09 04:45:00.000
36,37,2020-11-09 09:00:00,720,2.7,710,182,28.3,41,-117,3.8,2020-11-09 05:00:00.000
37,38,2020-11-09 09:15:00,769,2.9,752,171,28.5,37,-119,2.8,2020-11-09 05:15:00.000
38,39,2020-11-09 09:30:00,830,3.0,848,129,28.8,34,-122,0.0,2020-11-09 05:30:00.000
39,40,2020-11-09 09:45:00,864,3.1,856,131,29.0,31,-125,0.0,2020-11-09 05:45:00.000
40,41,2020-11-09 10:00:00,895,3.2,863,134,29.2,28,-129,0.0,2020-11-09 06:00:00.000
41,42,2020-11-09 10:15:00,921,3.3,869,136,29.4,25,-134,0.0,2020-11-09 06:15:00.000
42,43,2020-11-09 10:30:00,942,3.4,871,139,29.5,23,-140,0.0,2020-11-09 06:30:00.000
43,44,2020-11-09 10:45:00,957,3.5,867,146,29.7,21,-148,0.0,2020-11-09 06:45:00.000
44,45,2020-11-09 11:00:00,968,3.5,862,153,29.8,19,-157,0.0,2020-11-09 07:00:00.000
45,46,2020-11-09 11:15:00,974,3.5,855,159,29.8,18,-168,0.0,2020-11-09 07:15:00.000
46,47,2020-11-09 11:30:00,975,3.5,849,164,29.9,17,180,0.0,2020-11-09 07:30:00.000
47,48,2020-11-09 11:45:00,972,3.5,846,167,30.0,18,168,0.0,2020-11-09 07:45:00.000
48,49,2020-11-09 12:00:00,965,3.5,842,168,30.0,19,157,0.0,2020-11-09 08:00:00.000
49,50,2020-11-09 12:15:00,952,3.4,836,169,30.0,21,148,0.0,2020-11-09 08:15:00.000
50,51,2020-11-09 12:30:00,935,3.4,830,170,29.9,23,140,0.0,2020-11-09 08:30:00.000
51,52,2020-11-09 12:45:00,913,3.3,822,170,29.9,25,134,0.0,2020-11-09 08:45:00.000
52,53,2020-11-09 13:00:00,886,3.3,813,170,29.9,28,129,0.0,2020-11-09 09:00:00.000
53,54,2020-11-09 13:15:00,856,3.1,802,169,29.8,31,125,0.0,2020-11-09 09:15:00.000
54,55,2020-11-09 13:30:00,822,3.0,797,164,29.8,34,122,0.0,2020-11-09 09:30:00.000
55,56,2020-11-09 13:45:00,787,2.9,806,148,29.8,38,119,0.0,2020-11-09 09:45:00.000
56,57,2020-11-09 14:00:00,749,2.7,817,131,29.8,41,117,0.0,2020-11-09 10:00:00.000
57,58,2020-11-09 14:15:00,707,2.6,828,114,29.7,44,115,0.0,2020-11-09 10:15:00.000
58,59,2020-11-09 14:30:00,660,2.6,831,101,29.6,48,114,0.0,2020-11-09 10:30:00.000
59,60,2020-11-09 14:45:00,608,2.5,815,97,29.6,51,112,0.0,2020-11-09 10:45:00.000
60,61,2020-11-09 15:00:00,553,2.4,793,93,29.5,55,111,0.0,2020-11-09 11:00:00.000
61,62,2020-11-09 15:15:00,495,2.4,767,90,29.2,58,110,0.0,2020-11-09 11:15:00.000
62,63,2020-11-09 15:30:00,435,2.4,737,85,28.9,62,109,0.0,2020-11-09 11:30:00.000
63,64,2020-11-09 15:45:00,374,2.4,700,80,28.7,65,109,0.0,2020-11-09 11:45:00.000
64,65,2020-11-09 16:00:00,312,2.3,656,74,28.4,69,108,0.0,2020-11-09 12:00:00.000
65,66,2020-11-09 16:15:00,250,2.2,601,67,27.9,72,108,0.0,2020-11-09 12:15:00.000
66,67,2020-11-09 16:30:00,189,2.0,531,59,27.4,76,107,0.0,2020-11-09 12:30:00.000
67,68,2020-11-09 16:45:00,130,1.9,441,48,26.9,79,107,0.0,2020-11-09 12:45:00.000
68,69,2020-11-09 17:00:00,70,1.8,208,44,26.4,83,107,7.2,2020-11-09 13:00:00.000
69,70,2020-11-09 17:15:00,27,1.7,37,24,25.8,87,107,8.4,2020-11-09 13:15:00.000
70,71,2020-11-09 17:30:00,3,1.7,6,2,25.2,90,107,12.0,2020-11-09 13:30:00.000
71,72,2020-11-09 17:45:00,0,1.7,0,0,24.6,94,107,15.0,2020-11-09 13:45:00.000
72,73,2020-11-09 18:00:00,0,1.6,0,0,24.1,97,107,14.2,2020-11-09 14:00:00.000
73,74,2020-11-09 18:15:00,0,1.6,0,0,24.0,101,107,14.3,2020-11-09 14:15:00.000
74,75,2020-11-09 18:30:00,0,1.5,0,0,23.8,105,107,15.8,2020-11-09 14:30:00.000
75,76,2020-11-09 18:45:00,0,1.5,0,0,23.7,108,107,18.3,2020-11-09 14:45:00.000
76,77,2020-11-09 19:00:00,0,1.4,0,0,23.6,112,108,3.8,2020-11-09 15:00:00.000
77,78,2020-11-09 19:15:00,0,1.3,0,0,23.6,115,108,16.0,2020-11-09 15:15:00.000
78,79,2020-11-09 19:30:00,0,1.2,0,0,23.5,119,109,17.6,2020-11-09 15:30:00.000
79,80,2020-11-09 19:45:00,0,1.1,0,0,23.4,122,110,18.3,2020-11-09 15:45:00.000
80,81,2020-11-09 20:00:00,0,1.0,0,0,23.4,126,110,11.8,2020-11-09 16:00:00.000
81,82,2020-11-09 20:15:00,0,1.0,0,0,23.3,129,111,11.4,2020-11-09 16:15:00.000
82,83,2020-11-09 20:30:00,0,1.0,0,0,23.3,133,113,12.4,2020-11-09 16:30:00.000
83,84,2020-11-09 20:45:00,0,1.0,0,0,23.2,136,114,13.7,2020-11-09 16:45:00.000
84,85,2020-11-09 21:00:00,0,1.1,0,0,23.1,140,116,15.4,2020-11-09 17:00:00.000
85,86,2020-11-09 21:15:00,0,1.0,0,0,23.0,143,118,14.3,2020-11-09 17:15:00.000
86,87,2020-11-09 21:30:00,0,0.9,0,0,23.0,146,120,15.8,2020-11-09 17:30:00.000
87,88,2020-11-09 21:45:00,0,0.8,0,0,22.9,150,124,15.0,2020-11-09 17:45:00.000
88,89,2020-11-09 22:00:00,0,0.7,0,0,22.8,153,127,17.4,2020-11-09 18:00:00.000
89,90,2020-11-09 22:15:00,0,0.7,0,0,22.7,155,132,24.3,2020-11-09 18:15:00.000
90,91,2020-11-09 22:30:00,0,0.6,0,0,22.7,158,139,26.6,2020-11-09 18:30:00.000
91,92,2020-11-09 22:45:00,0,0.6,0,0,22.6,160,146,26.6,2020-11-09 18:45:00.000
92,93,2020-11-09 23:00:00,0,0.5,0,0,22.5,162,156,23.6,2020-11-09 19:00:00.000
93,94,2020-11-09 23:15:00,0,0.5,0,0,22.4,163,168,21.0,2020-11-09 19:15:00.000
94,95,2020-11-09 23:30:00,0,0.5,0,0,22.4,164,-180,19.4,2020-11-09 19:30:00.000
95,96,2020-11-09 23:45:00,0,0.4,0,0,22.3,163,-167,23.0,2020-11-09 19:45:00.000
