,BLOCK_ID,DATA_DATETIME,GHI,WIND_SPEED,DNI,DHI,TEMPERATURE,ZENITH,AZIMUTH,CLOUD_OPACITY,ENTRY_TIME
0,1,2021-05-02 00:00:00,0,0.5,0,0,22.8,164,-15,40.6,2021-05-01 20:00:00.000
1,2,2021-05-02 00:15:00,0,0.5,0,0,22.8,163,-27,31.4,2021-05-01 20:15:00.000
2,3,2021-05-02 00:30:00,0,0.5,0,0,22.7,161,-37,23.8,2021-05-01 20:30:00.000
3,4,2021-05-02 00:45:00,0,0.5,0,0,22.7,158,-44,16.8,2021-05-01 20:45:00.000
4,5,2021-05-02 01:00:00,0,0.5,0,0,22.6,155,-50,0.0,2021-05-01 21:00:00.000
5,6,2021-05-02 01:15:00,0,0.5,0,0,22.6,152,-55,0.0,2021-05-01 21:15:00.000
6,7,2021-05-02 01:30:00,0,0.5,0,0,22.6,149,-59,0.0,2021-05-01 21:30:00.000
7,8,2021-05-02 01:45:00,0,0.5,0,0,22.6,146,-62,0.0,2021-05-01 21:45:00.000
8,9,2021-05-02 02:00:00,0,0.5,0,0,22.5,143,-64,0.0,2021-05-01 22:00:00.000
9,10,2021-05-02 02:15:00,0,0.5,0,0,22.5,139,-66,0.0,2021-05-01 22:15:00.000
10,11,2021-05-02 02:30:00,0,0.5,0,0,22.5,136,-68,0.0,2021-05-01 22:30:00.000
11,12,2021-05-02 02:45:00,0,0.4,0,0,22.5,132,-69,7.8,2021-05-01 22:45:00.000
12,13,2021-05-02 03:00:00,0,0.4,0,0,22.5,129,-70,29.2,2021-05-01 23:00:00.000
13,14,2021-05-02 03:15:00,0,0.4,0,0,22.5,125,-71,28.8,2021-05-01 23:15:00.000
14,15,2021-05-02 03:30:00,0,0.3,0,0,22.4,122,-72,25.2,2021-05-01 23:30:00.000
15,16,2021-05-02 03:45:00,0,0.3,0,0,22.4,118,-73,23.0,2021-05-01 23:45:00.000
16,17,2021-05-02 04:00:00,0,0.2,0,0,22.4,115,-73,23.0,2021-05-02 00:00:00.000
17,18,2021-05-02 04:15:00,0,0.2,0,0,22.5,111,-74,6.9,2021-05-02 00:15:00.000
18,19,2021-05-02 04:30:00,0,0.2,0,0,22.5,107,-74,23.8,2021-05-02 00:30:00.000
19,20,2021-05-02 04:45:00,0,0.2,0,0,22.5,104,-75,23.0,2021-05-02 00:45:00.000
20,21,2021-05-02 05:00:00,0,0.2,0,0,22.5,100,-75,23.0,2021-05-02 01:00:00.000
21,22,2021-05-02 05:15:00,0,0.2,0,0,22.5,97,-75,23.3,2021-05-02 01:15:00.000
22,23,2021-05-02 05:30:00,0,0.2,0,0,22.5,93,-75,41.6,2021-05-02 01:30:00.000
23,24,2021-05-02 05:45:00,4,0.2,0,4,22.5,89,-75,35.9,2021-05-02 01:45:00.000
24,25,2021-05-02 06:00:00,30,0.2,0,30,22.6,86,-75,19.2,2021-05-02 02:00:00.000
25,26,2021-05-02 06:15:00,60,0.2,0,60,22.8,82,-75,25.9,2021-05-02 02:15:00.000
26,27,2021-05-02 06:30:00,96,0.2,0,96,23.1,78,-75,28.0,2021-05-02 02:30:00.000
27,28,2021-05-02 06:45:00,146,0.2,53,133,23.3,75,-75,22.9,2021-05-02 02:45:00.000
28,29,2021-05-02 07:00:00,195,0.2,101,162,23.6,71,-75,21.8,2021-05-02 03:00:00.000
29,30,2021-05-02 07:15:00,245,0.2,146,190,24.1,68,-74,20.7,2021-05-02 03:15:00.000
30,31,2021-05-02 07:30:00,296,0.2,181,216,24.5,64,-74,20.0,2021-05-02 03:30:00.000
31,32,2021-05-02 07:45:00,391,0.2,438,172,25.0,60,-73,9.1,2021-05-02 03:45:00.000
32,33,2021-05-02 08:00:00,487,0.2,687,110,25.5,57,-73,0.0,2021-05-02 04:00:00.000
33,34,2021-05-02 08:15:00,542,0.3,714,115,25.9,53,-72,0.0,2021-05-02 04:15:00.000
34,35,2021-05-02 08:30:00,596,0.4,736,119,26.4,50,-71,0.0,2021-05-02 04:30:00.000
35,36,2021-05-02 08:45:00,646,0.5,755,123,26.8,46,-70,0.0,2021-05-02 04:45:00.000
36,37,2021-05-02 09:00:00,694,0.6,771,126,27.3,43,-68,0.0,2021-05-02 05:00:00.000
37,38,2021-05-02 09:15:00,738,0.7,785,129,27.8,39,-67,0.0,2021-05-02 05:15:00.000
38,39,2021-05-02 09:30:00,779,0.9,797,132,28.2,36,-65,0.0,2021-05-02 05:30:00.000
39,40,2021-05-02 09:45:00,816,1.0,807,135,28.7,32,-62,0.0,2021-05-02 05:45:00.000
40,41,2021-05-02 10:00:00,849,1.1,816,137,29.2,29,-59,0.0,2021-05-02 06:00:00.000
41,42,2021-05-02 10:15:00,878,1.1,822,139,29.6,26,-56,0.0,2021-05-02 06:15:00.000
42,43,2021-05-02 10:30:00,903,1.2,827,141,30.1,23,-51,0.0,2021-05-02 06:30:00.000
43,44,2021-05-02 10:45:00,922,1.3,829,144,30.6,20,-44,0.0,2021-05-02 06:45:00.000
44,45,2021-05-02 11:00:00,937,1.3,829,147,30.9,18,-36,0.0,2021-05-02 07:00:00.000
45,46,2021-05-02 11:15:00,947,1.3,829,150,31.0,16,-25,0.0,2021-05-02 07:15:00.000
46,47,2021-05-02 11:30:00,953,1.2,828,152,31.1,15,-12,0.0,2021-05-02 07:30:00.000
47,48,2021-05-02 11:45:00,955,1.1,828,152,31.1,14,2,0.0,2021-05-02 07:45:00.000
48,49,2021-05-02 12:00:00,914,1.0,708,230,31.1,15,17,4.0,2021-05-02 08:00:00.000
49,50,2021-05-02 12:15:00,736,1.0,251,495,30.7,16,29,22.0,2021-05-02 08:15:00.000
50,51,2021-05-02 12:30:00,763,0.9,339,442,30.4,18,39,18.0,2021-05-02 08:30:00.000
51,52,2021-05-02 12:45:00,820,0.8,525,330,30.0,21,46,10.3,2021-05-02 08:45:00.000
52,53,2021-05-02 13:00:00,666,0.8,190,492,29.6,24,52,25.4,2021-05-02 09:00:00.000
53,54,2021-05-02 13:15:00,335,0.9,0,335,29.2,27,57,61.3,2021-05-02 09:15:00.000
54,55,2021-05-02 13:30:00,338,0.9,0,338,28.7,30,60,59.6,2021-05-02 09:30:00.000
55,56,2021-05-02 13:45:00,354,0.9,0,354,28.3,33,63,55.8,2021-05-02 09:45:00.000
56,57,2021-05-02 14:00:00,267,0.9,0,267,27.9,37,65,65.0,2021-05-02 10:00:00.000
57,58,2021-05-02 14:15:00,335,0.9,8,329,27.7,40,67,53.1,2021-05-02 10:15:00.000
58,59,2021-05-02 14:30:00,272,0.9,5,268,27.5,44,69,59.8,2021-05-02 10:30:00.000
59,60,2021-05-02 14:45:00,163,0.8,0,163,27.4,47,70,73.9,2021-05-02 10:45:00.000
60,61,2021-05-02 15:00:00,135,0.8,0,135,27.2,51,71,76.5,2021-05-02 11:00:00.000
61,62,2021-05-02 15:15:00,50,0.8,0,50,26.9,54,72,90.5,2021-05-02 11:15:00.000
62,63,2021-05-02 15:30:00,75,0.8,0,75,26.6,58,73,83.6,2021-05-02 11:30:00.000
63,64,2021-05-02 15:45:00,61,0.8,0,61,26.3,62,73,85.3,2021-05-02 11:45:00.000
64,65,2021-05-02 16:00:00,38,0.8,0,38,26.0,65,74,89.0,2021-05-02 12:00:00.000
65,66,2021-05-02 16:15:00,46,0.9,0,46,25.7,69,74,84.2,2021-05-02 12:15:00.000
66,67,2021-05-02 16:30:00,24,0.9,0,24,25.4,72,75,89.4,2021-05-02 12:30:00.000
67,68,2021-05-02 16:45:00,16,0.9,0,16,25.1,76,75,90.7,2021-05-02 12:45:00.000
68,69,2021-05-02 17:00:00,20,0.9,0,20,24.9,80,75,82.0,2021-05-02 13:00:00.000
69,70,2021-05-02 17:15:00,26,1.0,0,26,24.6,83,75,58.2,2021-05-02 13:15:00.000
70,71,2021-05-02 17:30:00,14,1.0,0,14,24.4,87,75,45.4,2021-05-02 13:30:00.000
71,72,2021-05-02 17:45:00,0,1.0,0,0,24.2,90,75,54.5,2021-05-02 13:45:00.000
72,73,2021-05-02 18:00:00,0,1.0,0,0,24.0,94,75,86.8,2021-05-02 14:00:00.000
73,74,2021-05-02 18:15:00,0,1.0,0,0,23.9,98,75,66.4,2021-05-02 14:15:00.000
74,75,2021-05-02 18:30:00,0,1.0,0,0,23.8,101,75,67.6,2021-05-02 14:30:00.000
75,76,2021-05-02 18:45:00,0,0.9,0,0,23.7,105,74,91.0,2021-05-02 14:45:00.000
76,77,2021-05-02 19:00:00,0,0.9,0,0,23.6,109,74,82.4,2021-05-02 15:00:00.000
77,78,2021-05-02 19:15:00,0,0.9,0,0,23.5,112,74,32.1,2021-05-02 15:15:00.000
78,79,2021-05-02 19:30:00,0,0.9,0,0,23.4,116,73,17.6,2021-05-02 15:30:00.000
79,80,2021-05-02 19:45:00,0,0.9,0,0,23.3,119,72,40.9,2021-05-02 15:45:00.000
80,81,2021-05-02 20:00:00,0,0.9,0,0,23.2,123,72,42.2,2021-05-02 16:00:00.000
81,82,2021-05-02 20:15:00,0,0.9,0,0,23.1,126,71,39.5,2021-05-02 16:15:00.000
82,83,2021-05-02 20:30:00,0,0.9,0,0,23.1,130,70,31.2,2021-05-02 16:30:00.000
83,84,2021-05-02 20:45:00,0,0.9,0,0,23.0,133,68,19.8,2021-05-02 16:45:00.000
84,85,2021-05-02 21:00:00,0,0.8,0,0,22.9,137,67,37.6,2021-05-02 17:00:00.000
85,86,2021-05-02 21:15:00,0,0.8,0,0,22.9,140,65,18.0,2021-05-02 17:15:00.000
86,87,2021-05-02 21:30:00,0,0.8,0,0,22.8,144,63,18.0,2021-05-02 17:30:00.000
87,88,2021-05-02 21:45:00,0,0.8,0,0,22.8,147,60,21.5,2021-05-02 17:45:00.000
88,89,2021-05-02 22:00:00,0,0.8,0,0,22.8,150,57,18.8,2021-05-02 18:00:00.000
89,90,2021-05-02 22:15:00,0,0.8,0,0,22.8,153,53,17.4,2021-05-02 18:15:00.000
90,91,2021-05-02 22:30:00,0,0.8,0,0,22.8,156,48,15.2,2021-05-02 18:30:00.000
91,92,2021-05-02 22:45:00,0,0.8,0,0,22.8,159,42,15.0,2021-05-02 18:45:00.000
92,93,2021-05-02 23:00:00,0,0.8,0,0,22.8,161,33,15.0,2021-05-02 19:00:00.000
93,94,2021-05-02 23:15:00,0,0.8,0,0,22.8,163,23,19.8,2021-05-02 19:15:00.000
94,95,2021-05-02 23:30:00,0,0.8,0,0,22.8,164,11,20.8,2021-05-02 19:30:00.000
95,96,2021-05-02 23:45:00,0,0.8,0,0,22.8,164,-2,17.4,2021-05-02 19:45:00.000
