,BLOCK_ID,DATA_DATETIME,GHI,WIND_SPEED,DNI,DHI,TEMPERATURE,ZENITH,AZIMUTH,CLOUD_OPACITY,ENTRY_TIME
0,1,2020-03-25 00:00:00,0,1.1,0,0,23.0,177,-40,36.8,2020-03-24 20:00:00.000
1,2,2020-03-25 00:15:00,0,1.2,0,0,23.0,174,-70,37.0,2020-03-24 20:15:00.000
2,3,2020-03-25 00:30:00,0,1.2,0,0,23.0,170,-78,37.0,2020-03-24 20:30:00.000
3,4,2020-03-25 00:45:00,0,1.2,0,0,23.0,167,-81,37.0,2020-03-24 20:45:00.000
4,5,2020-03-25 01:00:00,0,1.3,0,0,22.9,163,-83,37.0,2020-03-24 21:00:00.000
5,6,2020-03-25 01:15:00,0,1.3,0,0,22.9,159,-84,37.0,2020-03-24 21:15:00.000
6,7,2020-03-25 01:30:00,0,1.3,0,0,23.0,156,-85,37.0,2020-03-24 21:30:00.000
7,8,2020-03-25 01:45:00,0,1.3,0,0,23.0,152,-86,37.0,2020-03-24 21:45:00.000
8,9,2020-03-25 02:00:00,0,1.3,0,0,23.0,148,-86,37.0,2020-03-24 22:00:00.000
9,10,2020-03-25 02:15:00,0,1.3,0,0,22.9,144,-87,37.0,2020-03-24 22:15:00.000
10,11,2020-03-25 02:30:00,0,1.2,0,0,22.9,141,-87,37.0,2020-03-24 22:30:00.000
11,12,2020-03-25 02:45:00,0,1.2,0,0,22.8,137,-87,37.0,2020-03-24 22:45:00.000
12,13,2020-03-25 03:00:00,0,1.1,0,0,22.8,133,-87,37.0,2020-03-24 23:00:00.000
13,14,2020-03-25 03:15:00,0,1.2,0,0,22.7,129,-88,37.0,2020-03-24 23:15:00.000
14,15,2020-03-25 03:30:00,0,1.2,0,0,22.7,126,-88,46.6,2020-03-24 23:30:00.000
15,16,2020-03-25 03:45:00,0,1.2,0,0,22.6,122,-88,39.0,2020-03-24 23:45:00.000
16,17,2020-03-25 04:00:00,0,1.2,0,0,22.6,118,-88,37.4,2020-03-25 00:00:00.000
17,18,2020-03-25 04:15:00,0,1.2,0,0,22.6,114,-88,37.0,2020-03-25 00:15:00.000
18,19,2020-03-25 04:30:00,0,1.2,0,0,22.5,111,-88,47.4,2020-03-25 00:30:00.000
19,20,2020-03-25 04:45:00,0,1.2,0,0,22.5,107,-88,38.1,2020-03-25 00:45:00.000
20,21,2020-03-25 05:00:00,0,1.2,0,0,22.5,103,-88,34.4,2020-03-25 01:00:00.000
21,22,2020-03-25 05:15:00,0,1.2,0,0,22.5,99,-88,54.8,2020-03-25 01:15:00.000
22,23,2020-03-25 05:30:00,0,1.2,0,0,22.4,96,-88,31.0,2020-03-25 01:30:00.000
23,24,2020-03-25 05:45:00,0,1.2,0,0,22.4,92,-89,15.6,2020-03-25 01:45:00.000
24,25,2020-03-25 06:00:00,13,1.1,0,13,22.5,88,-89,26.2,2020-03-25 02:00:00.000
25,26,2020-03-25 06:15:00,32,1.1,8,31,22.9,84,-89,52.0,2020-03-25 02:15:00.000
26,27,2020-03-25 06:30:00,97,1.1,163,69,23.3,81,-89,16.8,2020-03-25 02:30:00.000
27,28,2020-03-25 06:45:00,176,1.0,561,48,23.7,77,-89,0.0,2020-03-25 02:45:00.000
28,29,2020-03-25 07:00:00,240,1.0,631,56,24.2,73,-89,0.0,2020-03-25 03:00:00.000
29,30,2020-03-25 07:15:00,305,1.1,685,63,24.9,69,-89,0.0,2020-03-25 03:15:00.000
30,31,2020-03-25 07:30:00,370,1.2,728,69,25.7,66,-89,0.0,2020-03-25 03:30:00.000
31,32,2020-03-25 07:45:00,434,1.3,763,74,26.5,62,-89,0.0,2020-03-25 03:45:00.000
32,33,2020-03-25 08:00:00,498,1.3,792,78,27.2,58,-89,0.0,2020-03-25 04:00:00.000
33,34,2020-03-25 08:15:00,559,1.4,817,82,27.7,54,-89,0.0,2020-03-25 04:15:00.000
34,35,2020-03-25 08:30:00,618,1.4,837,86,28.2,51,-89,0.0,2020-03-25 04:30:00.000
35,36,2020-03-25 08:45:00,675,1.4,854,90,28.7,47,-88,0.0,2020-03-25 04:45:00.000
36,37,2020-03-25 09:00:00,728,1.4,869,93,29.2,43,-88,0.0,2020-03-25 05:00:00.000
37,38,2020-03-25 09:15:00,778,1.4,881,96,29.6,39,-88,0.0,2020-03-25 05:15:00.000
38,39,2020-03-25 09:30:00,824,1.4,892,98,30.0,36,-88,0.0,2020-03-25 05:30:00.000
39,40,2020-03-25 09:45:00,867,1.4,901,101,30.3,32,-88,0.0,2020-03-25 05:45:00.000
40,41,2020-03-25 10:00:00,905,1.4,909,103,30.6,28,-88,0.0,2020-03-25 06:00:00.000
41,42,2020-03-25 10:15:00,939,1.3,915,105,30.9,24,-88,0.0,2020-03-25 06:15:00.000
42,43,2020-03-25 10:30:00,898,1.3,695,247,31.1,21,-87,7.2,2020-03-25 06:30:00.000
43,44,2020-03-25 10:45:00,842,1.2,476,387,31.3,17,-87,15.0,2020-03-25 06:45:00.000
44,45,2020-03-25 11:00:00,877,1.1,525,366,31.4,13,-86,13.2,2020-03-25 07:00:00.000
45,46,2020-03-25 11:15:00,893,1.1,536,365,31.5,9,-84,12.8,2020-03-25 07:15:00.000
46,47,2020-03-25 11:30:00,883,1.0,486,399,31.6,6,-80,14.6,2020-03-25 07:30:00.000
47,48,2020-03-25 11:45:00,901,1.0,521,380,31.7,2,-50,13.3,2020-03-25 07:45:00.000
48,49,2020-03-25 12:00:00,893,0.9,502,392,31.7,2,57,14.0,2020-03-25 08:00:00.000
49,50,2020-03-25 12:15:00,866,0.9,446,423,31.5,6,80,16.1,2020-03-25 08:15:00.000
50,51,2020-03-25 12:30:00,920,0.9,610,318,31.3,10,84,10.0,2020-03-25 08:30:00.000
51,52,2020-03-25 12:45:00,936,0.9,700,256,31.1,13,86,7.0,2020-03-25 08:45:00.000
52,53,2020-03-25 13:00:00,986,0.9,912,115,30.9,17,87,0.0,2020-03-25 09:00:00.000
53,54,2020-03-25 13:15:00,947,1.2,859,144,30.6,21,87,1.5,2020-03-25 09:15:00.000
54,55,2020-03-25 13:30:00,922,1.5,867,133,30.3,25,88,1.0,2020-03-25 09:30:00.000
55,56,2020-03-25 13:45:00,895,1.8,886,115,30.0,28,88,0.0,2020-03-25 09:45:00.000
56,57,2020-03-25 14:00:00,855,1.9,870,117,29.7,32,88,0.0,2020-03-25 10:00:00.000
57,58,2020-03-25 14:15:00,811,1.9,853,119,29.5,36,88,0.0,2020-03-25 10:15:00.000
58,59,2020-03-25 14:30:00,764,1.8,836,119,29.3,39,88,0.0,2020-03-25 10:30:00.000
59,60,2020-03-25 14:45:00,714,1.8,821,115,29.0,43,88,0.0,2020-03-25 10:45:00.000
60,61,2020-03-25 15:00:00,660,1.7,804,112,28.8,47,88,0.0,2020-03-25 11:00:00.000
61,62,2020-03-25 15:15:00,604,1.7,785,107,28.6,51,88,0.0,2020-03-25 11:15:00.000
62,63,2020-03-25 15:30:00,545,1.6,762,102,28.4,54,88,0.0,2020-03-25 11:30:00.000
63,64,2020-03-25 15:45:00,484,1.6,735,97,28.2,58,88,0.0,2020-03-25 11:45:00.000
64,65,2020-03-25 16:00:00,422,1.6,704,91,28.0,62,88,0.0,2020-03-25 12:00:00.000
65,66,2020-03-25 16:15:00,358,1.6,665,84,27.8,66,88,0.0,2020-03-25 12:15:00.000
66,67,2020-03-25 16:30:00,293,1.6,618,77,27.5,69,88,0.0,2020-03-25 12:30:00.000
67,68,2020-03-25 16:45:00,229,1.7,559,68,27.2,73,88,0.0,2020-03-25 12:45:00.000
68,69,2020-03-25 17:00:00,167,1.7,483,58,26.9,77,88,0.0,2020-03-25 13:00:00.000
69,70,2020-03-25 17:15:00,102,1.6,290,56,26.4,81,88,4.9,2020-03-25 13:15:00.000
70,71,2020-03-25 17:30:00,53,1.6,191,33,25.9,84,88,4.0,2020-03-25 13:30:00.000
71,72,2020-03-25 17:45:00,8,1.5,0,8,25.4,88,88,40.5,2020-03-25 13:45:00.000
72,73,2020-03-25 18:00:00,0,1.5,0,0,25.0,92,88,37.0,2020-03-25 14:00:00.000
73,74,2020-03-25 18:15:00,0,1.4,0,0,24.8,96,88,37.0,2020-03-25 14:15:00.000
74,75,2020-03-25 18:30:00,0,1.4,0,0,24.5,99,88,37.0,2020-03-25 14:30:00.000
75,76,2020-03-25 18:45:00,0,1.4,0,0,24.3,103,88,25.9,2020-03-25 14:45:00.000
76,77,2020-03-25 19:00:00,0,1.3,0,0,24.1,107,88,0.0,2020-03-25 15:00:00.000
77,78,2020-03-25 19:15:00,0,1.2,0,0,24.0,111,88,0.0,2020-03-25 15:15:00.000
78,79,2020-03-25 19:30:00,0,1.1,0,0,23.9,114,88,0.0,2020-03-25 15:30:00.000
79,80,2020-03-25 19:45:00,0,1.0,0,0,23.8,118,88,0.0,2020-03-25 15:45:00.000
80,81,2020-03-25 20:00:00,0,0.9,0,0,23.7,122,88,0.0,2020-03-25 16:00:00.000
81,82,2020-03-25 20:15:00,0,1.0,0,0,23.7,126,87,0.0,2020-03-25 16:15:00.000
82,83,2020-03-25 20:30:00,0,1.2,0,0,23.6,129,87,0.0,2020-03-25 16:30:00.000
83,84,2020-03-25 20:45:00,0,1.3,0,0,23.5,133,87,0.0,2020-03-25 16:45:00.000
84,85,2020-03-25 21:00:00,0,1.4,0,0,23.5,137,87,0.0,2020-03-25 17:00:00.000
85,86,2020-03-25 21:15:00,0,1.4,0,0,23.4,141,87,0.0,2020-03-25 17:15:00.000
86,87,2020-03-25 21:30:00,0,1.4,0,0,23.4,144,86,0.0,2020-03-25 17:30:00.000
87,88,2020-03-25 21:45:00,0,1.5,0,0,23.3,148,86,0.0,2020-03-25 17:45:00.000
88,89,2020-03-25 22:00:00,0,1.5,0,0,23.3,152,85,0.0,2020-03-25 18:00:00.000
89,90,2020-03-25 22:15:00,0,1.5,0,0,23.2,156,84,0.0,2020-03-25 18:15:00.000
90,91,2020-03-25 22:30:00,0,1.5,0,0,23.2,159,83,0.0,2020-03-25 18:30:00.000
91,92,2020-03-25 22:45:00,0,1.5,0,0,23.1,163,82,0.0,2020-03-25 18:45:00.000
92,93,2020-03-25 23:00:00,0,1.5,0,0,23.1,167,80,0.0,2020-03-25 19:00:00.000
93,94,2020-03-25 23:15:00,0,1.5,0,0,23.1,170,75,0.0,2020-03-25 19:15:00.000
94,95,2020-03-25 23:30:00,0,1.5,0,0,23.0,174,66,0.0,2020-03-25 19:30:00.000
95,96,2020-03-25 23:45:00,0,1.5,0,0,23.0,177,33,0.0,2020-03-25 19:45:00.000
