,BLOCK_ID,DATA_DATETIME,GHI,WIND_SPEED,DNI,DHI,TEMPERATURE,ZENITH,AZIMUTH,CLOUD_OPACITY,ENTRY_TIME
0,1,2018-12-25 00:00:00,0,2.8,0,0,27.3,157,-171,37.0,2018-12-24 20:00:00.000
1,2,2018-12-25 00:15:00,0,2.9,0,0,27.3,156,-163,37.0,2018-12-24 20:15:00.000
2,3,2018-12-25 00:30:00,0,3.0,0,0,27.2,155,-155,37.0,2018-12-24 20:30:00.000
3,4,2018-12-25 00:45:00,0,3.1,0,0,27.2,153,-148,43.9,2018-12-24 20:45:00.000
4,5,2018-12-25 01:00:00,0,3.3,0,0,27.1,151,-143,39.0,2018-12-24 21:00:00.000
5,6,2018-12-25 01:15:00,0,3.4,0,0,27.0,148,-138,38.3,2018-12-24 21:15:00.000
6,7,2018-12-25 01:30:00,0,3.5,0,0,27.0,146,-134,38.5,2018-12-24 21:30:00.000
7,8,2018-12-25 01:45:00,0,3.7,0,0,26.9,143,-130,39.0,2018-12-24 21:45:00.000
8,9,2018-12-25 02:00:00,0,3.8,0,0,26.9,140,-127,39.0,2018-12-24 22:00:00.000
9,10,2018-12-25 02:15:00,0,3.8,0,0,26.9,137,-125,39.0,2018-12-24 22:15:00.000
10,11,2018-12-25 02:30:00,0,3.8,0,0,26.9,134,-123,39.0,2018-12-24 22:30:00.000
11,12,2018-12-25 02:45:00,0,3.8,0,0,26.8,131,-121,39.0,2018-12-24 22:45:00.000
12,13,2018-12-25 03:00:00,0,3.8,0,0,26.8,127,-120,39.0,2018-12-24 23:00:00.000
13,14,2018-12-25 03:15:00,0,3.8,0,0,26.8,124,-118,39.0,2018-12-24 23:15:00.000
14,15,2018-12-25 03:30:00,0,3.8,0,0,26.8,121,-117,49.4,2018-12-24 23:30:00.000
15,16,2018-12-25 03:45:00,0,3.8,0,0,26.8,118,-116,39.6,2018-12-24 23:45:00.000
16,17,2018-12-25 04:00:00,0,3.8,0,0,26.8,114,-116,49.8,2018-12-25 00:00:00.000
17,18,2018-12-25 04:15:00,0,3.8,0,0,26.7,111,-115,52.0,2018-12-25 00:15:00.000
18,19,2018-12-25 04:30:00,0,3.8,0,0,26.7,107,-114,52.0,2018-12-25 00:30:00.000
19,20,2018-12-25 04:45:00,0,3.8,0,0,26.7,104,-114,52.0,2018-12-25 00:45:00.000
20,21,2018-12-25 05:00:00,0,3.7,0,0,26.7,101,-114,50.0,2018-12-25 01:00:00.000
21,22,2018-12-25 05:15:00,0,3.7,0,0,26.7,97,-114,51.0,2018-12-25 01:15:00.000
22,23,2018-12-25 05:30:00,0,3.6,0,0,26.7,94,-113,51.8,2018-12-25 01:30:00.000
23,24,2018-12-25 05:45:00,1,3.5,0,1,26.7,90,-113,42.9,2018-12-25 01:45:00.000
24,25,2018-12-25 06:00:00,15,3.4,0,15,26.7,87,-113,44.9,2018-12-25 02:00:00.000
25,26,2018-12-25 06:15:00,61,3.3,94,48,26.7,83,-114,8.7,2018-12-25 02:15:00.000
26,27,2018-12-25 06:30:00,115,3.2,318,58,26.7,80,-114,0.0,2018-12-25 02:30:00.000
27,28,2018-12-25 06:45:00,169,3.2,402,75,26.7,76,-114,0.5,2018-12-25 02:45:00.000
28,29,2018-12-25 07:00:00,178,3.1,92,154,26.7,73,-115,21.3,2018-12-25 03:00:00.000
29,30,2018-12-25 07:15:00,200,3.0,0,200,26.7,70,-115,30.3,2018-12-25 03:15:00.000
30,31,2018-12-25 07:30:00,276,3.0,161,210,26.7,66,-116,21.0,2018-12-25 03:30:00.000
31,32,2018-12-25 07:45:00,387,2.9,523,151,26.7,63,-117,4.8,2018-12-25 03:45:00.000
32,33,2018-12-25 08:00:00,414,2.9,399,212,26.7,60,-118,10.9,2018-12-25 04:00:00.000
33,34,2018-12-25 08:15:00,509,2.8,647,150,26.7,56,-119,2.3,2018-12-25 04:15:00.000
34,35,2018-12-25 08:30:00,575,2.8,740,131,26.8,53,-120,0.0,2018-12-25 04:30:00.000
35,36,2018-12-25 08:45:00,627,2.8,765,135,26.8,50,-122,0.0,2018-12-25 04:45:00.000
36,37,2018-12-25 09:00:00,677,2.8,786,139,26.8,47,-124,0.0,2018-12-25 05:00:00.000
37,38,2018-12-25 09:15:00,696,2.8,695,194,26.9,44,-126,3.6,2018-12-25 05:15:00.000
38,39,2018-12-25 09:30:00,756,2.8,784,161,26.9,41,-128,1.2,2018-12-25 05:30:00.000
39,40,2018-12-25 09:45:00,804,2.7,834,145,27.0,38,-131,0.0,2018-12-25 05:45:00.000
40,41,2018-12-25 10:00:00,838,2.7,847,146,27.0,35,-135,0.0,2018-12-25 06:00:00.000
41,42,2018-12-25 10:15:00,869,2.7,858,146,27.0,33,-139,0.0,2018-12-25 06:15:00.000
42,43,2018-12-25 10:30:00,889,2.7,843,160,27.1,30,-144,0.7,2018-12-25 06:30:00.000
43,44,2018-12-25 10:45:00,906,2.7,836,169,27.1,28,-150,1.2,2018-12-25 06:45:00.000
44,45,2018-12-25 11:00:00,933,2.7,875,149,27.2,26,-156,0.2,2018-12-25 07:00:00.000
45,46,2018-12-25 11:15:00,946,2.7,885,145,27.2,25,-164,0.0,2018-12-25 07:15:00.000
46,47,2018-12-25 11:30:00,954,2.8,889,145,27.2,24,-171,0.0,2018-12-25 07:30:00.000
47,48,2018-12-25 11:45:00,927,2.8,795,201,27.3,24,-180,3.1,2018-12-25 07:45:00.000
48,49,2018-12-25 12:00:00,927,2.8,800,198,27.3,24,172,2.9,2018-12-25 08:00:00.000
49,50,2018-12-25 12:15:00,812,2.9,467,389,27.4,25,164,14.4,2018-12-25 08:15:00.000
50,51,2018-12-25 12:30:00,582,2.9,59,529,27.4,26,156,37.9,2018-12-25 08:30:00.000
51,52,2018-12-25 12:45:00,430,3.0,0,430,27.4,28,150,53.4,2018-12-25 08:45:00.000
52,53,2018-12-25 13:00:00,307,3.0,0,307,27.5,30,144,65.9,2018-12-25 09:00:00.000
53,54,2018-12-25 13:15:00,193,3.1,0,193,27.5,32,139,77.9,2018-12-25 09:15:00.000
54,55,2018-12-25 13:30:00,177,3.1,0,177,27.5,35,135,79.1,2018-12-25 09:30:00.000
55,56,2018-12-25 13:45:00,93,3.1,0,93,27.6,38,132,88.6,2018-12-25 09:45:00.000
56,57,2018-12-25 14:00:00,35,3.2,0,35,27.6,41,129,95.5,2018-12-25 10:00:00.000
57,58,2018-12-25 14:15:00,57,3.1,0,57,27.6,44,126,92.2,2018-12-25 10:15:00.000
58,59,2018-12-25 14:30:00,66,3.1,0,66,27.7,47,124,90.5,2018-12-25 10:30:00.000
59,60,2018-12-25 14:45:00,44,3.0,0,44,27.7,50,122,93.1,2018-12-25 10:45:00.000
60,61,2018-12-25 15:00:00,71,3.0,0,71,27.7,53,120,88.0,2018-12-25 11:00:00.000
61,62,2018-12-25 15:15:00,114,3.0,0,114,27.7,56,119,78.6,2018-12-25 11:15:00.000
62,63,2018-12-25 15:30:00,113,2.9,0,113,27.8,60,118,76.5,2018-12-25 11:30:00.000
63,64,2018-12-25 15:45:00,88,2.9,0,88,27.8,63,117,79.0,2018-12-25 11:45:00.000
64,65,2018-12-25 16:00:00,87,2.8,0,87,27.8,66,116,75.9,2018-12-25 12:00:00.000
65,66,2018-12-25 16:15:00,112,2.8,0,112,27.8,70,115,62.8,2018-12-25 12:15:00.000
66,67,2018-12-25 16:30:00,98,2.8,0,98,27.9,73,115,59.9,2018-12-25 12:30:00.000
67,68,2018-12-25 16:45:00,124,2.7,0,124,27.9,76,114,32.9,2018-12-25 12:45:00.000
68,69,2018-12-25 17:00:00,93,2.6,19,89,27.9,80,114,26.7,2018-12-25 13:00:00.000
69,70,2018-12-25 17:15:00,35,2.4,0,35,27.8,83,114,53.4,2018-12-25 13:15:00.000
70,71,2018-12-25 17:30:00,15,2.1,0,15,27.7,87,113,51.8,2018-12-25 13:30:00.000
71,72,2018-12-25 17:45:00,1,1.8,0,1,27.6,90,113,58.0,2018-12-25 13:45:00.000
72,73,2018-12-25 18:00:00,0,1.6,0,0,27.5,94,113,54.8,2018-12-25 14:00:00.000
73,74,2018-12-25 18:15:00,0,1.3,0,0,27.4,97,114,73.9,2018-12-25 14:15:00.000
74,75,2018-12-25 18:30:00,0,1.1,0,0,27.3,101,114,80.1,2018-12-25 14:30:00.000
75,76,2018-12-25 18:45:00,0,0.9,0,0,27.2,104,114,89.3,2018-12-25 14:45:00.000
76,77,2018-12-25 19:00:00,0,0.7,0,0,27.1,107,114,72.8,2018-12-25 15:00:00.000
77,78,2018-12-25 19:15:00,0,0.6,0,0,27.0,111,115,68.0,2018-12-25 15:15:00.000
78,79,2018-12-25 19:30:00,0,0.7,0,0,26.9,114,116,68.0,2018-12-25 15:30:00.000
79,80,2018-12-25 19:45:00,0,0.8,0,0,26.7,118,116,68.0,2018-12-25 15:45:00.000
80,81,2018-12-25 20:00:00,0,1.0,0,0,26.7,121,117,68.0,2018-12-25 16:00:00.000
81,82,2018-12-25 20:15:00,0,0.9,0,0,26.8,124,118,68.0,2018-12-25 16:15:00.000
82,83,2018-12-25 20:30:00,0,0.8,0,0,26.9,127,120,68.0,2018-12-25 16:30:00.000
83,84,2018-12-25 20:45:00,0,0.7,0,0,27.0,131,121,68.0,2018-12-25 16:45:00.000
84,85,2018-12-25 21:00:00,0,0.6,0,0,27.1,134,123,68.0,2018-12-25 17:00:00.000
85,86,2018-12-25 21:15:00,0,0.5,0,0,27.2,137,125,49.8,2018-12-25 17:15:00.000
86,87,2018-12-25 21:30:00,0,0.4,0,0,27.3,140,127,52.7,2018-12-25 17:30:00.000
87,88,2018-12-25 21:45:00,0,0.2,0,0,27.4,143,130,50.1,2018-12-25 17:45:00.000
88,89,2018-12-25 22:00:00,0,0.1,0,0,27.5,146,134,53.0,2018-12-25 18:00:00.000
89,90,2018-12-25 22:15:00,0,0.0,0,0,27.6,148,138,53.0,2018-12-25 18:15:00.000
90,91,2018-12-25 22:30:00,0,0.1,0,0,27.7,151,143,53.0,2018-12-25 18:30:00.000
91,92,2018-12-25 22:45:00,0,0.2,0,0,27.8,153,148,53.0,2018-12-25 18:45:00.000
92,93,2018-12-25 23:00:00,0,0.3,0,0,27.9,155,155,53.0,2018-12-25 19:00:00.000
93,94,2018-12-25 23:15:00,0,0.4,0,0,27.9,156,163,53.0,2018-12-25 19:15:00.000
94,95,2018-12-25 23:30:00,0,0.5,0,0,27.8,157,171,52.2,2018-12-25 19:30:00.000
95,96,2018-12-25 23:45:00,0,0.6,0,0,27.8,157,180,52.0,2018-12-25 19:45:00.000
