,BLOCK_ID,DATA_DATETIME,GHI,WIND_SPEED,DNI,DHI,TEMPERATURE,ZENITH,AZIMUTH,CLOUD_OPACITY,ENTRY_TIME
0,1,2019-04-04 00:00:00,0,3.0,0,0,26.9,174,-25,0.0,2019-04-03 20:00:00.000
1,2,2019-04-04 00:15:00,0,3.1,0,0,26.9,172,-49,0.0,2019-04-03 20:15:00.000
2,3,2019-04-04 00:30:00,0,3.1,0,0,26.8,168,-61,28.9,2019-04-03 20:30:00.000
3,4,2019-04-04 00:45:00,0,3.1,0,0,26.8,165,-68,0.0,2019-04-03 20:45:00.000
4,5,2019-04-04 01:00:00,0,3.2,0,0,26.8,162,-72,0.0,2019-04-03 21:00:00.000
5,6,2019-04-04 01:15:00,0,3.2,0,0,26.8,158,-75,0.0,2019-04-03 21:15:00.000
6,7,2019-04-04 01:30:00,0,3.3,0,0,26.7,154,-77,0.0,2019-04-03 21:30:00.000
7,8,2019-04-04 01:45:00,0,3.3,0,0,26.7,151,-79,11.1,2019-04-03 21:45:00.000
8,9,2019-04-04 02:00:00,0,3.3,0,0,26.7,147,-80,7.4,2019-04-03 22:00:00.000
9,10,2019-04-04 02:15:00,0,3.3,0,0,26.7,143,-81,0.0,2019-04-03 22:15:00.000
10,11,2019-04-04 02:30:00,0,3.3,0,0,26.7,140,-82,0.0,2019-04-03 22:30:00.000
11,12,2019-04-04 02:45:00,0,3.3,0,0,26.7,136,-82,9.4,2019-04-03 22:45:00.000
12,13,2019-04-04 03:00:00,0,3.3,0,0,26.7,132,-83,35.7,2019-04-03 23:00:00.000
13,14,2019-04-04 03:15:00,0,3.3,0,0,26.6,128,-83,25.8,2019-04-03 23:15:00.000
14,15,2019-04-04 03:30:00,0,3.3,0,0,26.6,125,-84,29.5,2019-04-03 23:30:00.000
15,16,2019-04-04 03:45:00,0,3.3,0,0,26.6,121,-84,36.8,2019-04-03 23:45:00.000
16,17,2019-04-04 04:00:00,0,3.3,0,0,26.6,117,-84,37.0,2019-04-04 00:00:00.000
17,18,2019-04-04 04:15:00,0,3.3,0,0,26.6,113,-84,37.0,2019-04-04 00:15:00.000
18,19,2019-04-04 04:30:00,0,3.3,0,0,26.6,110,-85,37.0,2019-04-04 00:30:00.000
19,20,2019-04-04 04:45:00,0,3.3,0,0,26.6,106,-85,37.0,2019-04-04 00:45:00.000
20,21,2019-04-04 05:00:00,0,3.2,0,0,26.6,102,-85,37.0,2019-04-04 01:00:00.000
21,22,2019-04-04 05:15:00,0,3.1,0,0,26.6,99,-85,26.9,2019-04-04 01:15:00.000
22,23,2019-04-04 05:30:00,0,3.0,0,0,26.6,95,-85,23.8,2019-04-04 01:30:00.000
23,24,2019-04-04 05:45:00,1,2.9,0,1,26.6,91,-85,50.6,2019-04-04 01:45:00.000
24,25,2019-04-04 06:00:00,11,2.7,0,11,26.6,87,-85,51.2,2019-04-04 02:00:00.000
25,26,2019-04-04 06:15:00,66,2.6,280,34,26.7,84,-85,0.0,2019-04-04 02:15:00.000
26,27,2019-04-04 06:30:00,119,2.5,400,49,26.7,80,-85,0.0,2019-04-04 02:30:00.000
27,28,2019-04-04 06:45:00,167,2.4,363,82,26.7,76,-85,6.1,2019-04-04 02:45:00.000
28,29,2019-04-04 07:00:00,198,2.3,193,140,26.7,72,-85,17.6,2019-04-04 03:00:00.000
29,30,2019-04-04 07:15:00,249,2.1,212,171,26.7,69,-85,18.3,2019-04-04 03:15:00.000
30,31,2019-04-04 07:30:00,307,2.0,270,192,26.8,65,-85,16.7,2019-04-04 03:30:00.000
31,32,2019-04-04 07:45:00,359,1.9,291,219,26.8,61,-85,16.7,2019-04-04 03:45:00.000
32,33,2019-04-04 08:00:00,415,1.8,326,239,26.8,57,-84,16.0,2019-04-04 04:00:00.000
33,34,2019-04-04 08:15:00,492,1.9,454,222,26.8,54,-84,11.2,2019-04-04 04:15:00.000
34,35,2019-04-04 08:30:00,552,1.9,508,225,26.8,50,-84,9.6,2019-04-04 04:30:00.000
35,36,2019-04-04 08:45:00,665,2.0,789,119,26.8,46,-84,0.1,2019-04-04 04:45:00.000
36,37,2019-04-04 09:00:00,689,2.0,692,179,26.8,42,-83,3.9,2019-04-04 05:00:00.000
37,38,2019-04-04 09:15:00,699,2.1,569,256,26.8,39,-83,8.7,2019-04-04 05:15:00.000
38,39,2019-04-04 09:30:00,732,2.1,549,282,26.7,35,-82,9.7,2019-04-04 05:30:00.000
39,40,2019-04-04 09:45:00,847,2.2,825,142,26.7,31,-81,0.5,2019-04-04 05:45:00.000
40,41,2019-04-04 10:00:00,888,2.2,850,135,26.7,28,-80,0.0,2019-04-04 06:00:00.000
41,42,2019-04-04 10:15:00,913,2.3,832,152,26.7,24,-79,0.7,2019-04-04 06:15:00.000
42,43,2019-04-04 10:30:00,939,2.3,830,160,26.7,20,-77,1.0,2019-04-04 06:30:00.000
43,44,2019-04-04 10:45:00,910,2.4,674,265,26.7,17,-74,6.2,2019-04-04 06:45:00.000
44,45,2019-04-04 11:00:00,912,2.4,629,299,26.7,13,-70,7.7,2019-04-04 07:00:00.000
45,46,2019-04-04 11:15:00,937,2.5,667,278,26.7,10,-62,6.5,2019-04-04 07:15:00.000
46,47,2019-04-04 11:30:00,936,2.6,644,297,26.8,7,-46,7.3,2019-04-04 07:30:00.000
47,48,2019-04-04 11:45:00,942,2.8,648,296,26.8,5,-13,7.1,2019-04-04 07:45:00.000
48,49,2019-04-04 12:00:00,959,2.9,702,260,26.8,5,30,5.2,2019-04-04 08:00:00.000
49,50,2019-04-04 12:15:00,951,3.0,695,263,26.9,8,55,5.4,2019-04-04 08:15:00.000
50,51,2019-04-04 12:30:00,910,3.1,602,319,26.9,11,66,8.6,2019-04-04 08:30:00.000
51,52,2019-04-04 12:45:00,849,3.2,471,393,26.9,15,72,13.3,2019-04-04 08:45:00.000
52,53,2019-04-04 13:00:00,806,3.3,403,423,27.0,18,75,16.0,2019-04-04 09:00:00.000
53,54,2019-04-04 13:15:00,722,3.4,247,493,27.0,22,78,22.6,2019-04-04 09:15:00.000
54,55,2019-04-04 13:30:00,760,3.5,397,402,27.0,26,79,15.9,2019-04-04 09:30:00.000
55,56,2019-04-04 13:45:00,733,3.7,396,387,27.1,29,81,15.6,2019-04-04 09:45:00.000
56,57,2019-04-04 14:00:00,605,3.8,147,481,27.1,33,82,27.0,2019-04-04 10:00:00.000
57,58,2019-04-04 14:15:00,547,3.8,76,485,27.1,37,82,30.5,2019-04-04 10:15:00.000
58,59,2019-04-04 14:30:00,459,3.9,5,455,27.1,40,83,37.9,2019-04-04 10:30:00.000
59,60,2019-04-04 14:45:00,446,4.0,48,413,27.1,44,83,35.1,2019-04-04 10:45:00.000
60,61,2019-04-04 15:00:00,469,4.0,129,382,27.1,48,84,26.3,2019-04-04 11:00:00.000
61,62,2019-04-04 15:15:00,420,4.1,99,359,27.1,52,84,27.5,2019-04-04 11:15:00.000
62,63,2019-04-04 15:30:00,411,4.2,208,293,27.2,55,84,21.0,2019-04-04 11:30:00.000
63,64,2019-04-04 15:45:00,408,4.2,393,206,27.2,59,84,11.4,2019-04-04 11:45:00.000
64,65,2019-04-04 16:00:00,367,4.3,452,161,27.2,63,85,7.7,2019-04-04 12:00:00.000
65,66,2019-04-04 16:15:00,260,4.4,129,208,27.2,66,85,22.7,2019-04-04 12:15:00.000
66,67,2019-04-04 16:30:00,160,4.5,3,159,27.2,70,85,41.5,2019-04-04 12:30:00.000
67,68,2019-04-04 16:45:00,114,4.5,0,114,27.2,74,85,45.0,2019-04-04 12:45:00.000
68,69,2019-04-04 17:00:00,78,4.6,0,78,27.2,78,85,48.1,2019-04-04 13:00:00.000
69,70,2019-04-04 17:15:00,51,4.4,0,51,27.2,81,85,44.0,2019-04-04 13:15:00.000
70,71,2019-04-04 17:30:00,25,4.3,0,25,27.1,85,85,43.2,2019-04-04 13:30:00.000
71,72,2019-04-04 17:45:00,4,4.2,0,4,27.1,89,85,52.0,2019-04-04 13:45:00.000
72,73,2019-04-04 18:00:00,0,4.1,0,0,27.1,93,85,52.0,2019-04-04 14:00:00.000
73,74,2019-04-04 18:15:00,0,3.9,0,0,27.1,96,85,45.7,2019-04-04 14:15:00.000
74,75,2019-04-04 18:30:00,0,3.8,0,0,27.0,100,85,35.8,2019-04-04 14:30:00.000
75,76,2019-04-04 18:45:00,0,3.7,0,0,27.0,104,85,36.0,2019-04-04 14:45:00.000
76,77,2019-04-04 19:00:00,0,3.6,0,0,27.0,108,84,26.0,2019-04-04 15:00:00.000
77,78,2019-04-04 19:15:00,0,3.5,0,0,27.0,111,84,25.4,2019-04-04 15:15:00.000
78,79,2019-04-04 19:30:00,0,3.4,0,0,26.9,115,84,36.6,2019-04-04 15:30:00.000
79,80,2019-04-04 19:45:00,0,3.4,0,0,26.9,119,84,37.0,2019-04-04 15:45:00.000
80,81,2019-04-04 20:00:00,0,3.3,0,0,26.9,122,83,37.0,2019-04-04 16:00:00.000
81,82,2019-04-04 20:15:00,0,3.3,0,0,26.9,126,83,37.0,2019-04-04 16:15:00.000
82,83,2019-04-04 20:30:00,0,3.4,0,0,27.0,130,83,25.5,2019-04-04 16:30:00.000
83,84,2019-04-04 20:45:00,0,3.4,0,0,27.0,134,82,35.4,2019-04-04 16:45:00.000
84,85,2019-04-04 21:00:00,0,3.4,0,0,27.1,137,82,34.1,2019-04-04 17:00:00.000
85,86,2019-04-04 21:15:00,0,3.5,0,0,27.1,141,81,36.8,2019-04-04 17:15:00.000
86,87,2019-04-04 21:30:00,0,3.5,0,0,27.1,145,80,36.8,2019-04-04 17:30:00.000
87,88,2019-04-04 21:45:00,0,3.5,0,0,27.2,148,79,36.8,2019-04-04 17:45:00.000
88,89,2019-04-04 22:00:00,0,3.6,0,0,27.2,152,78,43.1,2019-04-04 18:00:00.000
89,90,2019-04-04 22:15:00,0,3.6,0,0,27.3,156,76,48.7,2019-04-04 18:15:00.000
90,91,2019-04-04 22:30:00,0,3.6,0,0,27.3,159,73,36.8,2019-04-04 18:30:00.000
91,92,2019-04-04 22:45:00,0,3.7,0,0,27.4,163,70,36.8,2019-04-04 18:45:00.000
92,93,2019-04-04 23:00:00,0,3.7,0,0,27.4,166,64,36.8,2019-04-04 19:00:00.000
93,94,2019-04-04 23:15:00,0,3.7,0,0,27.3,170,55,37.5,2019-04-04 19:15:00.000
94,95,2019-04-04 23:30:00,0,3.7,0,0,27.3,172,39,39.1,2019-04-04 19:30:00.000
95,96,2019-04-04 23:45:00,0,3.7,0,0,27.3,174,10,38.4,2019-04-04 19:45:00.000
