,BLOCK_ID,DATA_DATETIME,GHI,WIND_SPEED,DNI,DHI,TEMPERATURE,ZENITH,AZIMUTH,CLOUD_OPACITY,ENTRY_TIME
0,1,2021-07-12 00:00:00,0,1.2,0,0,23.1,157,-5,52.4,2021-07-11 20:00:00.000
1,2,2021-07-12 00:15:00,0,1.2,0,0,23.0,156,-14,55.0,2021-07-11 20:15:00.000
2,3,2021-07-12 00:30:00,0,1.2,0,0,22.9,155,-22,59.0,2021-07-11 20:30:00.000
3,4,2021-07-12 00:45:00,0,1.2,0,0,22.8,154,-29,58.4,2021-07-11 20:45:00.000
4,5,2021-07-12 01:00:00,0,1.1,0,0,22.8,152,-35,78.6,2021-07-11 21:00:00.000
5,6,2021-07-12 01:15:00,0,1.0,0,0,22.7,149,-41,87.7,2021-07-11 21:15:00.000
6,7,2021-07-12 01:30:00,0,0.9,0,0,22.7,147,-45,91.8,2021-07-11 21:30:00.000
7,8,2021-07-12 01:45:00,0,0.8,0,0,22.6,144,-49,93.9,2021-07-11 21:45:00.000
8,9,2021-07-12 02:00:00,0,0.7,0,0,22.6,141,-52,92.0,2021-07-11 22:00:00.000
9,10,2021-07-12 02:15:00,0,0.7,0,0,22.5,138,-55,88.3,2021-07-11 22:15:00.000
10,11,2021-07-12 02:30:00,0,0.6,0,0,22.5,135,-57,96.0,2021-07-11 22:30:00.000
11,12,2021-07-12 02:45:00,0,0.6,0,0,22.5,132,-59,94.2,2021-07-11 22:45:00.000
12,13,2021-07-12 03:00:00,0,0.6,0,0,22.5,129,-60,96.2,2021-07-11 23:00:00.000
13,14,2021-07-12 03:15:00,0,0.5,0,0,22.5,125,-62,96.4,2021-07-11 23:15:00.000
14,15,2021-07-12 03:30:00,0,0.5,0,0,22.4,122,-63,95.8,2021-07-11 23:30:00.000
15,16,2021-07-12 03:45:00,0,0.5,0,0,22.4,119,-64,96.7,2021-07-11 23:45:00.000
16,17,2021-07-12 04:00:00,0,0.5,0,0,22.4,115,-65,94.4,2021-07-12 00:00:00.000
17,18,2021-07-12 04:15:00,0,0.5,0,0,22.4,112,-66,97.0,2021-07-12 00:15:00.000
18,19,2021-07-12 04:30:00,0,0.5,0,0,22.3,108,-66,97.0,2021-07-12 00:30:00.000
19,20,2021-07-12 04:45:00,0,0.5,0,0,22.3,105,-67,97.0,2021-07-12 00:45:00.000
20,21,2021-07-12 05:00:00,0,0.4,0,0,22.3,102,-67,97.0,2021-07-12 01:00:00.000
21,22,2021-07-12 05:15:00,0,0.4,0,0,22.3,98,-67,71.2,2021-07-12 01:15:00.000
22,23,2021-07-12 05:30:00,0,0.4,0,0,22.2,95,-68,96.6,2021-07-12 01:30:00.000
23,24,2021-07-12 05:45:00,0,0.5,0,0,22.2,91,-68,69.7,2021-07-12 01:45:00.000
24,25,2021-07-12 06:00:00,6,0.5,0,6,22.3,88,-68,69.0,2021-07-12 02:00:00.000
25,26,2021-07-12 06:15:00,24,0.5,0,24,22.6,84,-68,58.2,2021-07-12 02:15:00.000
26,27,2021-07-12 06:30:00,45,0.6,0,45,22.8,81,-68,56.4,2021-07-12 02:30:00.000
27,28,2021-07-12 06:45:00,70,0.6,0,70,23.1,77,-67,54.2,2021-07-12 02:45:00.000
28,29,2021-07-12 07:00:00,90,0.7,0,90,23.4,74,-67,57.0,2021-07-12 03:00:00.000
29,30,2021-07-12 07:15:00,112,0.7,0,112,23.8,70,-67,57.7,2021-07-12 03:15:00.000
30,31,2021-07-12 07:30:00,161,0.8,0,161,24.1,67,-66,49.8,2021-07-12 03:30:00.000
31,32,2021-07-12 07:45:00,185,0.8,0,185,24.5,63,-65,50.6,2021-07-12 03:45:00.000
32,33,2021-07-12 08:00:00,202,0.9,0,202,24.8,60,-65,52.8,2021-07-12 04:00:00.000
33,34,2021-07-12 08:15:00,272,0.9,0,272,25.2,57,-64,43.4,2021-07-12 04:15:00.000
34,35,2021-07-12 08:30:00,333,0.9,0,333,25.6,53,-62,37.2,2021-07-12 04:30:00.000
35,36,2021-07-12 08:45:00,434,0.9,160,332,26.0,50,-61,24.9,2021-07-12 04:45:00.000
36,37,2021-07-12 09:00:00,456,1.0,129,368,26.4,47,-59,27.0,2021-07-12 05:00:00.000
37,38,2021-07-12 09:15:00,535,1.0,271,338,26.9,44,-58,19.8,2021-07-12 05:15:00.000
38,39,2021-07-12 09:30:00,592,1.0,354,323,27.4,41,-55,16.2,2021-07-12 05:30:00.000
39,40,2021-07-12 09:45:00,631,1.1,387,324,27.8,37,-53,15.0,2021-07-12 05:45:00.000
40,41,2021-07-12 10:00:00,597,1.2,223,414,28.3,35,-49,23.0,2021-07-12 06:00:00.000
41,42,2021-07-12 10:15:00,515,1.3,43,479,28.7,32,-46,35.9,2021-07-12 06:15:00.000
42,43,2021-07-12 10:30:00,496,1.4,0,496,29.0,29,-41,40.2,2021-07-12 06:30:00.000
43,44,2021-07-12 10:45:00,452,1.5,0,452,29.4,27,-35,46.7,2021-07-12 06:45:00.000
44,45,2021-07-12 11:00:00,522,1.6,0,522,29.7,25,-29,39.6,2021-07-12 07:00:00.000
45,46,2021-07-12 11:15:00,705,1.9,294,434,29.7,23,-21,19.4,2021-07-12 07:15:00.000
46,47,2021-07-12 11:30:00,729,2.1,340,415,29.6,22,-13,17.2,2021-07-12 07:30:00.000
47,48,2021-07-12 11:45:00,553,2.3,0,553,29.5,22,-4,37.5,2021-07-12 07:45:00.000
48,49,2021-07-12 12:00:00,599,2.4,71,534,29.4,22,6,32.2,2021-07-12 08:00:00.000
49,50,2021-07-12 12:15:00,681,2.4,237,462,29.2,22,15,22.5,2021-07-12 08:15:00.000
50,51,2021-07-12 12:30:00,562,2.3,8,555,28.9,24,23,35.4,2021-07-12 08:30:00.000
51,52,2021-07-12 12:45:00,742,2.3,425,358,28.7,25,30,13.3,2021-07-12 08:45:00.000
52,53,2021-07-12 13:00:00,714,2.3,387,371,28.5,27,37,14.8,2021-07-12 09:00:00.000
53,54,2021-07-12 13:15:00,609,2.4,162,468,28.4,30,42,25.4,2021-07-12 09:15:00.000
54,55,2021-07-12 13:30:00,582,2.4,141,462,28.3,32,46,26.4,2021-07-12 09:30:00.000
55,56,2021-07-12 13:45:00,565,2.5,154,440,28.2,35,50,25.6,2021-07-12 09:45:00.000
56,57,2021-07-12 14:00:00,535,2.6,135,428,28.1,38,53,26.4,2021-07-12 10:00:00.000
57,58,2021-07-12 14:15:00,510,2.7,163,390,27.9,41,56,25.8,2021-07-12 10:15:00.000
58,59,2021-07-12 14:30:00,555,2.7,357,299,27.8,44,58,14.6,2021-07-12 10:30:00.000
59,60,2021-07-12 14:45:00,372,2.7,26,355,27.6,48,60,38.5,2021-07-12 10:45:00.000
60,61,2021-07-12 15:00:00,452,2.8,243,299,27.5,51,61,19.2,2021-07-12 11:00:00.000
61,62,2021-07-12 15:15:00,323,2.8,12,316,27.3,54,63,37.1,2021-07-12 11:15:00.000
62,63,2021-07-12 15:30:00,169,2.9,0,169,27.2,57,64,63.4,2021-07-12 11:30:00.000
63,64,2021-07-12 15:45:00,159,2.9,0,159,27.0,61,65,60.7,2021-07-12 11:45:00.000
64,65,2021-07-12 16:00:00,144,2.9,0,144,26.9,64,66,59.4,2021-07-12 12:00:00.000
65,66,2021-07-12 16:15:00,134,2.8,0,134,26.6,68,66,55.0,2021-07-12 12:15:00.000
66,67,2021-07-12 16:30:00,89,2.7,0,89,26.3,71,67,63.8,2021-07-12 12:30:00.000
67,68,2021-07-12 16:45:00,64,2.6,0,64,26.1,75,67,66.5,2021-07-12 12:45:00.000
68,69,2021-07-12 17:00:00,39,2.5,0,39,25.8,78,67,71.6,2021-07-12 13:00:00.000
69,70,2021-07-12 17:15:00,30,2.3,0,30,25.4,81,68,64.9,2021-07-12 13:15:00.000
70,71,2021-07-12 17:30:00,14,2.1,0,14,25.1,85,68,67.0,2021-07-12 13:30:00.000
71,72,2021-07-12 17:45:00,4,2.0,0,4,24.8,88,68,65.8,2021-07-12 13:45:00.000
72,73,2021-07-12 18:00:00,0,1.8,0,0,24.5,92,68,68.4,2021-07-12 14:00:00.000
73,74,2021-07-12 18:15:00,0,1.7,0,0,24.3,95,68,92.5,2021-07-12 14:15:00.000
74,75,2021-07-12 18:30:00,0,1.7,0,0,24.2,99,67,68.2,2021-07-12 14:30:00.000
75,76,2021-07-12 18:45:00,0,1.6,0,0,24.0,102,67,76.4,2021-07-12 14:45:00.000
76,77,2021-07-12 19:00:00,0,1.6,0,0,23.9,106,67,46.9,2021-07-12 15:00:00.000
77,78,2021-07-12 19:15:00,0,1.5,0,0,23.8,109,66,42.9,2021-07-12 15:15:00.000
78,79,2021-07-12 19:30:00,0,1.5,0,0,23.8,113,66,47.4,2021-07-12 15:30:00.000
79,80,2021-07-12 19:45:00,0,1.5,0,0,23.7,116,65,42.7,2021-07-12 15:45:00.000
80,81,2021-07-12 20:00:00,0,1.4,0,0,23.6,119,64,39.6,2021-07-12 16:00:00.000
81,82,2021-07-12 20:15:00,0,1.3,0,0,23.5,123,63,37.9,2021-07-12 16:15:00.000
82,83,2021-07-12 20:30:00,0,1.3,0,0,23.5,126,62,44.0,2021-07-12 16:30:00.000
83,84,2021-07-12 20:45:00,0,1.2,0,0,23.4,129,60,49.2,2021-07-12 16:45:00.000
84,85,2021-07-12 21:00:00,0,1.1,0,0,23.3,133,59,50.4,2021-07-12 17:00:00.000
85,86,2021-07-12 21:15:00,0,1.1,0,0,23.2,136,57,53.8,2021-07-12 17:15:00.000
86,87,2021-07-12 21:30:00,0,1.0,0,0,23.2,139,54,64.4,2021-07-12 17:30:00.000
87,88,2021-07-12 21:45:00,0,1.0,0,0,23.1,142,51,76.0,2021-07-12 17:45:00.000
88,89,2021-07-12 22:00:00,0,0.9,0,0,23.1,145,48,80.4,2021-07-12 18:00:00.000
89,90,2021-07-12 22:15:00,0,0.8,0,0,23.0,147,44,74.1,2021-07-12 18:15:00.000
90,91,2021-07-12 22:30:00,0,0.8,0,0,22.9,150,40,60.2,2021-07-12 18:30:00.000
91,92,2021-07-12 22:45:00,0,0.7,0,0,22.9,152,34,62.1,2021-07-12 18:45:00.000
92,93,2021-07-12 23:00:00,0,0.7,0,0,22.8,154,28,59.8,2021-07-12 19:00:00.000
93,94,2021-07-12 23:15:00,0,0.6,0,0,22.8,156,20,70.7,2021-07-12 19:15:00.000
94,95,2021-07-12 23:30:00,0,0.5,0,0,22.8,157,12,79.4,2021-07-12 19:30:00.000
95,96,2021-07-12 23:45:00,0,0.5,0,0,22.8,157,4,66.3,2021-07-12 19:45:00.000
