,BLOCK_ID,DATA_DATETIME,GHI,WIND_SPEED,DNI,DHI,TEMPERATURE,ZENITH,AZIMUTH,CLOUD_OPACITY,ENTRY_TIME
0,1,2018-11-19 00:00:00,0,2.9,0,0,26.9,160,-159,37.0,2018-11-18 20:00:00.000
1,2,2018-11-19 00:15:00,0,3.0,0,0,26.9,159,-150,37.0,2018-11-18 20:15:00.000
2,3,2018-11-19 00:30:00,0,3.0,0,0,26.9,157,-143,38.6,2018-11-18 20:30:00.000
3,4,2018-11-19 00:45:00,0,3.1,0,0,26.9,154,-137,36.0,2018-11-18 20:45:00.000
4,5,2018-11-19 01:00:00,0,3.2,0,0,26.9,151,-131,36.0,2018-11-18 21:00:00.000
5,6,2018-11-19 01:15:00,0,3.2,0,0,26.9,149,-127,36.0,2018-11-18 21:15:00.000
6,7,2018-11-19 01:30:00,0,3.3,0,0,26.9,146,-124,36.0,2018-11-18 21:30:00.000
7,8,2018-11-19 01:45:00,0,3.3,0,0,26.9,142,-121,36.0,2018-11-18 21:45:00.000
8,9,2018-11-19 02:00:00,0,3.4,0,0,26.9,139,-119,27.9,2018-11-18 22:00:00.000
9,10,2018-11-19 02:15:00,0,3.4,0,0,26.9,136,-117,48.0,2018-11-18 22:15:00.000
10,11,2018-11-19 02:30:00,0,3.4,0,0,26.9,132,-116,21.8,2018-11-18 22:30:00.000
11,12,2018-11-19 02:45:00,0,3.4,0,0,26.9,129,-114,17.7,2018-11-18 22:45:00.000
12,13,2018-11-19 03:00:00,0,3.5,0,0,26.9,126,-113,34.4,2018-11-18 23:00:00.000
13,14,2018-11-19 03:15:00,0,3.5,0,0,26.9,122,-112,49.8,2018-11-18 23:15:00.000
14,15,2018-11-19 03:30:00,0,3.5,0,0,26.9,119,-111,72.0,2018-11-18 23:30:00.000
15,16,2018-11-19 03:45:00,0,3.5,0,0,26.9,115,-111,27.0,2018-11-18 23:45:00.000
16,17,2018-11-19 04:00:00,0,3.6,0,0,26.9,112,-110,27.0,2018-11-19 00:00:00.000
17,18,2018-11-19 04:15:00,0,3.6,0,0,26.9,108,-110,27.0,2018-11-19 00:15:00.000
18,19,2018-11-19 04:30:00,0,3.6,0,0,26.9,105,-110,27.0,2018-11-19 00:30:00.000
19,20,2018-11-19 04:45:00,0,3.6,0,0,26.9,101,-109,26.0,2018-11-19 00:45:00.000
20,21,2018-11-19 05:00:00,0,3.6,0,0,27.0,98,-109,26.7,2018-11-19 01:00:00.000
21,22,2018-11-19 05:15:00,0,3.6,0,0,27.0,94,-109,39.8,2018-11-19 01:15:00.000
22,23,2018-11-19 05:30:00,0,3.5,0,0,27.0,90,-109,49.8,2018-11-19 01:30:00.000
23,24,2018-11-19 05:45:00,17,3.4,0,17,27.1,87,-109,40.9,2018-11-19 01:45:00.000
24,25,2018-11-19 06:00:00,47,3.4,0,47,27.1,83,-109,33.7,2018-11-19 02:00:00.000
25,26,2018-11-19 06:15:00,62,3.3,0,62,27.2,80,-109,48.9,2018-11-19 02:15:00.000
26,27,2018-11-19 06:30:00,101,3.2,0,101,27.2,76,-110,44.2,2018-11-19 02:30:00.000
27,28,2018-11-19 06:45:00,177,3.1,78,153,27.2,73,-110,26.1,2018-11-19 02:45:00.000
28,29,2018-11-19 07:00:00,233,3.1,162,176,27.3,69,-111,21.9,2018-11-19 03:00:00.000
29,30,2018-11-19 07:15:00,265,3.0,108,220,27.3,66,-111,26.2,2018-11-19 03:15:00.000
30,31,2018-11-19 07:30:00,333,2.9,229,226,27.4,62,-112,20.4,2018-11-19 03:30:00.000
31,32,2018-11-19 07:45:00,392,2.9,331,223,27.4,59,-113,17.2,2018-11-19 03:45:00.000
32,33,2018-11-19 08:00:00,427,2.8,281,266,27.4,55,-114,19.7,2018-11-19 04:00:00.000
33,34,2018-11-19 08:15:00,427,2.8,139,342,27.4,52,-115,26.9,2018-11-19 04:15:00.000
34,35,2018-11-19 08:30:00,452,2.9,112,379,27.3,49,-116,28.8,2018-11-19 04:30:00.000
35,36,2018-11-19 08:45:00,533,2.9,260,347,27.3,45,-118,22.3,2018-11-19 04:45:00.000
36,37,2018-11-19 09:00:00,679,3.0,625,215,27.3,42,-120,7.0,2018-11-19 05:00:00.000
37,38,2018-11-19 09:15:00,738,3.0,711,183,27.2,39,-122,4.4,2018-11-19 05:15:00.000
38,39,2018-11-19 09:30:00,805,3.1,833,128,27.2,36,-125,0.6,2018-11-19 05:30:00.000
39,40,2018-11-19 09:45:00,752,3.1,545,295,27.1,33,-129,10.8,2018-11-19 05:45:00.000
40,41,2018-11-19 10:00:00,681,3.2,274,444,27.1,30,-133,22.1,2018-11-19 06:00:00.000
41,42,2018-11-19 10:15:00,692,3.2,256,464,27.0,27,-138,23.1,2018-11-19 06:15:00.000
42,43,2018-11-19 10:30:00,649,3.3,135,527,27.0,25,-143,29.5,2018-11-19 06:30:00.000
43,44,2018-11-19 10:45:00,718,3.3,248,490,26.9,23,-151,23.1,2018-11-19 06:45:00.000
44,45,2018-11-19 11:00:00,845,3.4,547,335,26.9,21,-159,10.5,2018-11-19 07:00:00.000
45,46,2018-11-19 11:15:00,621,3.5,186,446,26.9,20,-169,34.5,2018-11-19 07:15:00.000
46,47,2018-11-19 11:30:00,767,3.6,317,469,26.9,20,-179,19.2,2018-11-19 07:30:00.000
47,48,2018-11-19 11:45:00,941,3.8,811,179,26.9,20,171,0.7,2018-11-19 07:45:00.000
48,49,2018-11-19 12:00:00,930,3.9,796,187,26.9,21,161,1.2,2018-11-19 08:00:00.000
49,50,2018-11-19 12:15:00,893,4.0,710,237,26.9,22,152,3.9,2018-11-19 08:15:00.000
50,51,2018-11-19 12:30:00,789,4.1,442,386,26.9,24,145,13.7,2018-11-19 08:30:00.000
51,52,2018-11-19 12:45:00,663,4.2,178,504,26.9,27,139,25.9,2018-11-19 08:45:00.000
52,53,2018-11-19 13:00:00,774,4.3,545,301,26.9,29,133,10.9,2018-11-19 09:00:00.000
53,54,2018-11-19 13:15:00,794,4.5,651,243,26.9,32,129,5.4,2018-11-19 09:15:00.000
54,55,2018-11-19 13:30:00,720,4.6,501,310,26.9,35,126,10.8,2018-11-19 09:30:00.000
55,56,2018-11-19 13:45:00,384,4.7,0,384,26.9,38,123,50.3,2018-11-19 09:45:00.000
56,57,2018-11-19 14:00:00,360,4.8,0,360,26.9,41,120,50.5,2018-11-19 10:00:00.000
57,58,2018-11-19 14:15:00,334,4.8,0,334,26.9,45,118,51.4,2018-11-19 10:15:00.000
58,59,2018-11-19 14:30:00,419,4.9,89,360,26.8,48,117,34.0,2018-11-19 10:30:00.000
59,60,2018-11-19 14:45:00,454,4.9,257,292,26.8,51,115,22.9,2018-11-19 10:45:00.000
60,61,2018-11-19 15:00:00,115,5.0,0,115,26.8,55,114,78.9,2018-11-19 11:00:00.000
61,62,2018-11-19 15:15:00,81,5.0,0,81,26.7,58,113,82.7,2018-11-19 11:15:00.000
62,63,2018-11-19 15:30:00,103,5.1,0,103,26.7,62,112,75.7,2018-11-19 11:30:00.000
63,64,2018-11-19 15:45:00,70,5.1,0,70,26.7,65,111,80.8,2018-11-19 11:45:00.000
64,65,2018-11-19 16:00:00,59,5.2,0,59,26.6,69,111,80.3,2018-11-19 12:00:00.000
65,66,2018-11-19 16:15:00,65,5.2,0,65,26.6,72,110,73.1,2018-11-19 12:15:00.000
66,67,2018-11-19 16:30:00,62,5.3,0,62,26.6,76,110,65.9,2018-11-19 12:30:00.000
67,68,2018-11-19 16:45:00,47,5.3,0,47,26.5,79,110,62.5,2018-11-19 12:45:00.000
68,69,2018-11-19 17:00:00,46,5.3,0,46,26.5,83,109,37.5,2018-11-19 13:00:00.000
69,70,2018-11-19 17:15:00,20,5.3,0,20,26.4,86,109,32.3,2018-11-19 13:15:00.000
70,71,2018-11-19 17:30:00,3,5.3,0,3,26.3,90,109,12.0,2018-11-19 13:30:00.000
71,72,2018-11-19 17:45:00,0,5.3,0,0,26.2,93,109,14.1,2018-11-19 13:45:00.000
72,73,2018-11-19 18:00:00,0,5.3,0,0,26.2,97,109,25.4,2018-11-19 14:00:00.000
73,74,2018-11-19 18:15:00,0,5.3,0,0,26.1,101,109,24.5,2018-11-19 14:15:00.000
74,75,2018-11-19 18:30:00,0,5.3,0,0,26.0,104,110,36.7,2018-11-19 14:30:00.000
75,76,2018-11-19 18:45:00,0,5.3,0,0,25.9,108,110,32.2,2018-11-19 14:45:00.000
76,77,2018-11-19 19:00:00,0,5.2,0,0,25.8,111,110,26.3,2018-11-19 15:00:00.000
77,78,2018-11-19 19:15:00,0,5.2,0,0,25.7,115,111,25.8,2018-11-19 15:15:00.000
78,79,2018-11-19 19:30:00,0,5.2,0,0,25.7,118,112,37.0,2018-11-19 15:30:00.000
79,80,2018-11-19 19:45:00,0,5.2,0,0,25.6,122,112,27.5,2018-11-19 15:45:00.000
80,81,2018-11-19 20:00:00,0,5.2,0,0,25.5,125,113,34.1,2018-11-19 16:00:00.000
81,82,2018-11-19 20:15:00,0,5.2,0,0,25.6,128,114,46.4,2018-11-19 16:15:00.000
82,83,2018-11-19 20:30:00,0,5.2,0,0,25.8,132,116,37.8,2018-11-19 16:30:00.000
83,84,2018-11-19 20:45:00,0,5.2,0,0,25.9,135,117,37.0,2018-11-19 16:45:00.000
84,85,2018-11-19 21:00:00,0,5.2,0,0,26.0,139,119,37.0,2018-11-19 17:00:00.000
85,86,2018-11-19 21:15:00,0,5.3,0,0,26.2,142,121,43.3,2018-11-19 17:15:00.000
86,87,2018-11-19 21:30:00,0,5.3,0,0,26.3,145,124,37.0,2018-11-19 17:30:00.000
87,88,2018-11-19 21:45:00,0,5.3,0,0,26.4,148,127,37.0,2018-11-19 17:45:00.000
88,89,2018-11-19 22:00:00,0,5.3,0,0,26.5,151,131,38.6,2018-11-19 18:00:00.000
89,90,2018-11-19 22:15:00,0,5.4,0,0,26.6,154,136,39.0,2018-11-19 18:15:00.000
90,91,2018-11-19 22:30:00,0,5.4,0,0,26.8,156,142,39.0,2018-11-19 18:30:00.000
91,92,2018-11-19 22:45:00,0,5.4,0,0,26.9,158,149,37.6,2018-11-19 18:45:00.000
92,93,2018-11-19 23:00:00,0,5.4,0,0,27.0,160,158,38.6,2018-11-19 19:00:00.000
93,94,2018-11-19 23:15:00,0,5.4,0,0,27.0,161,168,39.0,2018-11-19 19:15:00.000
94,95,2018-11-19 23:30:00,0,5.5,0,0,26.9,161,179,37.6,2018-11-19 19:30:00.000
95,96,2018-11-19 23:45:00,0,5.5,0,0,26.9,161,-170,37.0,2018-11-19 19:45:00.000
