,BLOCK_ID,DATA_DATETIME,GHI,WIND_SPEED,DNI,DHI,TEMPERATURE,ZENITH,AZIMUTH,CLOUD_OPACITY,ENTRY_TIME
0,1,2021-03-14 00:00:00,0,1.1,0,0,23.1,177,-160,71.0,2021-03-13 20:00:00.000
1,2,2021-03-14 00:15:00,0,1.1,0,0,23.0,174,-121,75.1,2021-03-13 20:15:00.000
2,3,2021-03-14 00:30:00,0,1.0,0,0,23.0,171,-108,87.2,2021-03-13 20:30:00.000
3,4,2021-03-14 00:45:00,0,1.0,0,0,23.0,167,-103,85.1,2021-03-13 20:45:00.000
4,5,2021-03-14 01:00:00,0,1.0,0,0,22.9,164,-100,90.8,2021-03-13 21:00:00.000
5,6,2021-03-14 01:15:00,0,1.0,0,0,22.9,160,-98,90.8,2021-03-13 21:15:00.000
6,7,2021-03-14 01:30:00,0,0.9,0,0,22.9,156,-97,82.4,2021-03-13 21:30:00.000
7,8,2021-03-14 01:45:00,0,0.9,0,0,22.9,153,-96,71.8,2021-03-13 21:45:00.000
8,9,2021-03-14 02:00:00,0,0.9,0,0,22.9,149,-95,30.2,2021-03-13 22:00:00.000
9,10,2021-03-14 02:15:00,0,0.9,0,0,22.9,145,-95,22.7,2021-03-13 22:15:00.000
10,11,2021-03-14 02:30:00,0,0.9,0,0,22.9,141,-95,18.2,2021-03-13 22:30:00.000
11,12,2021-03-14 02:45:00,0,1.0,0,0,22.9,138,-94,16.9,2021-03-13 22:45:00.000
12,13,2021-03-14 03:00:00,0,1.0,0,0,22.8,134,-94,19.8,2021-03-13 23:00:00.000
13,14,2021-03-14 03:15:00,0,1.0,0,0,22.8,130,-94,19.6,2021-03-13 23:15:00.000
14,15,2021-03-14 03:30:00,0,1.0,0,0,22.8,126,-94,21.0,2021-03-13 23:30:00.000
15,16,2021-03-14 03:45:00,0,1.0,0,0,22.7,123,-94,39.1,2021-03-13 23:45:00.000
16,17,2021-03-14 04:00:00,0,1.0,0,0,22.7,119,-93,27.6,2021-03-14 00:00:00.000
17,18,2021-03-14 04:15:00,0,1.0,0,0,22.7,115,-93,28.2,2021-03-14 00:15:00.000
18,19,2021-03-14 04:30:00,0,1.0,0,0,22.6,111,-93,30.2,2021-03-14 00:30:00.000
19,20,2021-03-14 04:45:00,0,1.0,0,0,22.6,108,-93,60.0,2021-03-14 00:45:00.000
20,21,2021-03-14 05:00:00,0,1.0,0,0,22.6,104,-93,72.6,2021-03-14 01:00:00.000
21,22,2021-03-14 05:15:00,0,1.0,0,0,22.6,100,-93,67.4,2021-03-14 01:15:00.000
22,23,2021-03-14 05:30:00,0,1.0,0,0,22.5,97,-93,70.0,2021-03-14 01:30:00.000
23,24,2021-03-14 05:45:00,0,1.0,0,0,22.5,93,-93,36.1,2021-03-14 01:45:00.000
24,25,2021-03-14 06:00:00,7,1.0,0,7,22.6,89,-93,19.8,2021-03-14 02:00:00.000
25,26,2021-03-14 06:15:00,35,0.9,0,35,22.9,85,-93,20.1,2021-03-14 02:15:00.000
26,27,2021-03-14 06:30:00,65,0.9,0,65,23.3,82,-93,28.4,2021-03-14 02:30:00.000
27,28,2021-03-14 06:45:00,115,0.8,23,109,23.6,78,-93,23.5,2021-03-14 02:45:00.000
28,29,2021-03-14 07:00:00,162,0.8,49,148,24.0,74,-94,23.2,2021-03-14 03:00:00.000
29,30,2021-03-14 07:15:00,248,0.6,326,139,24.6,70,-94,9.5,2021-03-14 03:15:00.000
30,31,2021-03-14 07:30:00,281,0.5,209,198,25.2,67,-94,17.0,2021-03-14 03:30:00.000
31,32,2021-03-14 07:45:00,339,0.3,266,220,25.8,63,-94,15.6,2021-03-14 03:45:00.000
32,33,2021-03-14 08:00:00,321,0.2,22,310,26.4,59,-94,31.2,2021-03-14 04:00:00.000
33,34,2021-03-14 08:15:00,382,0.2,65,344,26.9,55,-94,27.9,2021-03-14 04:15:00.000
34,35,2021-03-14 08:30:00,501,0.3,330,294,27.3,52,-95,15.0,2021-03-14 04:30:00.000
35,36,2021-03-14 08:45:00,576,0.3,442,279,27.8,48,-95,10.8,2021-03-14 04:45:00.000
36,37,2021-03-14 09:00:00,689,0.3,709,179,28.1,44,-95,1.6,2021-03-14 05:00:00.000
37,38,2021-03-14 09:15:00,751,0.3,770,164,28.3,40,-96,0.0,2021-03-14 05:15:00.000
38,39,2021-03-14 09:30:00,799,0.3,784,170,28.4,37,-96,0.0,2021-03-14 05:30:00.000
39,40,2021-03-14 09:45:00,842,0.4,794,175,28.5,33,-97,0.0,2021-03-14 05:45:00.000
40,41,2021-03-14 10:00:00,846,0.4,681,251,28.6,29,-98,4.0,2021-03-14 06:00:00.000
41,42,2021-03-14 10:15:00,774,0.5,386,427,28.5,25,-99,15.5,2021-03-14 06:15:00.000
42,43,2021-03-14 10:30:00,541,0.6,29,514,28.5,22,-100,42.8,2021-03-14 06:30:00.000
43,44,2021-03-14 10:45:00,617,0.6,30,588,28.5,18,-102,36.7,2021-03-14 06:45:00.000
44,45,2021-03-14 11:00:00,868,0.7,477,405,28.5,14,-105,13.0,2021-03-14 07:00:00.000
45,46,2021-03-14 11:15:00,844,0.8,375,477,28.4,11,-111,16.8,2021-03-14 07:15:00.000
46,47,2021-03-14 11:30:00,828,0.9,316,514,28.3,7,-121,19.4,2021-03-14 07:30:00.000
47,48,2021-03-14 11:45:00,876,1.0,422,456,28.3,5,-146,15.2,2021-03-14 07:45:00.000
48,49,2021-03-14 12:00:00,962,1.0,647,317,28.3,4,164,7.0,2021-03-14 08:00:00.000
49,50,2021-03-14 12:15:00,1012,1.0,807,210,28.4,6,129,1.8,2021-03-14 08:15:00.000
50,51,2021-03-14 12:30:00,1009,0.9,825,196,28.6,9,114,1.2,2021-03-14 08:30:00.000
51,52,2021-03-14 12:45:00,986,0.9,795,211,28.7,13,107,2.1,2021-03-14 08:45:00.000
52,53,2021-03-14 13:00:00,974,0.8,813,195,28.7,17,103,1.4,2021-03-14 09:00:00.000
53,54,2021-03-14 13:15:00,964,0.7,852,165,28.4,20,101,0.0,2021-03-14 09:15:00.000
54,55,2021-03-14 13:30:00,936,0.6,847,162,28.1,24,99,0.0,2021-03-14 09:30:00.000
55,56,2021-03-14 13:45:00,903,0.5,841,158,27.8,28,98,0.0,2021-03-14 09:45:00.000
56,57,2021-03-14 14:00:00,865,0.4,833,153,27.5,31,97,0.0,2021-03-14 10:00:00.000
57,58,2021-03-14 14:15:00,824,0.3,825,148,27.3,35,96,0.0,2021-03-14 10:15:00.000
58,59,2021-03-14 14:30:00,655,0.2,387,351,27.2,39,96,16.0,2021-03-14 10:30:00.000
59,60,2021-03-14 14:45:00,193,0.1,0,193,27.1,42,95,73.7,2021-03-14 10:45:00.000
60,61,2021-03-14 15:00:00,61,0.2,0,61,27.0,46,95,91.0,2021-03-14 11:00:00.000
61,62,2021-03-14 15:15:00,73,0.3,0,73,27.0,50,95,88.1,2021-03-14 11:15:00.000
62,63,2021-03-14 15:30:00,78,0.4,0,78,27.0,54,94,86.2,2021-03-14 11:30:00.000
63,64,2021-03-14 15:45:00,62,0.5,0,62,27.0,57,94,87.8,2021-03-14 11:45:00.000
64,65,2021-03-14 16:00:00,25,0.6,0,25,26.9,61,94,94.4,2021-03-14 12:00:00.000
65,66,2021-03-14 16:15:00,19,0.7,0,19,26.7,65,94,95.0,2021-03-14 12:15:00.000
66,67,2021-03-14 16:30:00,15,0.8,0,15,26.4,69,94,95.0,2021-03-14 12:30:00.000
67,68,2021-03-14 16:45:00,20,0.9,0,20,26.2,72,93,91.8,2021-03-14 12:45:00.000
68,69,2021-03-14 17:00:00,12,0.9,0,12,25.9,76,93,93.8,2021-03-14 13:00:00.000
69,70,2021-03-14 17:15:00,21,1.0,0,21,25.5,80,93,82.3,2021-03-14 13:15:00.000
70,71,2021-03-14 17:30:00,23,1.0,0,23,25.1,84,93,64.0,2021-03-14 13:30:00.000
71,72,2021-03-14 17:45:00,6,1.0,0,6,24.7,87,93,77.1,2021-03-14 13:45:00.000
72,73,2021-03-14 18:00:00,0,1.0,0,0,24.4,91,93,95.2,2021-03-14 14:00:00.000
73,74,2021-03-14 18:15:00,0,1.1,0,0,24.3,95,93,86.5,2021-03-14 14:15:00.000
74,75,2021-03-14 18:30:00,0,1.1,0,0,24.2,99,93,91.0,2021-03-14 14:30:00.000
75,76,2021-03-14 18:45:00,0,1.1,0,0,24.1,102,93,84.8,2021-03-14 14:45:00.000
76,77,2021-03-14 19:00:00,0,1.1,0,0,24.0,106,93,89.8,2021-03-14 15:00:00.000
77,78,2021-03-14 19:15:00,0,1.0,0,0,23.9,110,93,89.5,2021-03-14 15:15:00.000
78,79,2021-03-14 19:30:00,0,0.9,0,0,23.9,114,93,60.0,2021-03-14 15:30:00.000
79,80,2021-03-14 19:45:00,0,0.9,0,0,23.8,117,93,95.0,2021-03-14 15:45:00.000
80,81,2021-03-14 20:00:00,0,0.8,0,0,23.8,121,93,91.8,2021-03-14 16:00:00.000
81,82,2021-03-14 20:15:00,0,0.8,0,0,23.8,125,93,64.7,2021-03-14 16:15:00.000
82,83,2021-03-14 20:30:00,0,0.8,0,0,23.7,129,93,79.4,2021-03-14 16:30:00.000
83,84,2021-03-14 20:45:00,0,0.8,0,0,23.7,132,94,83.6,2021-03-14 16:45:00.000
84,85,2021-03-14 21:00:00,0,0.9,0,0,23.6,136,94,67.8,2021-03-14 17:00:00.000
85,86,2021-03-14 21:15:00,0,0.9,0,0,23.5,140,94,77.3,2021-03-14 17:15:00.000
86,87,2021-03-14 21:30:00,0,0.9,0,0,23.5,144,94,60.4,2021-03-14 17:30:00.000
87,88,2021-03-14 21:45:00,0,0.9,0,0,23.4,147,95,52.5,2021-03-14 17:45:00.000
88,89,2021-03-14 22:00:00,0,0.9,0,0,23.3,151,95,49.8,2021-03-14 18:00:00.000
89,90,2021-03-14 22:15:00,0,0.9,0,0,23.3,155,96,55.4,2021-03-14 18:15:00.000
90,91,2021-03-14 22:30:00,0,0.8,0,0,23.2,158,97,50.8,2021-03-14 18:30:00.000
91,92,2021-03-14 22:45:00,0,0.8,0,0,23.2,162,98,58.1,2021-03-14 18:45:00.000
92,93,2021-03-14 23:00:00,0,0.8,0,0,23.1,166,100,60.6,2021-03-14 19:00:00.000
93,94,2021-03-14 23:15:00,0,0.8,0,0,23.1,170,103,60.7,2021-03-14 19:15:00.000
94,95,2021-03-14 23:30:00,0,0.8,0,0,23.0,173,111,70.2,2021-03-14 19:30:00.000
95,96,2021-03-14 23:45:00,0,0.8,0,0,23.0,176,135,49.3,2021-03-14 19:45:00.000
