,BLOCK_ID,DATA_DATETIME,GHI,WIND_SPEED,DNI,DHI,TEMPERATURE,ZENITH,AZIMUTH,CLOUD_OPACITY,ENTRY_TIME
0,1,2019-08-09 00:00:00,0,2.7,0,0,22.9,163,-7,0.0,2019-08-08 20:00:00.000
1,2,2019-08-09 00:15:00,0,2.7,0,0,22.9,162,-18,0.0,2019-08-08 20:15:00.000
2,3,2019-08-09 00:30:00,0,2.8,0,0,22.9,160,-29,0.0,2019-08-08 20:30:00.000
3,4,2019-08-09 00:45:00,0,2.9,0,0,22.8,158,-37,0.0,2019-08-08 20:45:00.000
4,5,2019-08-09 01:00:00,0,2.9,0,0,22.8,156,-44,0.0,2019-08-08 21:00:00.000
5,6,2019-08-09 01:15:00,0,3.0,0,0,22.8,153,-49,0.0,2019-08-08 21:15:00.000
6,7,2019-08-09 01:30:00,0,3.0,0,0,22.8,150,-54,0.0,2019-08-08 21:30:00.000
7,8,2019-08-09 01:45:00,0,3.0,0,0,22.7,147,-57,0.0,2019-08-08 21:45:00.000
8,9,2019-08-09 02:00:00,0,3.0,0,0,22.7,144,-60,0.0,2019-08-08 22:00:00.000
9,10,2019-08-09 02:15:00,0,3.0,0,0,22.7,141,-63,0.0,2019-08-08 22:15:00.000
10,11,2019-08-09 02:30:00,0,3.0,0,0,22.7,137,-65,0.0,2019-08-08 22:30:00.000
11,12,2019-08-09 02:45:00,0,2.9,0,0,22.6,134,-66,0.0,2019-08-08 22:45:00.000
12,13,2019-08-09 03:00:00,0,2.9,0,0,22.6,131,-68,0.0,2019-08-08 23:00:00.000
13,14,2019-08-09 03:15:00,0,2.9,0,0,22.6,127,-69,0.0,2019-08-08 23:15:00.000
14,15,2019-08-09 03:30:00,0,2.8,0,0,22.5,124,-70,0.0,2019-08-08 23:30:00.000
15,16,2019-08-09 03:45:00,0,2.7,0,0,22.5,120,-71,0.0,2019-08-08 23:45:00.000
16,17,2019-08-09 04:00:00,0,2.7,0,0,22.5,116,-71,0.0,2019-08-09 00:00:00.000
17,18,2019-08-09 04:15:00,0,2.6,0,0,22.4,113,-72,0.0,2019-08-09 00:15:00.000
18,19,2019-08-09 04:30:00,0,2.6,0,0,22.4,109,-72,0.0,2019-08-09 00:30:00.000
19,20,2019-08-09 04:45:00,0,2.5,0,0,22.4,106,-73,0.0,2019-08-09 00:45:00.000
20,21,2019-08-09 05:00:00,0,2.4,0,0,22.3,102,-73,0.0,2019-08-09 01:00:00.000
21,22,2019-08-09 05:15:00,0,2.4,0,0,22.3,99,-73,0.0,2019-08-09 01:15:00.000
22,23,2019-08-09 05:30:00,0,2.3,0,0,22.3,95,-73,15.2,2019-08-09 01:30:00.000
23,24,2019-08-09 05:45:00,0,2.3,1,0,22.2,91,-74,0.0,2019-08-09 01:45:00.000
24,25,2019-08-09 06:00:00,17,2.3,57,12,22.3,88,-74,0.0,2019-08-09 02:00:00.000
25,26,2019-08-09 06:15:00,50,2.3,94,40,22.7,84,-74,12.3,2019-08-09 02:15:00.000
26,27,2019-08-09 06:30:00,95,2.3,195,62,23.1,81,-73,11.4,2019-08-09 02:30:00.000
27,28,2019-08-09 06:45:00,146,2.3,287,81,23.5,77,-73,9.9,2019-08-09 02:45:00.000
28,29,2019-08-09 07:00:00,196,2.4,322,104,23.9,73,-73,10.9,2019-08-09 03:00:00.000
29,30,2019-08-09 07:15:00,250,2.5,368,122,24.5,70,-73,10.6,2019-08-09 03:15:00.000
30,31,2019-08-09 07:30:00,329,2.6,587,92,25.1,66,-72,2.9,2019-08-09 03:30:00.000
31,32,2019-08-09 07:45:00,392,2.7,659,90,25.6,63,-72,1.2,2019-08-09 03:45:00.000
32,33,2019-08-09 08:00:00,427,2.9,558,141,26.2,59,-71,6.2,2019-08-09 04:00:00.000
33,34,2019-08-09 08:15:00,425,3.0,336,237,26.5,56,-70,16.8,2019-08-09 04:15:00.000
34,35,2019-08-09 08:30:00,497,3.2,455,216,26.9,52,-70,12.3,2019-08-09 04:30:00.000
35,36,2019-08-09 08:45:00,596,3.4,690,139,27.2,49,-69,3.5,2019-08-09 04:45:00.000
36,37,2019-08-09 09:00:00,602,3.5,539,222,27.5,45,-67,9.6,2019-08-09 05:00:00.000
37,38,2019-08-09 09:15:00,706,3.7,790,115,27.8,42,-66,1.0,2019-08-09 05:15:00.000
38,39,2019-08-09 09:30:00,723,3.8,705,170,28.1,38,-64,4.2,2019-08-09 05:30:00.000
39,40,2019-08-09 09:45:00,726,4.0,593,240,28.4,35,-62,8.5,2019-08-09 05:45:00.000
40,41,2019-08-09 10:00:00,768,4.1,630,232,28.6,32,-59,7.4,2019-08-09 06:00:00.000
41,42,2019-08-09 10:15:00,810,4.2,680,213,28.8,28,-55,5.9,2019-08-09 06:15:00.000
42,43,2019-08-09 10:30:00,828,4.3,663,230,28.9,25,-51,6.6,2019-08-09 06:30:00.000
43,44,2019-08-09 10:45:00,820,4.3,578,288,29.1,23,-45,9.8,2019-08-09 06:45:00.000
44,45,2019-08-09 11:00:00,838,4.4,583,291,29.2,20,-38,9.7,2019-08-09 07:00:00.000
45,46,2019-08-09 11:15:00,862,4.4,627,266,29.2,18,-29,8.4,2019-08-09 07:15:00.000
46,47,2019-08-09 11:30:00,943,4.5,850,129,29.3,17,-18,0.8,2019-08-09 07:30:00.000
47,48,2019-08-09 11:45:00,954,4.5,874,114,29.4,16,-6,0.0,2019-08-09 07:45:00.000
48,49,2019-08-09 12:00:00,954,4.5,873,114,29.4,16,8,0.0,2019-08-09 08:00:00.000
49,50,2019-08-09 12:15:00,949,4.4,871,115,29.4,17,20,0.0,2019-08-09 08:15:00.000
50,51,2019-08-09 12:30:00,939,4.4,869,115,29.5,18,31,0.0,2019-08-09 08:30:00.000
51,52,2019-08-09 12:45:00,925,4.3,866,114,29.5,21,39,0.0,2019-08-09 08:45:00.000
52,53,2019-08-09 13:00:00,906,4.2,862,113,29.5,23,46,0.0,2019-08-09 09:00:00.000
53,54,2019-08-09 13:15:00,883,4.0,857,112,29.5,26,52,0.0,2019-08-09 09:15:00.000
54,55,2019-08-09 13:30:00,855,3.8,851,111,29.5,29,56,0.0,2019-08-09 09:30:00.000
55,56,2019-08-09 13:45:00,824,3.6,844,109,29.5,32,59,0.0,2019-08-09 09:45:00.000
56,57,2019-08-09 14:00:00,788,3.5,836,106,29.5,35,62,0.0,2019-08-09 10:00:00.000
57,58,2019-08-09 14:15:00,749,3.5,826,104,29.4,39,64,0.0,2019-08-09 10:15:00.000
58,59,2019-08-09 14:30:00,706,3.5,815,101,29.3,42,66,0.0,2019-08-09 10:30:00.000
59,60,2019-08-09 14:45:00,660,3.6,800,99,29.2,46,68,0.0,2019-08-09 10:45:00.000
60,61,2019-08-09 15:00:00,610,3.6,784,96,29.1,49,69,0.0,2019-08-09 11:00:00.000
61,62,2019-08-09 15:15:00,558,3.5,764,93,29.0,53,70,0.0,2019-08-09 11:15:00.000
62,63,2019-08-09 15:30:00,504,3.5,742,90,28.8,56,71,0.0,2019-08-09 11:30:00.000
63,64,2019-08-09 15:45:00,447,3.5,715,85,28.6,60,71,0.0,2019-08-09 11:45:00.000
64,65,2019-08-09 16:00:00,389,3.4,683,81,28.3,63,72,0.0,2019-08-09 12:00:00.000
65,66,2019-08-09 16:15:00,330,3.2,644,76,28.0,67,73,0.0,2019-08-09 12:15:00.000
66,67,2019-08-09 16:30:00,270,3.0,596,69,27.7,70,73,0.0,2019-08-09 12:30:00.000
67,68,2019-08-09 16:45:00,211,2.9,537,62,27.4,74,73,0.0,2019-08-09 12:45:00.000
68,69,2019-08-09 17:00:00,153,2.7,462,53,27.0,77,73,0.0,2019-08-09 13:00:00.000
69,70,2019-08-09 17:15:00,96,2.5,317,45,26.4,81,74,3.0,2019-08-09 13:15:00.000
70,71,2019-08-09 17:30:00,45,2.3,105,35,25.7,85,74,9.2,2019-08-09 13:30:00.000
71,72,2019-08-09 17:45:00,13,2.2,37,10,25.1,88,74,0.0,2019-08-09 13:45:00.000
72,73,2019-08-09 18:00:00,0,2.0,0,0,24.5,92,74,0.0,2019-08-09 14:00:00.000
73,74,2019-08-09 18:15:00,0,2.0,0,0,24.2,95,74,0.0,2019-08-09 14:15:00.000
74,75,2019-08-09 18:30:00,0,1.9,0,0,23.9,99,73,0.0,2019-08-09 14:30:00.000
75,76,2019-08-09 18:45:00,0,1.9,0,0,23.6,103,73,0.0,2019-08-09 14:45:00.000
76,77,2019-08-09 19:00:00,0,1.8,0,0,23.3,106,73,0.0,2019-08-09 15:00:00.000
77,78,2019-08-09 19:15:00,0,1.7,0,0,23.2,110,72,0.0,2019-08-09 15:15:00.000
78,79,2019-08-09 19:30:00,0,1.6,0,0,23.0,113,72,0.0,2019-08-09 15:30:00.000
79,80,2019-08-09 19:45:00,0,1.5,0,0,22.9,117,71,0.0,2019-08-09 15:45:00.000
80,81,2019-08-09 20:00:00,0,1.5,0,0,22.8,121,71,0.0,2019-08-09 16:00:00.000
81,82,2019-08-09 20:15:00,0,1.6,0,0,22.8,124,70,0.0,2019-08-09 16:15:00.000
82,83,2019-08-09 20:30:00,0,1.7,0,0,22.7,128,69,0.0,2019-08-09 16:30:00.000
83,84,2019-08-09 20:45:00,0,1.8,0,0,22.7,131,68,0.0,2019-08-09 16:45:00.000
84,85,2019-08-09 21:00:00,0,1.9,0,0,22.6,134,66,0.0,2019-08-09 17:00:00.000
85,86,2019-08-09 21:15:00,0,1.9,0,0,22.6,138,65,0.0,2019-08-09 17:15:00.000
86,87,2019-08-09 21:30:00,0,2.0,0,0,22.6,141,63,0.0,2019-08-09 17:30:00.000
87,88,2019-08-09 21:45:00,0,2.0,0,0,22.5,145,60,0.0,2019-08-09 17:45:00.000
88,89,2019-08-09 22:00:00,0,2.0,0,0,22.5,148,57,0.0,2019-08-09 18:00:00.000
89,90,2019-08-09 22:15:00,0,2.0,0,0,22.5,151,54,0.0,2019-08-09 18:15:00.000
90,91,2019-08-09 22:30:00,0,2.0,0,0,22.5,154,49,0.0,2019-08-09 18:30:00.000
91,92,2019-08-09 22:45:00,0,1.9,0,0,22.4,157,43,0.0,2019-08-09 18:45:00.000
92,93,2019-08-09 23:00:00,0,1.9,0,0,22.4,159,36,0.0,2019-08-09 19:00:00.000
93,94,2019-08-09 23:15:00,0,1.9,0,0,22.3,161,28,0.0,2019-08-09 19:15:00.000
94,95,2019-08-09 23:30:00,0,1.9,0,0,22.3,162,17,0.0,2019-08-09 19:30:00.000
95,96,2019-08-09 23:45:00,0,1.9,0,0,22.2,163,5,0.0,2019-08-09 19:45:00.000
