,BLOCK_ID,DATA_DATETIME,GHI,WIND_SPEED,DNI,DHI,TEMPERATURE,ZENITH,AZIMUTH,CLOUD_OPACITY,ENTRY_TIME
0,1,2020-08-13 00:00:00,0,0.2,0,0,22.6,164,-8,39.2,2020-08-12 20:00:00.000
1,2,2020-08-13 00:15:00,0,0.2,0,0,22.6,163,-21,44.9,2020-08-12 20:15:00.000
2,3,2020-08-13 00:30:00,0,0.2,0,0,22.5,162,-31,68.0,2020-08-12 20:30:00.000
3,4,2020-08-13 00:45:00,0,0.2,0,0,22.4,159,-40,42.3,2020-08-12 20:45:00.000
4,5,2020-08-13 01:00:00,0,0.2,0,0,22.4,157,-47,34.4,2020-08-12 21:00:00.000
5,6,2020-08-13 01:15:00,0,0.2,0,0,22.3,154,-52,32.6,2020-08-12 21:15:00.000
6,7,2020-08-13 01:30:00,0,0.2,0,0,22.3,151,-56,21.4,2020-08-12 21:30:00.000
7,8,2020-08-13 01:45:00,0,0.3,0,0,22.3,148,-60,15.4,2020-08-12 21:45:00.000
8,9,2020-08-13 02:00:00,0,0.3,0,0,22.2,144,-63,13.2,2020-08-12 22:00:00.000
9,10,2020-08-13 02:15:00,0,0.3,0,0,22.2,141,-65,12.7,2020-08-12 22:15:00.000
10,11,2020-08-13 02:30:00,0,0.3,0,0,22.1,138,-67,12.0,2020-08-12 22:30:00.000
11,12,2020-08-13 02:45:00,0,0.3,0,0,22.1,134,-68,13.0,2020-08-12 22:45:00.000
12,13,2020-08-13 03:00:00,0,0.2,0,0,22.1,131,-69,13.0,2020-08-12 23:00:00.000
13,14,2020-08-13 03:15:00,0,0.2,0,0,22.0,127,-71,16.8,2020-08-12 23:15:00.000
14,15,2020-08-13 03:30:00,0,0.2,0,0,22.0,124,-71,14.0,2020-08-12 23:30:00.000
15,16,2020-08-13 03:45:00,0,0.2,0,0,22.0,120,-72,13.0,2020-08-12 23:45:00.000
16,17,2020-08-13 04:00:00,0,0.2,0,0,22.0,117,-73,17.0,2020-08-13 00:00:00.000
17,18,2020-08-13 04:15:00,0,0.1,0,0,22.0,113,-73,41.0,2020-08-13 00:15:00.000
18,19,2020-08-13 04:30:00,0,0.2,0,0,21.9,109,-74,26.6,2020-08-13 00:30:00.000
19,20,2020-08-13 04:45:00,0,0.2,0,0,21.9,106,-74,24.9,2020-08-13 00:45:00.000
20,21,2020-08-13 05:00:00,0,0.2,0,0,21.9,102,-75,14.4,2020-08-13 01:00:00.000
21,22,2020-08-13 05:15:00,0,0.2,0,0,21.9,98,-75,13.7,2020-08-13 01:15:00.000
22,23,2020-08-13 05:30:00,0,0.2,0,0,21.9,95,-75,13.8,2020-08-13 01:30:00.000
23,24,2020-08-13 05:45:00,1,0.2,0,1,21.9,91,-75,21.4,2020-08-13 01:45:00.000
24,25,2020-08-13 06:00:00,18,0.2,57,13,21.9,88,-75,2.6,2020-08-13 02:00:00.000
25,26,2020-08-13 06:15:00,49,0.2,49,44,22.3,84,-75,15.0,2020-08-13 02:15:00.000
26,27,2020-08-13 06:30:00,92,0.2,133,69,22.7,80,-75,14.2,2020-08-13 02:30:00.000
27,28,2020-08-13 06:45:00,148,0.2,294,81,23.1,77,-75,8.2,2020-08-13 02:45:00.000
28,29,2020-08-13 07:00:00,201,0.2,343,101,23.6,73,-75,8.6,2020-08-13 03:00:00.000
29,30,2020-08-13 07:15:00,279,0.3,580,75,24.3,70,-74,0.0,2020-08-13 03:15:00.000
30,31,2020-08-13 07:30:00,338,0.4,625,83,25.1,66,-74,0.0,2020-08-13 03:30:00.000
31,32,2020-08-13 07:45:00,387,0.5,606,107,25.8,62,-73,2.2,2020-08-13 03:45:00.000
32,33,2020-08-13 08:00:00,312,0.7,98,264,26.5,59,-73,31.1,2020-08-13 04:00:00.000
33,34,2020-08-13 08:15:00,184,0.8,36,163,26.9,55,-72,64.8,2020-08-13 04:15:00.000
34,35,2020-08-13 08:30:00,509,1.0,488,203,27.4,52,-71,10.2,2020-08-13 04:30:00.000
35,36,2020-08-13 08:45:00,599,1.1,686,142,27.9,48,-70,2.7,2020-08-13 04:45:00.000
36,37,2020-08-13 09:00:00,605,1.3,528,229,28.3,44,-69,9.0,2020-08-13 05:00:00.000
37,38,2020-08-13 09:15:00,676,1.5,651,184,28.6,41,-68,4.9,2020-08-13 05:15:00.000
38,39,2020-08-13 09:30:00,753,1.7,801,118,28.8,38,-66,0.0,2020-08-13 05:30:00.000
39,40,2020-08-13 09:45:00,760,1.9,704,180,29.1,34,-64,3.9,2020-08-13 05:45:00.000
40,41,2020-08-13 10:00:00,679,2.0,347,382,29.3,31,-61,17.8,2020-08-13 06:00:00.000
41,42,2020-08-13 10:15:00,808,2.1,676,211,29.5,28,-58,5.7,2020-08-13 06:15:00.000
42,43,2020-08-13 10:30:00,731,2.3,363,400,29.7,25,-53,17.4,2020-08-13 06:30:00.000
43,44,2020-08-13 10:45:00,745,2.4,357,414,29.9,22,-48,17.8,2020-08-13 06:45:00.000
44,45,2020-08-13 11:00:00,810,2.5,492,345,30.0,19,-41,12.4,2020-08-13 07:00:00.000
45,46,2020-08-13 11:15:00,854,2.7,586,293,30.1,17,-31,9.0,2020-08-13 07:15:00.000
46,47,2020-08-13 11:30:00,917,2.8,758,185,30.2,15,-19,3.2,2020-08-13 07:30:00.000
47,48,2020-08-13 11:45:00,952,3.0,848,130,30.3,14,-6,0.0,2020-08-13 07:45:00.000
48,49,2020-08-13 12:00:00,952,3.1,850,129,30.3,14,9,0.0,2020-08-13 08:00:00.000
49,50,2020-08-13 12:15:00,947,3.1,850,128,30.4,15,23,0.0,2020-08-13 08:15:00.000
50,51,2020-08-13 12:30:00,938,3.1,849,127,30.4,17,34,0.0,2020-08-13 08:30:00.000
51,52,2020-08-13 12:45:00,924,3.1,848,125,30.4,20,43,0.0,2020-08-13 08:45:00.000
52,53,2020-08-13 13:00:00,905,3.1,845,123,30.4,22,49,0.0,2020-08-13 09:00:00.000
53,54,2020-08-13 13:15:00,882,2.9,842,121,30.4,25,55,0.0,2020-08-13 09:15:00.000
54,55,2020-08-13 13:30:00,855,2.8,837,118,30.4,28,59,0.0,2020-08-13 09:30:00.000
55,56,2020-08-13 13:45:00,824,2.6,833,115,30.4,32,62,0.0,2020-08-13 09:45:00.000
56,57,2020-08-13 14:00:00,788,2.5,827,111,30.3,35,64,0.0,2020-08-13 10:00:00.000
57,58,2020-08-13 14:15:00,749,2.4,821,106,30.2,38,66,0.0,2020-08-13 10:15:00.000
58,59,2020-08-13 14:30:00,707,2.3,812,102,30.2,42,68,0.0,2020-08-13 10:30:00.000
59,60,2020-08-13 14:45:00,661,2.2,800,98,30.1,45,70,0.0,2020-08-13 10:45:00.000
60,61,2020-08-13 15:00:00,612,2.2,786,94,29.9,49,71,0.0,2020-08-13 11:00:00.000
61,62,2020-08-13 15:15:00,560,2.1,770,90,29.7,52,72,0.0,2020-08-13 11:15:00.000
62,63,2020-08-13 15:30:00,505,2.0,750,86,29.5,56,72,0.0,2020-08-13 11:30:00.000
63,64,2020-08-13 15:45:00,449,1.9,726,81,29.3,60,73,0.0,2020-08-13 11:45:00.000
64,65,2020-08-13 16:00:00,391,1.7,698,76,29.1,63,74,0.0,2020-08-13 12:00:00.000
65,66,2020-08-13 16:15:00,332,1.6,663,70,28.7,67,74,0.0,2020-08-13 12:15:00.000
66,67,2020-08-13 16:30:00,272,1.5,619,64,28.3,70,74,0.0,2020-08-13 12:30:00.000
67,68,2020-08-13 16:45:00,213,1.3,565,56,28.0,74,75,0.0,2020-08-13 12:45:00.000
68,69,2020-08-13 17:00:00,154,1.2,495,48,27.5,78,75,0.0,2020-08-13 13:00:00.000
69,70,2020-08-13 17:15:00,100,1.1,401,38,26.7,81,75,0.0,2020-08-13 13:15:00.000
70,71,2020-08-13 17:30:00,47,1.1,166,30,25.9,85,75,7.2,2020-08-13 13:30:00.000
71,72,2020-08-13 17:45:00,10,1.1,0,10,25.1,88,75,18.0,2020-08-13 13:45:00.000
72,73,2020-08-13 18:00:00,0,1.0,0,0,24.4,92,75,19.6,2020-08-13 14:00:00.000
73,74,2020-08-13 18:15:00,0,1.1,0,0,24.2,96,75,20.0,2020-08-13 14:15:00.000
74,75,2020-08-13 18:30:00,0,1.2,0,0,24.0,99,75,19.2,2020-08-13 14:30:00.000
75,76,2020-08-13 18:45:00,0,1.2,0,0,23.9,103,75,20.0,2020-08-13 14:45:00.000
76,77,2020-08-13 19:00:00,0,1.2,0,0,23.7,107,74,22.4,2020-08-13 15:00:00.000
77,78,2020-08-13 19:15:00,0,1.1,0,0,23.6,110,74,21.6,2020-08-13 15:15:00.000
78,79,2020-08-13 19:30:00,0,1.0,0,0,23.5,114,74,21.4,2020-08-13 15:30:00.000
79,80,2020-08-13 19:45:00,0,0.9,0,0,23.4,117,73,23.7,2020-08-13 15:45:00.000
80,81,2020-08-13 20:00:00,0,0.8,0,0,23.3,121,72,16.4,2020-08-13 16:00:00.000
81,82,2020-08-13 20:15:00,0,0.8,0,0,23.2,125,72,13.0,2020-08-13 16:15:00.000
82,83,2020-08-13 20:30:00,0,0.9,0,0,23.2,128,71,13.0,2020-08-13 16:30:00.000
83,84,2020-08-13 20:45:00,0,0.9,0,0,23.1,132,69,12.0,2020-08-13 16:45:00.000
84,85,2020-08-13 21:00:00,0,0.9,0,0,23.0,135,68,12.8,2020-08-13 17:00:00.000
85,86,2020-08-13 21:15:00,0,0.9,0,0,22.9,139,67,13.0,2020-08-13 17:15:00.000
86,87,2020-08-13 21:30:00,0,0.9,0,0,22.9,142,65,13.0,2020-08-13 17:30:00.000
87,88,2020-08-13 21:45:00,0,0.9,0,0,22.8,145,62,14.0,2020-08-13 17:45:00.000
88,89,2020-08-13 22:00:00,0,0.8,0,0,22.7,149,60,14.0,2020-08-13 18:00:00.000
89,90,2020-08-13 22:15:00,0,0.8,0,0,22.6,152,56,14.0,2020-08-13 18:15:00.000
90,91,2020-08-13 22:30:00,0,0.8,0,0,22.6,155,52,14.0,2020-08-13 18:30:00.000
91,92,2020-08-13 22:45:00,0,0.7,0,0,22.5,158,46,14.0,2020-08-13 18:45:00.000
92,93,2020-08-13 23:00:00,0,0.7,0,0,22.4,160,39,13.2,2020-08-13 19:00:00.000
93,94,2020-08-13 23:15:00,0,0.7,0,0,22.3,162,29,13.0,2020-08-13 19:15:00.000
94,95,2020-08-13 23:30:00,0,0.6,0,0,22.3,164,18,13.0,2020-08-13 19:30:00.000
95,96,2020-08-13 23:45:00,0,0.6,0,0,22.2,165,5,14.0,2020-08-13 19:45:00.000
