,BLOCK_ID,DATA_DATETIME,GHI,WIND_SPEED,DNI,DHI,TEMPERATURE,ZENITH,AZIMUTH,CLOUD_OPACITY,ENTRY_TIME
0,1,2020-02-16 00:00:00,0,1.9,0,0,23.3,168,-180,0.0,2020-02-15 20:00:00.000
1,2,2020-02-16 00:15:00,0,1.9,0,0,23.3,167,-164,0.0,2020-02-15 20:15:00.000
2,3,2020-02-16 00:30:00,0,1.8,0,0,23.2,165,-150,0.0,2020-02-15 20:30:00.000
3,4,2020-02-16 00:45:00,0,1.8,0,0,23.2,163,-139,0.0,2020-02-15 20:45:00.000
4,5,2020-02-16 01:00:00,0,1.8,0,0,23.2,161,-131,0.0,2020-02-15 21:00:00.000
5,6,2020-02-16 01:15:00,0,1.7,0,0,23.2,158,-125,0.0,2020-02-15 21:15:00.000
6,7,2020-02-16 01:30:00,0,1.7,0,0,23.1,154,-120,0.0,2020-02-15 21:30:00.000
7,8,2020-02-16 01:45:00,0,1.6,0,0,23.1,151,-117,0.0,2020-02-15 21:45:00.000
8,9,2020-02-16 02:00:00,0,1.6,0,0,23.1,148,-114,0.0,2020-02-15 22:00:00.000
9,10,2020-02-16 02:15:00,0,1.6,0,0,23.0,144,-112,0.0,2020-02-15 22:15:00.000
10,11,2020-02-16 02:30:00,0,1.6,0,0,23.0,141,-110,0.0,2020-02-15 22:30:00.000
11,12,2020-02-16 02:45:00,0,1.6,0,0,22.9,137,-109,0.0,2020-02-15 22:45:00.000
12,13,2020-02-16 03:00:00,0,1.6,0,0,22.9,134,-108,0.0,2020-02-15 23:00:00.000
13,14,2020-02-16 03:15:00,0,1.6,0,0,22.9,130,-107,0.0,2020-02-15 23:15:00.000
14,15,2020-02-16 03:30:00,0,1.6,0,0,22.9,127,-106,0.0,2020-02-15 23:30:00.000
15,16,2020-02-16 03:45:00,0,1.6,0,0,23.0,123,-105,0.0,2020-02-15 23:45:00.000
16,17,2020-02-16 04:00:00,0,1.6,0,0,23.0,119,-105,0.0,2020-02-16 00:00:00.000
17,18,2020-02-16 04:15:00,0,1.6,0,0,23.0,116,-104,0.0,2020-02-16 00:15:00.000
18,19,2020-02-16 04:30:00,0,1.6,0,0,23.0,112,-104,0.0,2020-02-16 00:30:00.000
19,20,2020-02-16 04:45:00,0,1.6,0,0,23.1,108,-104,0.0,2020-02-16 00:45:00.000
20,21,2020-02-16 05:00:00,0,1.6,0,0,23.1,105,-103,0.0,2020-02-16 01:00:00.000
21,22,2020-02-16 05:15:00,0,1.6,0,0,23.1,101,-103,0.0,2020-02-16 01:15:00.000
22,23,2020-02-16 05:30:00,0,1.6,0,0,23.1,97,-103,0.0,2020-02-16 01:30:00.000
23,24,2020-02-16 05:45:00,0,1.6,0,0,23.1,94,-103,0.0,2020-02-16 01:45:00.000
24,25,2020-02-16 06:00:00,2,1.6,1,1,23.2,90,-103,0.0,2020-02-16 02:00:00.000
25,26,2020-02-16 06:15:00,29,1.6,57,24,23.4,86,-103,2.8,2020-02-16 02:15:00.000
26,27,2020-02-16 06:30:00,59,1.6,14,58,23.6,83,-103,20.4,2020-02-16 02:30:00.000
27,28,2020-02-16 06:45:00,103,1.6,49,94,23.8,79,-103,20.6,2020-02-16 02:45:00.000
28,29,2020-02-16 07:00:00,161,1.6,180,115,24.1,76,-104,15.7,2020-02-16 03:00:00.000
29,30,2020-02-16 07:15:00,241,1.6,442,102,24.6,72,-104,5.3,2020-02-16 03:15:00.000
30,31,2020-02-16 07:30:00,317,1.6,623,86,25.1,68,-104,0.0,2020-02-16 03:30:00.000
31,32,2020-02-16 07:45:00,381,1.6,671,93,25.6,65,-105,0.0,2020-02-16 03:45:00.000
32,33,2020-02-16 08:00:00,444,1.7,711,99,26.1,61,-105,0.0,2020-02-16 04:00:00.000
33,34,2020-02-16 08:15:00,506,1.7,745,104,26.4,57,-106,0.0,2020-02-16 04:15:00.000
34,35,2020-02-16 08:30:00,566,1.8,773,109,26.8,54,-107,0.0,2020-02-16 04:30:00.000
35,36,2020-02-16 08:45:00,623,1.8,797,113,27.1,50,-108,0.0,2020-02-16 04:45:00.000
36,37,2020-02-16 09:00:00,677,1.9,817,116,27.5,47,-109,0.0,2020-02-16 05:00:00.000
37,38,2020-02-16 09:15:00,728,1.9,834,120,27.7,43,-110,0.0,2020-02-16 05:15:00.000
38,39,2020-02-16 09:30:00,776,1.9,848,122,28.0,40,-111,0.0,2020-02-16 05:30:00.000
39,40,2020-02-16 09:45:00,820,1.9,861,125,28.2,36,-113,0.0,2020-02-16 05:45:00.000
40,41,2020-02-16 10:00:00,860,1.9,871,127,28.4,33,-116,0.0,2020-02-16 06:00:00.000
41,42,2020-02-16 10:15:00,880,1.9,824,162,28.3,29,-118,1.8,2020-02-16 06:15:00.000
42,43,2020-02-16 10:30:00,917,1.9,850,153,28.3,26,-122,1.2,2020-02-16 06:30:00.000
43,44,2020-02-16 10:45:00,903,1.9,723,238,28.3,23,-127,5.3,2020-02-16 06:45:00.000
44,45,2020-02-16 11:00:00,899,1.9,647,291,28.3,20,-133,7.8,2020-02-16 07:00:00.000
45,46,2020-02-16 11:15:00,971,2.0,827,183,28.2,18,-141,2.0,2020-02-16 07:15:00.000
46,47,2020-02-16 11:30:00,905,2.1,590,336,28.2,15,-152,9.8,2020-02-16 07:30:00.000
47,48,2020-02-16 11:45:00,911,2.2,589,340,28.2,14,-165,9.9,2020-02-16 07:45:00.000
48,49,2020-02-16 12:00:00,947,2.3,689,277,28.2,14,180,6.5,2020-02-16 08:00:00.000
49,50,2020-02-16 12:15:00,884,2.5,515,384,28.2,14,165,12.6,2020-02-16 08:15:00.000
50,51,2020-02-16 12:30:00,791,2.6,302,500,28.2,15,151,21.2,2020-02-16 08:30:00.000
51,52,2020-02-16 12:45:00,768,2.7,269,512,28.1,18,141,22.5,2020-02-16 08:45:00.000
52,53,2020-02-16 13:00:00,858,2.9,539,352,28.2,20,133,11.8,2020-02-16 09:00:00.000
53,54,2020-02-16 13:15:00,854,3.1,572,328,28.3,23,127,10.2,2020-02-16 09:15:00.000
54,55,2020-02-16 13:30:00,830,3.3,565,322,28.4,26,122,10.2,2020-02-16 09:30:00.000
55,56,2020-02-16 13:45:00,800,3.6,553,318,28.6,29,118,10.1,2020-02-16 09:45:00.000
56,57,2020-02-16 14:00:00,821,3.7,727,210,28.7,33,115,3.5,2020-02-16 10:00:00.000
57,58,2020-02-16 14:15:00,808,3.8,801,160,28.7,36,113,0.0,2020-02-16 10:15:00.000
58,59,2020-02-16 14:30:00,761,3.9,776,163,28.7,40,111,0.0,2020-02-16 10:30:00.000
59,60,2020-02-16 14:45:00,713,3.9,759,159,28.8,43,110,0.0,2020-02-16 10:45:00.000
60,61,2020-02-16 15:00:00,662,4.0,740,154,28.7,47,108,0.0,2020-02-16 11:00:00.000
61,62,2020-02-16 15:15:00,608,4.0,719,148,28.6,50,107,0.0,2020-02-16 11:15:00.000
62,63,2020-02-16 15:30:00,551,4.0,694,141,28.5,54,106,0.0,2020-02-16 11:30:00.000
63,64,2020-02-16 15:45:00,492,4.0,667,133,28.3,57,106,0.0,2020-02-16 11:45:00.000
64,65,2020-02-16 16:00:00,432,4.0,635,124,28.1,61,105,0.0,2020-02-16 12:00:00.000
65,66,2020-02-16 16:15:00,370,4.0,596,114,27.8,65,105,0.0,2020-02-16 12:15:00.000
66,67,2020-02-16 16:30:00,289,4.0,408,136,27.6,68,104,6.1,2020-02-16 12:30:00.000
67,68,2020-02-16 16:45:00,191,4.0,135,147,27.3,72,104,22.9,2020-02-16 12:45:00.000
68,69,2020-02-16 17:00:00,97,3.9,0,97,26.9,76,103,47.2,2020-02-16 13:00:00.000
69,70,2020-02-16 17:15:00,62,3.8,0,62,26.5,79,103,50.2,2020-02-16 13:15:00.000
70,71,2020-02-16 17:30:00,46,3.6,0,46,26.1,83,103,33.8,2020-02-16 13:30:00.000
71,72,2020-02-16 17:45:00,29,3.4,74,22,25.7,86,103,0.0,2020-02-16 13:45:00.000
72,73,2020-02-16 18:00:00,2,3.3,3,2,25.3,90,103,0.0,2020-02-16 14:00:00.000
73,74,2020-02-16 18:15:00,0,3.2,0,0,25.1,94,103,0.0,2020-02-16 14:15:00.000
74,75,2020-02-16 18:30:00,0,3.0,0,0,24.9,97,103,0.0,2020-02-16 14:30:00.000
75,76,2020-02-16 18:45:00,0,2.9,0,0,24.7,101,103,0.0,2020-02-16 14:45:00.000
76,77,2020-02-16 19:00:00,0,2.8,0,0,24.5,105,103,0.0,2020-02-16 15:00:00.000
77,78,2020-02-16 19:15:00,0,2.7,0,0,24.4,108,103,0.0,2020-02-16 15:15:00.000
78,79,2020-02-16 19:30:00,0,2.5,0,0,24.3,112,104,0.0,2020-02-16 15:30:00.000
79,80,2020-02-16 19:45:00,0,2.4,0,0,24.2,116,104,0.0,2020-02-16 15:45:00.000
80,81,2020-02-16 20:00:00,0,2.3,0,0,24.1,119,104,0.0,2020-02-16 16:00:00.000
81,82,2020-02-16 20:15:00,0,2.3,0,0,24.0,123,105,0.0,2020-02-16 16:15:00.000
82,83,2020-02-16 20:30:00,0,2.3,0,0,23.9,127,106,0.0,2020-02-16 16:30:00.000
83,84,2020-02-16 20:45:00,0,2.3,0,0,23.8,130,106,0.0,2020-02-16 16:45:00.000
84,85,2020-02-16 21:00:00,0,2.3,0,0,23.8,134,107,0.0,2020-02-16 17:00:00.000
85,86,2020-02-16 21:15:00,0,2.2,0,0,23.7,137,108,0.0,2020-02-16 17:15:00.000
86,87,2020-02-16 21:30:00,0,2.2,0,0,23.7,141,110,0.0,2020-02-16 17:30:00.000
87,88,2020-02-16 21:45:00,0,2.1,0,0,23.6,144,111,0.0,2020-02-16 17:45:00.000
88,89,2020-02-16 22:00:00,0,2.1,0,0,23.6,148,113,0.0,2020-02-16 18:00:00.000
89,90,2020-02-16 22:15:00,0,2.1,0,0,23.5,151,116,0.0,2020-02-16 18:15:00.000
90,91,2020-02-16 22:30:00,0,2.1,0,0,23.4,155,120,0.0,2020-02-16 18:30:00.000
91,92,2020-02-16 22:45:00,0,2.0,0,0,23.4,158,124,0.0,2020-02-16 18:45:00.000
92,93,2020-02-16 23:00:00,0,2.0,0,0,23.3,161,130,0.0,2020-02-16 19:00:00.000
93,94,2020-02-16 23:15:00,0,2.0,0,0,23.2,164,138,0.0,2020-02-16 19:15:00.000
94,95,2020-02-16 23:30:00,0,2.0,0,0,23.2,166,149,0.0,2020-02-16 19:30:00.000
95,96,2020-02-16 23:45:00,0,2.0,0,0,23.1,167,163,0.0,2020-02-16 19:45:00.000
