,BLOCK_ID,DATA_DATETIME,GHI,WIND_SPEED,DNI,DHI,TEMPERATURE,ZENITH,AZIMUTH,CLOUD_OPACITY,ENTRY_TIME
0,1,2018-11-25 00:00:00,0,3.0,0,0,27.2,159,-162,36.2,2018-11-24 20:00:00.000
1,2,2018-11-25 00:15:00,0,3.1,0,0,27.2,158,-153,36.2,2018-11-24 20:15:00.000
2,3,2018-11-25 00:30:00,0,3.1,0,0,27.2,156,-146,36.2,2018-11-24 20:30:00.000
3,4,2018-11-25 00:45:00,0,3.2,0,0,27.2,153,-139,36.2,2018-11-24 20:45:00.000
4,5,2018-11-25 01:00:00,0,3.3,0,0,27.2,151,-134,36.7,2018-11-24 21:00:00.000
5,6,2018-11-25 01:15:00,0,3.3,0,0,27.1,148,-130,36.8,2018-11-24 21:15:00.000
6,7,2018-11-25 01:30:00,0,3.4,0,0,27.1,145,-126,36.8,2018-11-24 21:30:00.000
7,8,2018-11-25 01:45:00,0,3.5,0,0,27.1,142,-124,36.8,2018-11-24 21:45:00.000
8,9,2018-11-25 02:00:00,0,3.6,0,0,27.1,139,-121,36.8,2018-11-24 22:00:00.000
9,10,2018-11-25 02:15:00,0,3.6,0,0,27.1,136,-119,37.3,2018-11-24 22:15:00.000
10,11,2018-11-25 02:30:00,0,3.7,0,0,27.0,132,-117,43.2,2018-11-24 22:30:00.000
11,12,2018-11-25 02:45:00,0,3.7,0,0,27.0,129,-116,36.8,2018-11-24 22:45:00.000
12,13,2018-11-25 03:00:00,0,3.8,0,0,27.0,126,-115,36.8,2018-11-24 23:00:00.000
13,14,2018-11-25 03:15:00,0,3.9,0,0,27.0,122,-114,36.8,2018-11-24 23:15:00.000
14,15,2018-11-25 03:30:00,0,3.9,0,0,26.9,119,-113,7.4,2018-11-24 23:30:00.000
15,16,2018-11-25 03:45:00,0,4.0,0,0,26.9,115,-112,0.0,2018-11-24 23:45:00.000
16,17,2018-11-25 04:00:00,0,4.0,0,0,26.9,112,-112,0.0,2018-11-25 00:00:00.000
17,18,2018-11-25 04:15:00,0,4.1,0,0,26.9,108,-111,0.0,2018-11-25 00:15:00.000
18,19,2018-11-25 04:30:00,0,4.2,0,0,26.8,105,-111,0.0,2018-11-25 00:30:00.000
19,20,2018-11-25 04:45:00,0,4.2,0,0,26.8,101,-111,0.0,2018-11-25 00:45:00.000
20,21,2018-11-25 05:00:00,0,4.2,0,0,26.8,98,-110,0.0,2018-11-25 01:00:00.000
21,22,2018-11-25 05:15:00,0,4.1,0,0,26.8,94,-110,0.0,2018-11-25 01:15:00.000
22,23,2018-11-25 05:30:00,0,4.1,0,0,26.8,91,-110,0.0,2018-11-25 01:30:00.000
23,24,2018-11-25 05:45:00,21,4.0,52,16,26.8,87,-110,0.0,2018-11-25 01:45:00.000
24,25,2018-11-25 06:00:00,59,3.9,197,37,26.8,84,-111,0.0,2018-11-25 02:00:00.000
25,26,2018-11-25 06:15:00,97,3.8,152,69,26.8,80,-111,10.1,2018-11-25 02:15:00.000
26,27,2018-11-25 06:30:00,161,3.7,391,71,26.8,77,-111,0.4,2018-11-25 02:30:00.000
27,28,2018-11-25 06:45:00,219,3.6,472,83,26.8,73,-112,0.0,2018-11-25 02:45:00.000
28,29,2018-11-25 07:00:00,261,3.5,392,127,26.8,70,-112,6.1,2018-11-25 03:00:00.000
29,30,2018-11-25 07:15:00,338,3.4,581,105,26.8,66,-113,0.0,2018-11-25 03:15:00.000
30,31,2018-11-25 07:30:00,398,3.3,623,114,26.8,63,-113,0.0,2018-11-25 03:30:00.000
31,32,2018-11-25 07:45:00,456,3.3,658,122,26.8,59,-114,0.0,2018-11-25 03:45:00.000
32,33,2018-11-25 08:00:00,512,3.2,688,128,26.8,56,-115,0.0,2018-11-25 04:00:00.000
33,34,2018-11-25 08:15:00,566,3.1,713,134,26.8,53,-117,0.0,2018-11-25 04:15:00.000
34,35,2018-11-25 08:30:00,618,3.1,736,139,26.8,49,-118,0.0,2018-11-25 04:30:00.000
35,36,2018-11-25 08:45:00,604,3.1,542,233,26.8,46,-120,9.2,2018-11-25 04:45:00.000
36,37,2018-11-25 09:00:00,466,3.1,10,459,26.8,43,-122,34.6,2018-11-25 05:00:00.000
37,38,2018-11-25 09:15:00,748,3.0,757,166,26.8,40,-124,1.0,2018-11-25 05:15:00.000
38,39,2018-11-25 09:30:00,790,3.0,780,164,26.8,37,-127,0.6,2018-11-25 05:30:00.000
39,40,2018-11-25 09:45:00,822,3.0,783,172,26.8,34,-130,0.9,2018-11-25 05:45:00.000
40,41,2018-11-25 10:00:00,860,3.0,818,159,26.8,31,-134,0.0,2018-11-25 06:00:00.000
41,42,2018-11-25 10:15:00,792,3.0,523,333,26.8,28,-139,10.6,2018-11-25 06:15:00.000
42,43,2018-11-25 10:30:00,766,2.9,389,416,26.8,26,-145,15.7,2018-11-25 06:30:00.000
43,44,2018-11-25 10:45:00,850,2.9,592,310,26.8,24,-152,8.2,2018-11-25 06:45:00.000
44,45,2018-11-25 11:00:00,795,2.9,411,416,26.8,23,-160,15.3,2018-11-25 07:00:00.000
45,46,2018-11-25 11:15:00,788,3.0,579,250,26.8,22,-169,16.7,2018-11-25 07:15:00.000
46,47,2018-11-25 11:30:00,220,3.0,0,220,26.7,21,-178,76.9,2018-11-25 07:30:00.000
47,48,2018-11-25 11:45:00,499,3.1,0,499,26.7,21,172,47.4,2018-11-25 07:45:00.000
48,49,2018-11-25 12:00:00,824,3.1,669,205,26.6,22,163,12.5,2018-11-25 08:00:00.000
49,50,2018-11-25 12:15:00,932,3.1,839,162,26.6,23,155,0.0,2018-11-25 08:15:00.000
50,51,2018-11-25 12:30:00,916,3.2,836,161,26.6,25,147,0.0,2018-11-25 08:30:00.000
51,52,2018-11-25 12:45:00,751,3.2,422,375,26.5,27,141,16.3,2018-11-25 08:45:00.000
52,53,2018-11-25 13:00:00,798,3.3,628,256,26.5,30,136,8.3,2018-11-25 09:00:00.000
53,54,2018-11-25 13:15:00,826,3.3,758,189,26.4,33,132,1.9,2018-11-25 09:15:00.000
54,55,2018-11-25 13:30:00,782,3.4,705,208,26.4,36,128,3.4,2018-11-25 09:30:00.000
55,56,2018-11-25 13:45:00,747,3.4,700,201,26.3,39,125,3.1,2018-11-25 09:45:00.000
56,57,2018-11-25 14:00:00,723,3.4,750,164,26.3,42,123,1.0,2018-11-25 10:00:00.000
57,58,2018-11-25 14:15:00,636,3.3,557,242,26.3,45,120,7.2,2018-11-25 10:15:00.000
58,59,2018-11-25 14:30:00,609,3.3,616,199,26.4,48,119,4.4,2018-11-25 10:30:00.000
59,60,2018-11-25 14:45:00,440,3.2,148,350,26.4,51,117,24.8,2018-11-25 10:45:00.000
60,61,2018-11-25 15:00:00,505,3.1,559,184,26.4,55,116,5.4,2018-11-25 11:00:00.000
61,62,2018-11-25 15:15:00,477,3.0,667,125,26.4,58,115,0.5,2018-11-25 11:15:00.000
62,63,2018-11-25 15:30:00,420,2.9,643,115,26.5,62,114,0.3,2018-11-25 11:30:00.000
63,64,2018-11-25 15:45:00,259,2.8,69,229,26.5,65,113,29.2,2018-11-25 11:45:00.000
64,65,2018-11-25 16:00:00,211,2.7,16,205,26.5,69,112,30.6,2018-11-25 12:00:00.000
65,66,2018-11-25 16:15:00,241,2.6,480,91,26.5,72,112,2.3,2018-11-25 12:15:00.000
66,67,2018-11-25 16:30:00,146,2.6,70,126,26.6,76,111,22.6,2018-11-25 12:30:00.000
67,68,2018-11-25 16:45:00,128,2.5,341,61,26.6,79,111,2.8,2018-11-25 12:45:00.000
68,69,2018-11-25 17:00:00,73,2.4,163,51,26.6,83,111,8.0,2018-11-25 13:00:00.000
69,70,2018-11-25 17:15:00,25,2.4,14,23,26.5,86,111,25.1,2018-11-25 13:15:00.000
70,71,2018-11-25 17:30:00,4,2.4,9,3,26.5,90,110,0.0,2018-11-25 13:30:00.000
71,72,2018-11-25 17:45:00,0,2.4,0,0,26.4,93,110,0.0,2018-11-25 13:45:00.000
72,73,2018-11-25 18:00:00,0,2.4,0,0,26.4,97,111,0.0,2018-11-25 14:00:00.000
73,74,2018-11-25 18:15:00,0,2.4,0,0,26.3,100,111,0.0,2018-11-25 14:15:00.000
74,75,2018-11-25 18:30:00,0,2.4,0,0,26.3,104,111,31.8,2018-11-25 14:30:00.000
75,76,2018-11-25 18:45:00,0,2.5,0,0,26.2,107,111,36.0,2018-11-25 14:45:00.000
76,77,2018-11-25 19:00:00,0,2.5,0,0,26.2,111,112,36.0,2018-11-25 15:00:00.000
77,78,2018-11-25 19:15:00,0,2.5,0,0,26.2,114,112,36.0,2018-11-25 15:15:00.000
78,79,2018-11-25 19:30:00,0,2.6,0,0,26.1,118,113,36.0,2018-11-25 15:30:00.000
79,80,2018-11-25 19:45:00,0,2.6,0,0,26.1,121,114,35.4,2018-11-25 15:45:00.000
80,81,2018-11-25 20:00:00,0,2.7,0,0,26.0,124,115,36.0,2018-11-25 16:00:00.000
81,82,2018-11-25 20:15:00,0,2.6,0,0,26.1,128,116,36.0,2018-11-25 16:15:00.000
82,83,2018-11-25 20:30:00,0,2.6,0,0,26.2,131,117,36.7,2018-11-25 16:30:00.000
83,84,2018-11-25 20:45:00,0,2.6,0,0,26.3,134,119,36.8,2018-11-25 16:45:00.000
84,85,2018-11-25 21:00:00,0,2.6,0,0,26.4,138,121,36.8,2018-11-25 17:00:00.000
85,86,2018-11-25 21:15:00,0,2.5,0,0,26.5,141,123,36.8,2018-11-25 17:15:00.000
86,87,2018-11-25 21:30:00,0,2.5,0,0,26.6,144,126,36.8,2018-11-25 17:30:00.000
87,88,2018-11-25 21:45:00,0,2.5,0,0,26.7,147,129,36.8,2018-11-25 17:45:00.000
88,89,2018-11-25 22:00:00,0,2.5,0,0,26.8,150,133,36.3,2018-11-25 18:00:00.000
89,90,2018-11-25 22:15:00,0,2.5,0,0,26.9,152,138,36.2,2018-11-25 18:15:00.000
90,91,2018-11-25 22:30:00,0,2.6,0,0,27.0,155,143,30.7,2018-11-25 18:30:00.000
91,92,2018-11-25 22:45:00,0,2.6,0,0,27.1,157,150,34.4,2018-11-25 18:45:00.000
92,93,2018-11-25 23:00:00,0,2.6,0,0,27.2,159,159,35.1,2018-11-25 19:00:00.000
93,94,2018-11-25 23:15:00,0,2.6,0,0,27.2,160,168,35.1,2018-11-25 19:15:00.000
94,95,2018-11-25 23:30:00,0,2.6,0,0,27.1,160,178,25.8,2018-11-25 19:30:00.000
95,96,2018-11-25 23:45:00,0,2.7,0,0,27.1,160,-172,36.0,2018-11-25 19:45:00.000
