,BLOCK_ID,DATA_DATETIME,GHI,WIND_SPEED,DNI,DHI,TEMPERATURE,ZENITH,AZIMUTH,CLOUD_OPACITY,ENTRY_TIME
0,1,2020-06-28 00:00:00,0,0.3,0,0,21.9,156,-7,97.0,2020-06-27 20:00:00.000
1,2,2020-06-28 00:15:00,0,0.2,0,0,21.9,155,-15,97.0,2020-06-27 20:15:00.000
2,3,2020-06-28 00:30:00,0,0.2,0,0,21.9,154,-22,96.5,2020-06-27 20:30:00.000
3,4,2020-06-28 00:45:00,0,0.2,0,0,21.9,152,-29,96.7,2020-06-27 20:45:00.000
4,5,2020-06-28 01:00:00,0,0.1,0,0,21.9,150,-35,90.4,2020-06-27 21:00:00.000
5,6,2020-06-28 01:15:00,0,0.2,0,0,21.9,148,-40,68.5,2020-06-27 21:15:00.000
6,7,2020-06-28 01:30:00,0,0.3,0,0,21.9,146,-44,69.0,2020-06-27 21:30:00.000
7,8,2020-06-28 01:45:00,0,0.4,0,0,21.9,143,-48,70.0,2020-06-27 21:45:00.000
8,9,2020-06-28 02:00:00,0,0.4,0,0,21.9,140,-51,74.2,2020-06-27 22:00:00.000
9,10,2020-06-28 02:15:00,0,0.4,0,0,21.8,137,-54,88.2,2020-06-27 22:15:00.000
10,11,2020-06-28 02:30:00,0,0.3,0,0,21.8,134,-56,85.4,2020-06-27 22:30:00.000
11,12,2020-06-28 02:45:00,0,0.3,0,0,21.8,131,-58,87.4,2020-06-27 22:45:00.000
12,13,2020-06-28 03:00:00,0,0.2,0,0,21.7,128,-59,67.6,2020-06-27 23:00:00.000
13,14,2020-06-28 03:15:00,0,0.2,0,0,21.7,124,-61,91.2,2020-06-27 23:15:00.000
14,15,2020-06-28 03:30:00,0,0.2,0,0,21.7,121,-62,86.2,2020-06-27 23:30:00.000
15,16,2020-06-28 03:45:00,0,0.2,0,0,21.7,118,-63,79.2,2020-06-27 23:45:00.000
16,17,2020-06-28 04:00:00,0,0.2,0,0,21.6,114,-64,61.8,2020-06-28 00:00:00.000
17,18,2020-06-28 04:15:00,0,0.2,0,0,21.6,111,-65,42.0,2020-06-28 00:15:00.000
18,19,2020-06-28 04:30:00,0,0.2,0,0,21.6,108,-65,22.8,2020-06-28 00:30:00.000
19,20,2020-06-28 04:45:00,0,0.2,0,0,21.6,104,-66,26.4,2020-06-28 00:45:00.000
20,21,2020-06-28 05:00:00,0,0.2,0,0,21.6,101,-66,34.2,2020-06-28 01:00:00.000
21,22,2020-06-28 05:15:00,0,0.2,0,0,21.6,97,-66,35.6,2020-06-28 01:15:00.000
22,23,2020-06-28 05:30:00,0,0.3,0,0,21.7,94,-67,43.4,2020-06-28 01:30:00.000
23,24,2020-06-28 05:45:00,1,0.3,0,1,21.7,91,-67,58.0,2020-06-28 01:45:00.000
24,25,2020-06-28 06:00:00,11,0.3,0,11,21.7,87,-67,54.8,2020-06-28 02:00:00.000
25,26,2020-06-28 06:15:00,44,0.3,0,44,22.0,84,-67,31.6,2020-06-28 02:15:00.000
26,27,2020-06-28 06:30:00,81,0.3,3,81,22.2,80,-66,26.8,2020-06-28 02:30:00.000
27,28,2020-06-28 06:45:00,108,0.4,0,108,22.5,77,-66,33.5,2020-06-28 02:45:00.000
28,29,2020-06-28 07:00:00,139,0.4,0,139,22.8,73,-66,35.5,2020-06-28 03:00:00.000
29,30,2020-06-28 07:15:00,184,0.4,16,178,23.3,70,-65,32.5,2020-06-28 03:15:00.000
30,31,2020-06-28 07:30:00,216,0.4,11,212,23.9,67,-65,33.8,2020-06-28 03:30:00.000
31,32,2020-06-28 07:45:00,246,0.5,0,246,24.5,63,-64,35.3,2020-06-28 03:45:00.000
32,33,2020-06-28 08:00:00,330,0.6,177,240,24.9,60,-63,24.0,2020-06-28 04:00:00.000
33,34,2020-06-28 08:15:00,363,0.6,157,275,25.1,57,-62,25.3,2020-06-28 04:15:00.000
34,35,2020-06-28 08:30:00,441,0.7,315,253,25.3,53,-61,17.4,2020-06-28 04:30:00.000
35,36,2020-06-28 08:45:00,500,0.8,397,244,25.5,50,-59,14.1,2020-06-28 04:45:00.000
36,37,2020-06-28 09:00:00,571,0.9,535,205,25.6,47,-58,8.8,2020-06-28 05:00:00.000
37,38,2020-06-28 09:15:00,656,0.9,735,125,25.7,44,-56,1.8,2020-06-28 05:15:00.000
38,39,2020-06-28 09:30:00,699,1.0,763,119,25.8,41,-53,1.2,2020-06-28 05:30:00.000
39,40,2020-06-28 09:45:00,706,1.0,679,170,25.9,38,-51,4.8,2020-06-28 05:45:00.000
40,41,2020-06-28 10:00:00,588,1.0,221,407,26.0,35,-47,24.0,2020-06-28 06:00:00.000
41,42,2020-06-28 10:15:00,535,1.1,104,445,26.1,32,-43,33.4,2020-06-28 06:15:00.000
42,43,2020-06-28 10:30:00,757,1.1,590,244,26.1,30,-39,8.4,2020-06-28 06:30:00.000
43,44,2020-06-28 10:45:00,827,1.2,761,152,26.2,27,-33,2.2,2020-06-28 06:45:00.000
44,45,2020-06-28 11:00:00,861,1.2,827,116,26.2,26,-27,0.0,2020-06-28 07:00:00.000
45,46,2020-06-28 11:15:00,859,1.2,782,146,26.1,24,-19,1.5,2020-06-28 07:15:00.000
46,47,2020-06-28 11:30:00,814,1.2,612,251,26.1,23,-11,7.4,2020-06-28 07:30:00.000
47,48,2020-06-28 11:45:00,870,1.2,783,148,26.0,23,-2,1.4,2020-06-28 07:45:00.000
48,49,2020-06-28 12:00:00,881,1.2,824,121,26.0,23,7,0.0,2020-06-28 08:00:00.000
49,50,2020-06-28 12:15:00,749,1.1,433,353,26.1,24,15,14.4,2020-06-28 08:15:00.000
50,51,2020-06-28 12:30:00,706,1.1,335,402,26.2,25,23,18.4,2020-06-28 08:30:00.000
51,52,2020-06-28 12:45:00,566,1.0,51,520,26.3,27,30,33.5,2020-06-28 08:45:00.000
52,53,2020-06-28 13:00:00,252,1.0,0,252,26.4,29,36,69.8,2020-06-28 09:00:00.000
53,54,2020-06-28 13:15:00,205,0.9,0,205,26.4,31,41,74.7,2020-06-28 09:15:00.000
54,55,2020-06-28 13:30:00,273,0.9,0,273,26.4,33,45,65.2,2020-06-28 09:30:00.000
55,56,2020-06-28 13:45:00,519,1.0,92,444,26.4,36,49,31.3,2020-06-28 09:45:00.000
56,57,2020-06-28 14:00:00,367,1.0,0,367,26.4,39,52,49.1,2020-06-28 10:00:00.000
57,58,2020-06-28 14:15:00,423,1.0,49,388,26.4,42,55,38.0,2020-06-28 10:15:00.000
58,59,2020-06-28 14:30:00,482,1.0,169,363,26.3,45,57,25.1,2020-06-28 10:30:00.000
59,60,2020-06-28 14:45:00,454,1.0,179,335,26.3,48,59,24.4,2020-06-28 10:45:00.000
60,61,2020-06-28 15:00:00,357,1.0,15,347,26.3,52,60,35.6,2020-06-28 11:00:00.000
61,62,2020-06-28 15:15:00,270,0.9,0,270,26.2,55,62,46.8,2020-06-28 11:15:00.000
62,63,2020-06-28 15:30:00,230,0.9,0,230,26.1,58,63,49.2,2020-06-28 11:30:00.000
63,64,2020-06-28 15:45:00,207,0.8,0,207,26.0,62,64,48.4,2020-06-28 11:45:00.000
64,65,2020-06-28 16:00:00,209,0.7,0,209,25.9,65,64,40.0,2020-06-28 12:00:00.000
65,66,2020-06-28 16:15:00,145,0.7,22,137,25.7,68,65,49.8,2020-06-28 12:15:00.000
66,67,2020-06-28 16:30:00,117,0.6,15,112,25.6,72,66,51.6,2020-06-28 12:30:00.000
67,68,2020-06-28 16:45:00,76,0.6,0,76,25.4,75,66,58.8,2020-06-28 12:45:00.000
68,69,2020-06-28 17:00:00,57,0.5,0,57,25.2,79,66,56.8,2020-06-28 13:00:00.000
69,70,2020-06-28 17:15:00,37,0.5,0,37,24.8,82,67,52.4,2020-06-28 13:15:00.000
70,71,2020-06-28 17:30:00,27,0.5,0,27,24.4,85,67,33.7,2020-06-28 13:30:00.000
71,72,2020-06-28 17:45:00,3,0.5,0,3,24.0,89,67,72.3,2020-06-28 13:45:00.000
72,73,2020-06-28 18:00:00,0,0.4,0,0,23.7,92,67,78.4,2020-06-28 14:00:00.000
73,74,2020-06-28 18:15:00,0,0.5,0,0,23.6,96,66,78.0,2020-06-28 14:15:00.000
74,75,2020-06-28 18:30:00,0,0.5,0,0,23.4,99,66,72.2,2020-06-28 14:30:00.000
75,76,2020-06-28 18:45:00,0,0.5,0,0,23.3,103,66,87.3,2020-06-28 14:45:00.000
76,77,2020-06-28 19:00:00,0,0.5,0,0,23.2,106,65,83.4,2020-06-28 15:00:00.000
77,78,2020-06-28 19:15:00,0,0.6,0,0,23.1,109,65,63.9,2020-06-28 15:15:00.000
78,79,2020-06-28 19:30:00,0,0.6,0,0,23.1,113,64,64.8,2020-06-28 15:30:00.000
79,80,2020-06-28 19:45:00,0,0.7,0,0,23.1,116,63,91.1,2020-06-28 15:45:00.000
80,81,2020-06-28 20:00:00,0,0.7,0,0,23.1,120,63,96.8,2020-06-28 16:00:00.000
81,82,2020-06-28 20:15:00,0,0.7,0,0,23.0,123,61,97.0,2020-06-28 16:15:00.000
82,83,2020-06-28 20:30:00,0,0.6,0,0,23.0,126,60,97.0,2020-06-28 16:30:00.000
83,84,2020-06-28 20:45:00,0,0.6,0,0,22.9,129,59,97.0,2020-06-28 16:45:00.000
84,85,2020-06-28 21:00:00,0,0.5,0,0,22.9,133,57,97.0,2020-06-28 17:00:00.000
85,86,2020-06-28 21:15:00,0,0.4,0,0,22.9,136,55,97.0,2020-06-28 17:15:00.000
86,87,2020-06-28 21:30:00,0,0.3,0,0,22.8,139,52,97.0,2020-06-28 17:30:00.000
87,88,2020-06-28 21:45:00,0,0.2,0,0,22.8,142,49,93.9,2020-06-28 17:45:00.000
88,89,2020-06-28 22:00:00,0,0.2,0,0,22.7,144,46,89.0,2020-06-28 18:00:00.000
89,90,2020-06-28 22:15:00,0,0.2,0,0,22.7,147,42,95.4,2020-06-28 18:15:00.000
90,91,2020-06-28 22:30:00,0,0.2,0,0,22.6,149,37,93.2,2020-06-28 18:30:00.000
91,92,2020-06-28 22:45:00,0,0.2,0,0,22.6,151,32,72.3,2020-06-28 18:45:00.000
92,93,2020-06-28 23:00:00,0,0.2,0,0,22.5,153,25,83.2,2020-06-28 19:00:00.000
93,94,2020-06-28 23:15:00,0,0.2,0,0,22.5,155,18,89.1,2020-06-28 19:15:00.000
94,95,2020-06-28 23:30:00,0,0.2,0,0,22.4,156,10,89.6,2020-06-28 19:30:00.000
95,96,2020-06-28 23:45:00,0,0.2,0,0,22.4,156,2,97.0,2020-06-28 19:45:00.000
