,BLOCK_ID,DATA_DATETIME,GHI,WIND_SPEED,DNI,DHI,TEMPERATURE,ZENITH,AZIMUTH,CLOUD_OPACITY,ENTRY_TIME
0,1,2020-10-18 00:00:00,0,1.0,0,0,22.4,169,-140,50.6,2020-10-17 20:00:00.000
1,2,2020-10-18 00:15:00,0,1.0,0,0,22.4,166,-128,62.1,2020-10-17 20:15:00.000
2,3,2020-10-18 00:30:00,0,1.0,0,0,22.4,163,-121,71.8,2020-10-17 20:30:00.000
3,4,2020-10-18 00:45:00,0,1.0,0,0,22.4,160,-116,69.2,2020-10-17 20:45:00.000
4,5,2020-10-18 01:00:00,0,1.0,0,0,22.5,156,-112,61.8,2020-10-17 21:00:00.000
5,6,2020-10-18 01:15:00,0,0.9,0,0,22.5,153,-109,55.7,2020-10-17 21:15:00.000
6,7,2020-10-18 01:30:00,0,0.8,0,0,22.6,149,-107,58.2,2020-10-17 21:30:00.000
7,8,2020-10-18 01:45:00,0,0.8,0,0,22.7,145,-106,59.3,2020-10-17 21:45:00.000
8,9,2020-10-18 02:00:00,0,0.7,0,0,22.8,142,-104,56.8,2020-10-17 22:00:00.000
9,10,2020-10-18 02:15:00,0,0.7,0,0,22.8,138,-103,48.4,2020-10-17 22:15:00.000
10,11,2020-10-18 02:30:00,0,0.7,0,0,22.8,135,-102,40.0,2020-10-17 22:30:00.000
11,12,2020-10-18 02:45:00,0,0.7,0,0,22.8,131,-102,41.5,2020-10-17 22:45:00.000
12,13,2020-10-18 03:00:00,0,0.7,0,0,22.8,127,-101,48.2,2020-10-17 23:00:00.000
13,14,2020-10-18 03:15:00,0,0.7,0,0,22.8,124,-101,56.2,2020-10-17 23:15:00.000
14,15,2020-10-18 03:30:00,0,0.7,0,0,22.8,120,-100,57.4,2020-10-17 23:30:00.000
15,16,2020-10-18 03:45:00,0,0.7,0,0,22.8,116,-100,62.2,2020-10-17 23:45:00.000
16,17,2020-10-18 04:00:00,0,0.7,0,0,22.8,112,-100,68.2,2020-10-18 00:00:00.000
17,18,2020-10-18 04:15:00,0,0.7,0,0,22.8,109,-100,75.0,2020-10-18 00:15:00.000
18,19,2020-10-18 04:30:00,0,0.7,0,0,22.8,105,-99,89.0,2020-10-18 00:30:00.000
19,20,2020-10-18 04:45:00,0,0.7,0,0,22.8,101,-99,71.3,2020-10-18 00:45:00.000
20,21,2020-10-18 05:00:00,0,0.6,0,0,22.7,98,-99,71.2,2020-10-18 01:00:00.000
21,22,2020-10-18 05:15:00,0,0.6,0,0,22.7,94,-99,58.9,2020-10-18 01:15:00.000
22,23,2020-10-18 05:30:00,1,0.6,0,1,22.8,90,-99,51.8,2020-10-18 01:30:00.000
23,24,2020-10-18 05:45:00,18,0.6,0,18,22.8,87,-99,47.9,2020-10-18 01:45:00.000
24,25,2020-10-18 06:00:00,56,0.5,0,56,22.8,83,-99,29.6,2020-10-18 02:00:00.000
25,26,2020-10-18 06:15:00,113,0.5,213,74,22.9,79,-100,14.6,2020-10-18 02:15:00.000
26,27,2020-10-18 06:30:00,139,0.5,49,127,22.9,75,-100,27.8,2020-10-18 02:30:00.000
27,28,2020-10-18 06:45:00,190,0.4,114,155,23.0,72,-100,24.9,2020-10-18 02:45:00.000
28,29,2020-10-18 07:00:00,232,0.3,112,190,23.2,68,-100,26.2,2020-10-18 03:00:00.000
29,30,2020-10-18 07:15:00,266,0.2,81,232,23.5,64,-101,29.1,2020-10-18 03:15:00.000
30,31,2020-10-18 07:30:00,292,0.6,28,278,23.9,61,-101,33.2,2020-10-18 03:30:00.000
31,32,2020-10-18 07:45:00,334,1.0,44,310,24.3,57,-102,32.6,2020-10-18 03:45:00.000
32,33,2020-10-18 08:00:00,378,1.3,62,340,24.6,53,-102,31.9,2020-10-18 04:00:00.000
33,34,2020-10-18 08:15:00,378,1.2,0,378,24.7,50,-103,37.9,2020-10-18 04:15:00.000
34,35,2020-10-18 08:30:00,370,1.0,0,370,24.8,46,-104,44.0,2020-10-18 04:30:00.000
35,36,2020-10-18 08:45:00,396,0.8,4,393,25.0,42,-105,44.4,2020-10-18 04:45:00.000
36,37,2020-10-18 09:00:00,533,0.7,120,439,25.2,39,-106,29.6,2020-10-18 05:00:00.000
37,38,2020-10-18 09:15:00,616,0.7,252,410,25.6,35,-107,22.9,2020-10-18 05:15:00.000
38,39,2020-10-18 09:30:00,740,0.7,521,296,26.1,32,-109,11.6,2020-10-18 05:30:00.000
39,40,2020-10-18 09:45:00,810,0.7,649,238,26.6,28,-111,7.0,2020-10-18 05:45:00.000
40,41,2020-10-18 10:00:00,788,0.7,503,331,27.0,25,-114,12.6,2020-10-18 06:00:00.000
41,42,2020-10-18 10:15:00,835,0.8,579,296,27.3,21,-119,10.0,2020-10-18 06:15:00.000
42,43,2020-10-18 10:30:00,757,0.8,322,451,27.6,18,-124,20.2,2020-10-18 06:30:00.000
43,44,2020-10-18 10:45:00,768,0.9,319,461,27.9,15,-132,20.4,2020-10-18 06:45:00.000
44,45,2020-10-18 11:00:00,727,1.0,209,523,28.2,13,-143,25.6,2020-10-18 07:00:00.000
45,46,2020-10-18 11:15:00,722,1.0,191,535,28.3,11,-159,26.6,2020-10-18 07:15:00.000
46,47,2020-10-18 11:30:00,802,1.0,360,448,28.3,10,-179,18.6,2020-10-18 07:30:00.000
47,48,2020-10-18 11:45:00,532,1.0,0,532,28.4,11,160,45.9,2020-10-18 07:45:00.000
48,49,2020-10-18 12:00:00,507,1.0,0,507,28.4,12,144,48.0,2020-10-18 08:00:00.000
49,50,2020-10-18 12:15:00,499,1.0,0,499,28.0,15,133,48.2,2020-10-18 08:15:00.000
50,51,2020-10-18 12:30:00,782,1.0,480,326,27.7,18,125,17.4,2020-10-18 08:30:00.000
51,52,2020-10-18 12:45:00,721,1.0,344,398,27.3,21,119,22.3,2020-10-18 08:45:00.000
52,53,2020-10-18 13:00:00,282,1.0,0,282,27.0,24,115,68.8,2020-10-18 09:00:00.000
53,54,2020-10-18 13:15:00,542,1.0,35,512,26.9,28,112,37.7,2020-10-18 09:15:00.000
54,55,2020-10-18 13:30:00,606,1.0,158,471,26.8,31,109,27.6,2020-10-18 09:30:00.000
55,56,2020-10-18 13:45:00,569,1.0,157,439,26.7,35,108,28.8,2020-10-18 09:45:00.000
56,57,2020-10-18 14:00:00,249,1.0,0,249,26.5,39,106,67.2,2020-10-18 10:00:00.000
57,58,2020-10-18 14:15:00,301,0.9,0,301,26.4,42,105,57.5,2020-10-18 10:15:00.000
58,59,2020-10-18 14:30:00,277,0.8,0,277,26.3,46,104,58.0,2020-10-18 10:30:00.000
59,60,2020-10-18 14:45:00,203,0.7,0,203,26.2,49,103,66.3,2020-10-18 10:45:00.000
60,61,2020-10-18 15:00:00,303,0.6,0,303,26.2,53,102,45.2,2020-10-18 11:00:00.000
61,62,2020-10-18 15:15:00,204,0.6,0,204,26.2,57,102,59.0,2020-10-18 11:15:00.000
62,63,2020-10-18 15:30:00,173,0.6,0,173,26.2,60,101,60.4,2020-10-18 11:30:00.000
63,64,2020-10-18 15:45:00,133,0.6,0,133,26.2,64,101,64.6,2020-10-18 11:45:00.000
64,65,2020-10-18 16:00:00,151,0.6,0,151,26.1,68,100,51.8,2020-10-18 12:00:00.000
65,66,2020-10-18 16:15:00,132,0.6,0,132,25.8,72,100,48.0,2020-10-18 12:15:00.000
66,67,2020-10-18 16:30:00,97,0.6,0,97,25.4,75,100,49.6,2020-10-18 12:30:00.000
67,68,2020-10-18 16:45:00,65,0.6,0,65,25.1,79,100,51.8,2020-10-18 12:45:00.000
68,69,2020-10-18 17:00:00,35,0.5,0,35,24.8,83,100,56.0,2020-10-18 13:00:00.000
69,70,2020-10-18 17:15:00,15,0.5,0,15,24.7,86,100,61.8,2020-10-18 13:15:00.000
70,71,2020-10-18 17:30:00,0,0.4,0,0,24.5,90,99,92.6,2020-10-18 13:30:00.000
71,72,2020-10-18 17:45:00,0,0.3,0,0,24.4,94,99,92.4,2020-10-18 13:45:00.000
72,73,2020-10-18 18:00:00,0,0.3,0,0,24.2,97,99,95.8,2020-10-18 14:00:00.000
73,74,2020-10-18 18:15:00,0,0.3,0,0,24.2,101,100,82.5,2020-10-18 14:15:00.000
74,75,2020-10-18 18:30:00,0,0.3,0,0,24.1,105,100,51.8,2020-10-18 14:30:00.000
75,76,2020-10-18 18:45:00,0,0.4,0,0,24.0,108,100,70.8,2020-10-18 14:45:00.000
76,77,2020-10-18 19:00:00,0,0.5,0,0,24.0,112,100,65.6,2020-10-18 15:00:00.000
77,78,2020-10-18 19:15:00,0,0.5,0,0,23.9,116,100,65.2,2020-10-18 15:15:00.000
78,79,2020-10-18 19:30:00,0,0.5,0,0,23.8,120,101,68.0,2020-10-18 15:30:00.000
79,80,2020-10-18 19:45:00,0,0.6,0,0,23.8,123,101,68.0,2020-10-18 15:45:00.000
80,81,2020-10-18 20:00:00,0,0.7,0,0,23.7,127,101,62.6,2020-10-18 16:00:00.000
81,82,2020-10-18 20:15:00,0,0.6,0,0,23.7,131,102,72.6,2020-10-18 16:15:00.000
82,83,2020-10-18 20:30:00,0,0.6,0,0,23.6,134,103,83.4,2020-10-18 16:30:00.000
83,84,2020-10-18 20:45:00,0,0.6,0,0,23.6,138,104,83.2,2020-10-18 16:45:00.000
84,85,2020-10-18 21:00:00,0,0.5,0,0,23.5,142,105,72.4,2020-10-18 17:00:00.000
85,86,2020-10-18 21:15:00,0,0.5,0,0,23.5,145,106,55.1,2020-10-18 17:15:00.000
86,87,2020-10-18 21:30:00,0,0.4,0,0,23.4,149,108,48.4,2020-10-18 17:30:00.000
87,88,2020-10-18 21:45:00,0,0.4,0,0,23.4,152,110,57.7,2020-10-18 17:45:00.000
88,89,2020-10-18 22:00:00,0,0.3,0,0,23.4,156,112,50.6,2020-10-18 18:00:00.000
89,90,2020-10-18 22:15:00,0,0.3,0,0,23.3,159,116,47.3,2020-10-18 18:15:00.000
90,91,2020-10-18 22:30:00,0,0.2,0,0,23.3,162,121,52.8,2020-10-18 18:30:00.000
91,92,2020-10-18 22:45:00,0,0.2,0,0,23.3,166,129,61.6,2020-10-18 18:45:00.000
92,93,2020-10-18 23:00:00,0,0.2,0,0,23.2,168,140,67.4,2020-10-18 19:00:00.000
93,94,2020-10-18 23:15:00,0,0.1,0,0,23.2,170,157,67.2,2020-10-18 19:15:00.000
94,95,2020-10-18 23:30:00,0,0.1,0,0,23.2,171,179,57.4,2020-10-18 19:30:00.000
95,96,2020-10-18 23:45:00,0,0.1,0,0,23.1,170,-158,56.6,2020-10-18 19:45:00.000
