,BLOCK_ID,DATA_DATETIME,GHI,WIND_SPEED,DNI,DHI,TEMPERATURE,ZENITH,AZIMUTH,CLOUD_OPACITY,ENTRY_TIME
0,1,2021-07-13 00:00:00,0,0.4,0,0,22.7,157,-5,67.0,2021-07-12 20:00:00.000
1,2,2021-07-13 00:15:00,0,0.4,0,0,22.7,156,-14,54.1,2021-07-12 20:15:00.000
2,3,2021-07-13 00:30:00,0,0.4,0,0,22.7,155,-22,41.8,2021-07-12 20:30:00.000
3,4,2021-07-13 00:45:00,0,0.3,0,0,22.7,154,-29,43.8,2021-07-12 20:45:00.000
4,5,2021-07-13 01:00:00,0,0.3,0,0,22.6,152,-35,39.4,2021-07-12 21:00:00.000
5,6,2021-07-13 01:15:00,0,0.3,0,0,22.6,149,-41,28.6,2021-07-12 21:15:00.000
6,7,2021-07-13 01:30:00,0,0.3,0,0,22.6,147,-45,36.2,2021-07-12 21:30:00.000
7,8,2021-07-13 01:45:00,0,0.2,0,0,22.5,144,-49,36.4,2021-07-12 21:45:00.000
8,9,2021-07-13 02:00:00,0,0.2,0,0,22.5,141,-52,37.2,2021-07-12 22:00:00.000
9,10,2021-07-13 02:15:00,0,0.2,0,0,22.4,138,-55,30.6,2021-07-12 22:15:00.000
10,11,2021-07-13 02:30:00,0,0.2,0,0,22.4,135,-57,28.0,2021-07-12 22:30:00.000
11,12,2021-07-13 02:45:00,0,0.2,0,0,22.4,132,-59,24.0,2021-07-12 22:45:00.000
12,13,2021-07-13 03:00:00,0,0.2,0,0,22.3,129,-61,23.2,2021-07-12 23:00:00.000
13,14,2021-07-13 03:15:00,0,0.2,0,0,22.3,125,-62,26.4,2021-07-12 23:15:00.000
14,15,2021-07-13 03:30:00,0,0.1,0,0,22.3,122,-63,5.0,2021-07-12 23:30:00.000
15,16,2021-07-13 03:45:00,0,0.1,0,0,22.3,119,-64,7.2,2021-07-12 23:45:00.000
16,17,2021-07-13 04:00:00,0,0.1,0,0,22.2,115,-65,24.0,2021-07-13 00:00:00.000
17,18,2021-07-13 04:15:00,0,0.1,0,0,22.2,112,-66,19.7,2021-07-13 00:15:00.000
18,19,2021-07-13 04:30:00,0,0.1,0,0,22.2,108,-66,19.8,2021-07-13 00:30:00.000
19,20,2021-07-13 04:45:00,0,0.1,0,0,22.2,105,-67,19.7,2021-07-13 00:45:00.000
20,21,2021-07-13 05:00:00,0,0.1,0,0,22.1,102,-67,30.2,2021-07-13 01:00:00.000
21,22,2021-07-13 05:15:00,0,0.1,0,0,22.1,98,-68,37.1,2021-07-13 01:15:00.000
22,23,2021-07-13 05:30:00,0,0.1,0,0,22.1,95,-68,37.2,2021-07-13 01:30:00.000
23,24,2021-07-13 05:45:00,0,0.1,0,0,22.1,91,-68,67.1,2021-07-13 01:45:00.000
24,25,2021-07-13 06:00:00,3,0.1,0,3,22.2,88,-68,82.0,2021-07-13 02:00:00.000
25,26,2021-07-13 06:15:00,42,0.1,13,41,22.5,84,-68,22.9,2021-07-13 02:15:00.000
26,27,2021-07-13 06:30:00,84,0.2,95,68,22.9,81,-68,16.4,2021-07-13 02:30:00.000
27,28,2021-07-13 06:45:00,121,0.3,90,101,23.2,77,-67,20.3,2021-07-13 02:45:00.000
28,29,2021-07-13 07:00:00,173,0.4,193,118,23.6,74,-67,16.2,2021-07-13 03:00:00.000
29,30,2021-07-13 07:15:00,214,0.4,194,149,24.0,70,-67,17.9,2021-07-13 03:15:00.000
30,31,2021-07-13 07:30:00,246,0.5,142,190,24.5,67,-66,22.4,2021-07-13 03:30:00.000
31,32,2021-07-13 07:45:00,256,0.6,37,240,24.9,63,-65,31.1,2021-07-13 03:45:00.000
32,33,2021-07-13 08:00:00,262,0.7,0,262,25.3,60,-65,38.4,2021-07-13 04:00:00.000
33,34,2021-07-13 08:15:00,272,0.9,0,272,25.7,57,-64,43.3,2021-07-13 04:15:00.000
34,35,2021-07-13 08:30:00,274,1.0,0,274,26.1,53,-63,48.0,2021-07-13 04:30:00.000
35,36,2021-07-13 08:45:00,276,1.2,0,276,26.5,50,-61,52.0,2021-07-13 04:45:00.000
36,37,2021-07-13 09:00:00,286,1.3,0,286,26.8,47,-60,54.2,2021-07-13 05:00:00.000
37,38,2021-07-13 09:15:00,495,1.4,159,379,26.8,44,-58,25.7,2021-07-13 05:15:00.000
38,39,2021-07-13 09:30:00,552,1.4,240,369,26.7,40,-55,21.8,2021-07-13 05:30:00.000
39,40,2021-07-13 09:45:00,503,1.5,59,457,26.7,37,-53,32.2,2021-07-13 05:45:00.000
40,41,2021-07-13 10:00:00,435,1.5,3,432,26.6,35,-50,43.8,2021-07-13 06:00:00.000
41,42,2021-07-13 10:15:00,479,1.4,69,420,26.5,32,-46,40.5,2021-07-13 06:15:00.000
42,43,2021-07-13 10:30:00,718,1.2,448,326,26.3,29,-41,13.4,2021-07-13 06:30:00.000
43,44,2021-07-13 10:45:00,817,1.0,696,195,26.2,27,-36,3.8,2021-07-13 06:45:00.000
44,45,2021-07-13 11:00:00,760,0.9,482,323,26.2,25,-29,12.0,2021-07-13 07:00:00.000
45,46,2021-07-13 11:15:00,477,0.9,0,477,26.8,23,-22,45.5,2021-07-13 07:15:00.000
46,47,2021-07-13 11:30:00,549,1.0,12,538,27.4,22,-13,37.8,2021-07-13 07:30:00.000
47,48,2021-07-13 11:45:00,542,1.0,86,462,28.0,22,-4,38.9,2021-07-13 07:45:00.000
48,49,2021-07-13 12:00:00,660,1.1,176,496,28.5,22,6,25.6,2021-07-13 08:00:00.000
49,50,2021-07-13 12:15:00,635,1.2,137,508,28.7,22,15,28.1,2021-07-13 08:15:00.000
50,51,2021-07-13 12:30:00,764,1.3,460,342,28.9,23,23,12.6,2021-07-13 08:30:00.000
51,52,2021-07-13 12:45:00,768,1.4,502,314,29.2,25,31,10.8,2021-07-13 08:45:00.000
52,53,2021-07-13 13:00:00,830,1.4,753,161,29.3,27,37,1.6,2021-07-13 09:00:00.000
53,54,2021-07-13 13:15:00,822,1.4,795,131,29.4,30,42,0.0,2021-07-13 09:15:00.000
54,55,2021-07-13 13:30:00,796,1.4,790,129,29.4,32,47,0.0,2021-07-13 09:30:00.000
55,56,2021-07-13 13:45:00,694,1.4,522,266,29.5,35,50,9.5,2021-07-13 09:45:00.000
56,57,2021-07-13 14:00:00,656,1.4,487,272,29.5,38,53,10.6,2021-07-13 10:00:00.000
57,58,2021-07-13 14:15:00,672,1.3,666,170,29.4,41,56,3.5,2021-07-13 10:15:00.000
58,59,2021-07-13 14:30:00,656,1.3,753,116,29.3,44,58,0.0,2021-07-13 10:30:00.000
59,60,2021-07-13 14:45:00,613,1.2,739,113,29.1,47,60,0.0,2021-07-13 10:45:00.000
60,61,2021-07-13 15:00:00,567,1.1,724,108,29.0,51,62,0.0,2021-07-13 11:00:00.000
61,62,2021-07-13 15:15:00,518,1.0,705,104,28.7,54,63,0.0,2021-07-13 11:15:00.000
62,63,2021-07-13 15:30:00,467,1.0,683,98,28.4,57,64,0.0,2021-07-13 11:30:00.000
63,64,2021-07-13 15:45:00,414,0.9,658,93,28.1,61,65,0.0,2021-07-13 11:45:00.000
64,65,2021-07-13 16:00:00,340,0.9,493,125,27.8,64,66,5.6,2021-07-13 12:00:00.000
65,66,2021-07-13 16:15:00,158,0.8,0,158,27.4,68,66,48.9,2021-07-13 12:15:00.000
66,67,2021-07-13 16:30:00,89,0.8,0,89,27.1,71,67,64.2,2021-07-13 12:30:00.000
67,68,2021-07-13 16:45:00,55,0.8,0,55,26.8,74,67,70.7,2021-07-13 12:45:00.000
68,69,2021-07-13 17:00:00,67,0.9,0,67,26.4,78,68,52.0,2021-07-13 13:00:00.000
69,70,2021-07-13 17:15:00,40,0.9,0,40,25.9,81,68,55.6,2021-07-13 13:15:00.000
70,71,2021-07-13 17:30:00,16,0.9,0,16,25.3,85,68,67.4,2021-07-13 13:30:00.000
71,72,2021-07-13 17:45:00,6,0.9,0,6,24.8,88,68,52.4,2021-07-13 13:45:00.000
72,73,2021-07-13 18:00:00,0,0.9,0,0,24.4,92,68,52.6,2021-07-13 14:00:00.000
73,74,2021-07-13 18:15:00,0,0.8,0,0,24.2,95,68,61.9,2021-07-13 14:15:00.000
74,75,2021-07-13 18:30:00,0,0.8,0,0,24.1,99,68,58.4,2021-07-13 14:30:00.000
75,76,2021-07-13 18:45:00,0,0.8,0,0,23.9,102,67,34.6,2021-07-13 14:45:00.000
76,77,2021-07-13 19:00:00,0,0.8,0,0,23.8,106,67,28.1,2021-07-13 15:00:00.000
77,78,2021-07-13 19:15:00,0,0.8,0,0,23.7,109,66,23.3,2021-07-13 15:15:00.000
78,79,2021-07-13 19:30:00,0,0.7,0,0,23.6,113,66,24.0,2021-07-13 15:30:00.000
79,80,2021-07-13 19:45:00,0,0.7,0,0,23.5,116,65,24.7,2021-07-13 15:45:00.000
80,81,2021-07-13 20:00:00,0,0.7,0,0,23.4,119,64,28.8,2021-07-13 16:00:00.000
81,82,2021-07-13 20:15:00,0,0.7,0,0,23.3,123,63,21.9,2021-07-13 16:15:00.000
82,83,2021-07-13 20:30:00,0,0.7,0,0,23.3,126,62,27.2,2021-07-13 16:30:00.000
83,84,2021-07-13 20:45:00,0,0.7,0,0,23.3,129,60,53.1,2021-07-13 16:45:00.000
84,85,2021-07-13 21:00:00,0,0.7,0,0,23.2,133,59,50.8,2021-07-13 17:00:00.000
85,86,2021-07-13 21:15:00,0,0.7,0,0,23.2,136,57,42.4,2021-07-13 17:15:00.000
86,87,2021-07-13 21:30:00,0,0.8,0,0,23.2,139,54,19.4,2021-07-13 17:30:00.000
87,88,2021-07-13 21:45:00,0,0.8,0,0,23.2,142,52,52.9,2021-07-13 17:45:00.000
88,89,2021-07-13 22:00:00,0,0.8,0,0,23.2,145,48,82.6,2021-07-13 18:00:00.000
89,90,2021-07-13 22:15:00,0,0.8,0,0,23.1,147,44,81.9,2021-07-13 18:15:00.000
90,91,2021-07-13 22:30:00,0,0.9,0,0,23.1,150,40,60.0,2021-07-13 18:30:00.000
91,92,2021-07-13 22:45:00,0,0.9,0,0,23.1,152,34,34.2,2021-07-13 18:45:00.000
92,93,2021-07-13 23:00:00,0,0.9,0,0,23.1,154,28,20.0,2021-07-13 19:00:00.000
93,94,2021-07-13 23:15:00,0,0.9,0,0,23.0,156,21,21.5,2021-07-13 19:15:00.000
94,95,2021-07-13 23:30:00,0,0.9,0,0,23.0,157,12,38.6,2021-07-13 19:30:00.000
95,96,2021-07-13 23:45:00,0,0.9,0,0,23.0,157,4,52.3,2021-07-13 19:45:00.000
