,BLOCK_ID,DATA_DATETIME,GHI,WIND_SPEED,DNI,DHI,TEMPERATURE,ZENITH,AZIMUTH,CLOUD_OPACITY,ENTRY_TIME
0,1,2021-06-08 00:00:00,0,0.2,0,0,22.3,156,-9,16.0,2021-06-07 20:00:00.000
1,2,2021-06-08 00:15:00,0,0.2,0,0,22.3,156,-17,18.8,2021-06-07 20:15:00.000
2,3,2021-06-08 00:30:00,0,0.2,0,0,22.2,154,-25,15.2,2021-06-07 20:30:00.000
3,4,2021-06-08 00:45:00,0,0.3,0,0,22.2,152,-32,15.0,2021-06-07 20:45:00.000
4,5,2021-06-08 01:00:00,0,0.3,0,0,22.1,150,-37,15.0,2021-06-07 21:00:00.000
5,6,2021-06-08 01:15:00,0,0.2,0,0,22.2,148,-42,15.0,2021-06-07 21:15:00.000
6,7,2021-06-08 01:30:00,0,0.2,0,0,22.2,145,-46,15.8,2021-06-07 21:30:00.000
7,8,2021-06-08 01:45:00,0,0.1,0,0,22.2,142,-50,15.7,2021-06-07 21:45:00.000
8,9,2021-06-08 02:00:00,0,0.1,0,0,22.2,140,-53,15.0,2021-06-07 22:00:00.000
9,10,2021-06-08 02:15:00,0,0.1,0,0,22.2,137,-55,14.7,2021-06-07 22:15:00.000
10,11,2021-06-08 02:30:00,0,0.0,0,0,22.2,133,-57,14.0,2021-06-07 22:30:00.000
11,12,2021-06-08 02:45:00,0,0.0,0,0,22.1,130,-59,14.7,2021-06-07 22:45:00.000
12,13,2021-06-08 03:00:00,0,0.0,0,0,22.1,127,-61,14.8,2021-06-07 23:00:00.000
13,14,2021-06-08 03:15:00,0,0.0,0,0,22.1,124,-62,14.7,2021-06-07 23:15:00.000
14,15,2021-06-08 03:30:00,0,0.0,0,0,22.1,120,-63,14.0,2021-06-07 23:30:00.000
15,16,2021-06-08 03:45:00,0,0.1,0,0,22.1,117,-64,14.3,2021-06-07 23:45:00.000
16,17,2021-06-08 04:00:00,0,0.1,0,0,22.1,114,-65,15.0,2021-06-08 00:00:00.000
17,18,2021-06-08 04:15:00,0,0.2,0,0,22.1,110,-65,15.0,2021-06-08 00:15:00.000
18,19,2021-06-08 04:30:00,0,0.3,0,0,22.1,107,-66,14.2,2021-06-08 00:30:00.000
19,20,2021-06-08 04:45:00,0,0.4,0,0,22.1,103,-66,13.8,2021-06-08 00:45:00.000
20,21,2021-06-08 05:00:00,0,0.5,0,0,22.1,100,-67,13.8,2021-06-08 01:00:00.000
21,22,2021-06-08 05:15:00,0,0.6,0,0,22.2,96,-67,14.0,2021-06-08 01:15:00.000
22,23,2021-06-08 05:30:00,0,0.7,0,0,22.2,93,-67,14.0,2021-06-08 01:30:00.000
23,24,2021-06-08 05:45:00,5,0.8,15,3,22.3,90,-67,9.8,2021-06-08 01:45:00.000
24,25,2021-06-08 06:00:00,35,0.9,168,20,22.4,86,-67,0.0,2021-06-08 02:00:00.000
25,26,2021-06-08 06:15:00,78,0.9,340,33,22.8,83,-67,0.0,2021-06-08 02:15:00.000
26,27,2021-06-08 06:30:00,127,0.9,443,44,23.2,79,-67,0.0,2021-06-08 02:30:00.000
27,28,2021-06-08 06:45:00,181,0.9,520,52,23.5,76,-67,0.0,2021-06-08 02:45:00.000
28,29,2021-06-08 07:00:00,236,0.9,580,59,24.0,72,-66,0.0,2021-06-08 03:00:00.000
29,30,2021-06-08 07:15:00,292,0.9,627,65,24.5,69,-66,0.0,2021-06-08 03:15:00.000
30,31,2021-06-08 07:30:00,347,1.0,666,70,25.0,65,-65,0.0,2021-06-08 03:30:00.000
31,32,2021-06-08 07:45:00,402,1.0,699,74,25.6,62,-64,0.0,2021-06-08 03:45:00.000
32,33,2021-06-08 08:00:00,455,1.1,725,78,26.1,59,-64,0.0,2021-06-08 04:00:00.000
33,34,2021-06-08 08:15:00,507,1.2,748,82,26.6,55,-63,0.0,2021-06-08 04:15:00.000
34,35,2021-06-08 08:30:00,556,1.3,767,85,27.0,52,-61,0.0,2021-06-08 04:30:00.000
35,36,2021-06-08 08:45:00,604,1.4,784,87,27.5,49,-60,0.0,2021-06-08 04:45:00.000
36,37,2021-06-08 09:00:00,648,1.5,798,90,27.9,46,-58,0.0,2021-06-08 05:00:00.000
37,38,2021-06-08 09:15:00,690,1.7,810,92,28.3,42,-56,0.0,2021-06-08 05:15:00.000
38,39,2021-06-08 09:30:00,728,1.8,821,94,28.7,39,-53,0.0,2021-06-08 05:30:00.000
39,40,2021-06-08 09:45:00,763,1.9,830,96,29.0,36,-51,0.0,2021-06-08 05:45:00.000
40,41,2021-06-08 10:00:00,794,2.0,837,97,29.4,34,-47,0.0,2021-06-08 06:00:00.000
41,42,2021-06-08 10:15:00,822,2.1,843,99,29.6,31,-43,0.0,2021-06-08 06:15:00.000
42,43,2021-06-08 10:30:00,804,2.2,706,184,29.8,29,-38,4.8,2021-06-08 06:30:00.000
43,44,2021-06-08 10:45:00,708,2.2,368,379,30.0,26,-32,18.0,2021-06-08 06:45:00.000
44,45,2021-06-08 11:00:00,657,2.3,215,462,30.2,25,-25,25.2,2021-06-08 07:00:00.000
45,46,2021-06-08 11:15:00,729,2.4,374,386,30.3,23,-17,18.0,2021-06-08 07:15:00.000
46,47,2021-06-08 11:30:00,783,2.4,500,320,30.3,22,-9,12.6,2021-06-08 07:30:00.000
47,48,2021-06-08 11:45:00,835,2.5,654,228,30.4,22,0,7.0,2021-06-08 07:45:00.000
48,49,2021-06-08 12:00:00,852,2.5,713,193,30.5,22,10,4.8,2021-06-08 08:00:00.000
49,50,2021-06-08 12:15:00,796,2.4,559,283,30.4,23,18,10.4,2021-06-08 08:15:00.000
50,51,2021-06-08 12:30:00,688,2.4,289,425,30.4,25,26,21.6,2021-06-08 08:30:00.000
51,52,2021-06-08 12:45:00,742,2.4,465,327,30.4,27,33,13.9,2021-06-08 08:45:00.000
52,53,2021-06-08 13:00:00,713,2.3,426,339,30.3,29,38,15.4,2021-06-08 09:00:00.000
53,54,2021-06-08 13:15:00,649,2.1,305,388,30.2,31,43,20.7,2021-06-08 09:15:00.000
54,55,2021-06-08 13:30:00,726,1.8,599,229,30.0,34,47,8.2,2021-06-08 09:30:00.000
55,56,2021-06-08 13:45:00,732,1.6,721,155,29.8,37,51,3.5,2021-06-08 09:45:00.000
56,57,2021-06-08 14:00:00,723,1.4,811,99,29.6,40,54,0.0,2021-06-08 10:00:00.000
57,58,2021-06-08 14:15:00,684,1.3,798,98,29.1,43,56,0.0,2021-06-08 10:15:00.000
58,59,2021-06-08 14:30:00,642,1.2,784,96,28.7,46,58,0.0,2021-06-08 10:30:00.000
59,60,2021-06-08 14:45:00,597,1.1,770,93,28.2,49,60,0.0,2021-06-08 10:45:00.000
60,61,2021-06-08 15:00:00,550,1.1,755,90,27.8,52,61,0.0,2021-06-08 11:00:00.000
61,62,2021-06-08 15:15:00,500,1.1,736,86,27.5,56,63,0.0,2021-06-08 11:15:00.000
62,63,2021-06-08 15:30:00,448,1.1,714,81,27.2,59,64,0.0,2021-06-08 11:30:00.000
63,64,2021-06-08 15:45:00,381,1.1,598,104,26.9,62,65,3.5,2021-06-08 11:45:00.000
64,65,2021-06-08 16:00:00,316,1.2,484,118,26.6,66,65,7.0,2021-06-08 12:00:00.000
65,66,2021-06-08 16:15:00,275,1.1,543,84,26.4,69,66,3.0,2021-06-08 12:15:00.000
66,67,2021-06-08 16:30:00,229,1.1,568,59,26.2,73,66,0.0,2021-06-08 12:30:00.000
67,68,2021-06-08 16:45:00,165,1.1,400,66,26.0,76,67,6.0,2021-06-08 12:45:00.000
68,69,2021-06-08 17:00:00,104,1.1,187,71,25.7,80,67,13.6,2021-06-08 13:00:00.000
69,70,2021-06-08 17:15:00,68,1.1,224,39,25.3,83,67,6.4,2021-06-08 13:15:00.000
70,71,2021-06-08 17:30:00,19,1.0,19,17,24.8,86,67,42.4,2021-06-08 13:30:00.000
71,72,2021-06-08 17:45:00,1,1.0,0,1,24.4,90,67,47.5,2021-06-08 13:45:00.000
72,73,2021-06-08 18:00:00,0,1.0,0,0,24.0,93,67,48.6,2021-06-08 14:00:00.000
73,74,2021-06-08 18:15:00,0,1.0,0,0,23.9,97,67,40.4,2021-06-08 14:15:00.000
74,75,2021-06-08 18:30:00,0,1.0,0,0,23.8,100,67,16.4,2021-06-08 14:30:00.000
75,76,2021-06-08 18:45:00,0,1.1,0,0,23.6,104,66,20.1,2021-06-08 14:45:00.000
76,77,2021-06-08 19:00:00,0,1.1,0,0,23.5,107,66,21.8,2021-06-08 15:00:00.000
77,78,2021-06-08 19:15:00,0,1.0,0,0,23.5,111,65,20.3,2021-06-08 15:15:00.000
78,79,2021-06-08 19:30:00,0,0.9,0,0,23.4,114,65,20.2,2021-06-08 15:30:00.000
79,80,2021-06-08 19:45:00,0,0.8,0,0,23.4,117,64,27.4,2021-06-08 15:45:00.000
80,81,2021-06-08 20:00:00,0,0.8,0,0,23.3,121,63,21.2,2021-06-08 16:00:00.000
81,82,2021-06-08 20:15:00,0,0.7,0,0,23.3,124,62,17.5,2021-06-08 16:15:00.000
82,83,2021-06-08 20:30:00,0,0.7,0,0,23.2,127,60,25.8,2021-06-08 16:30:00.000
83,84,2021-06-08 20:45:00,0,0.6,0,0,23.2,131,59,14.0,2021-06-08 16:45:00.000
84,85,2021-06-08 21:00:00,0,0.6,0,0,23.1,134,57,14.0,2021-06-08 17:00:00.000
85,86,2021-06-08 21:15:00,0,0.5,0,0,23.0,137,55,14.7,2021-06-08 17:15:00.000
86,87,2021-06-08 21:30:00,0,0.5,0,0,23.0,140,52,14.0,2021-06-08 17:30:00.000
87,88,2021-06-08 21:45:00,0,0.4,0,0,22.9,143,49,15.4,2021-06-08 17:45:00.000
88,89,2021-06-08 22:00:00,0,0.4,0,0,22.8,146,46,15.6,2021-06-08 18:00:00.000
89,90,2021-06-08 22:15:00,0,0.4,0,0,22.8,148,41,15.0,2021-06-08 18:15:00.000
90,91,2021-06-08 22:30:00,0,0.4,0,0,22.7,150,37,14.2,2021-06-08 18:30:00.000
91,92,2021-06-08 22:45:00,0,0.4,0,0,22.7,153,31,14.1,2021-06-08 18:45:00.000
92,93,2021-06-08 23:00:00,0,0.5,0,0,22.6,154,24,14.0,2021-06-08 19:00:00.000
93,94,2021-06-08 23:15:00,0,0.5,0,0,22.6,156,16,15.2,2021-06-08 19:15:00.000
94,95,2021-06-08 23:30:00,0,0.6,0,0,22.5,156,8,18.0,2021-06-08 19:30:00.000
95,96,2021-06-08 23:45:00,0,0.6,0,0,22.5,157,0,18.6,2021-06-08 19:45:00.000
