,BLOCK_ID,DATA_DATETIME,GHI,WIND_SPEED,DNI,DHI,TEMPERATURE,ZENITH,AZIMUTH,CLOUD_OPACITY,ENTRY_TIME
0,1,2020-08-22 00:00:00,0,1.1,0,0,22.7,167,-12,14.0,2020-08-21 20:00:00.000
1,2,2020-08-22 00:15:00,0,1.0,0,0,22.6,166,-26,14.0,2020-08-21 20:15:00.000
2,3,2020-08-22 00:30:00,0,1.0,0,0,22.6,164,-38,14.0,2020-08-21 20:30:00.000
3,4,2020-08-22 00:45:00,0,1.0,0,0,22.5,161,-47,14.0,2020-08-21 20:45:00.000
4,5,2020-08-22 01:00:00,0,1.0,0,0,22.5,158,-53,14.8,2020-08-21 21:00:00.000
5,6,2020-08-22 01:15:00,0,1.0,0,0,22.5,155,-58,15.0,2020-08-21 21:15:00.000
6,7,2020-08-22 01:30:00,0,1.0,0,0,22.6,152,-62,15.0,2020-08-21 21:30:00.000
7,8,2020-08-22 01:45:00,0,1.0,0,0,22.6,148,-65,15.0,2020-08-21 21:45:00.000
8,9,2020-08-22 02:00:00,0,1.0,0,0,22.6,145,-67,13.4,2020-08-21 22:00:00.000
9,10,2020-08-22 02:15:00,0,1.0,0,0,22.6,142,-69,13.0,2020-08-21 22:15:00.000
10,11,2020-08-22 02:30:00,0,0.9,0,0,22.5,138,-71,13.8,2020-08-21 22:30:00.000
11,12,2020-08-22 02:45:00,0,0.9,0,0,22.5,134,-72,14.6,2020-08-21 22:45:00.000
12,13,2020-08-22 03:00:00,0,0.9,0,0,22.4,131,-73,13.6,2020-08-21 23:00:00.000
13,14,2020-08-22 03:15:00,0,0.9,0,0,22.4,127,-74,14.0,2020-08-21 23:15:00.000
14,15,2020-08-22 03:30:00,0,0.9,0,0,22.4,124,-75,14.0,2020-08-21 23:30:00.000
15,16,2020-08-22 03:45:00,0,0.9,0,0,22.4,120,-76,14.0,2020-08-21 23:45:00.000
16,17,2020-08-22 04:00:00,0,0.9,0,0,22.4,116,-76,14.0,2020-08-22 00:00:00.000
17,18,2020-08-22 04:15:00,0,0.9,0,0,22.5,113,-77,15.0,2020-08-22 00:15:00.000
18,19,2020-08-22 04:30:00,0,0.9,0,0,22.5,109,-77,15.0,2020-08-22 00:30:00.000
19,20,2020-08-22 04:45:00,0,0.9,0,0,22.5,105,-77,19.8,2020-08-22 00:45:00.000
20,21,2020-08-22 05:00:00,0,0.9,0,0,22.5,102,-78,48.6,2020-08-22 01:00:00.000
21,22,2020-08-22 05:15:00,0,0.9,0,0,22.5,98,-78,62.6,2020-08-22 01:15:00.000
22,23,2020-08-22 05:30:00,0,0.9,0,0,22.5,94,-78,64.0,2020-08-22 01:30:00.000
23,24,2020-08-22 05:45:00,1,0.8,0,1,22.5,91,-78,60.5,2020-08-22 01:45:00.000
24,25,2020-08-22 06:00:00,8,0.8,0,8,22.6,87,-78,64.0,2020-08-22 02:00:00.000
25,26,2020-08-22 06:15:00,47,0.8,0,47,23.0,83,-78,29.2,2020-08-22 02:15:00.000
26,27,2020-08-22 06:30:00,89,0.8,36,83,23.5,80,-78,23.4,2020-08-22 02:30:00.000
27,28,2020-08-22 06:45:00,130,0.8,57,116,23.9,76,-78,24.8,2020-08-22 02:45:00.000
28,29,2020-08-22 07:00:00,189,0.9,180,134,24.3,73,-78,18.8,2020-08-22 03:00:00.000
29,30,2020-08-22 07:15:00,202,1.0,24,194,24.9,69,-77,30.6,2020-08-22 03:15:00.000
30,31,2020-08-22 07:30:00,216,1.1,3,215,25.4,65,-77,38.4,2020-08-22 03:30:00.000
31,32,2020-08-22 07:45:00,167,1.2,0,167,25.9,62,-77,59.4,2020-08-22 03:45:00.000
32,33,2020-08-22 08:00:00,251,1.4,0,251,26.4,58,-76,46.8,2020-08-22 04:00:00.000
33,34,2020-08-22 08:15:00,335,1.6,67,294,26.8,54,-76,36.7,2020-08-22 04:15:00.000
34,35,2020-08-22 08:30:00,509,1.8,442,227,27.1,51,-75,12.4,2020-08-22 04:30:00.000
35,36,2020-08-22 08:45:00,590,2.0,602,181,27.5,47,-74,6.6,2020-08-22 04:45:00.000
36,37,2020-08-22 09:00:00,563,2.2,344,313,27.8,43,-73,17.4,2020-08-22 05:00:00.000
37,38,2020-08-22 09:15:00,651,2.2,517,252,28.1,40,-72,10.6,2020-08-22 05:15:00.000
38,39,2020-08-22 09:30:00,657,2.3,428,313,28.3,36,-70,14.6,2020-08-22 05:30:00.000
39,40,2020-08-22 09:45:00,578,2.3,151,450,28.6,33,-68,28.6,2020-08-22 05:45:00.000
40,41,2020-08-22 10:00:00,559,2.3,80,491,28.7,29,-66,33.6,2020-08-22 06:00:00.000
41,42,2020-08-22 10:15:00,667,2.5,283,414,28.7,26,-63,23.5,2020-08-22 06:15:00.000
42,43,2020-08-22 10:30:00,487,2.6,0,487,28.6,23,-59,45.8,2020-08-22 06:30:00.000
43,44,2020-08-22 10:45:00,498,2.7,0,498,28.6,19,-54,45.9,2020-08-22 06:45:00.000
44,45,2020-08-22 11:00:00,508,2.8,0,508,28.6,17,-46,45.8,2020-08-22 07:00:00.000
45,46,2020-08-22 11:15:00,134,2.8,0,134,28.7,14,-36,85.9,2020-08-22 07:15:00.000
46,47,2020-08-22 11:30:00,412,2.8,0,412,28.9,12,-22,57.0,2020-08-22 07:30:00.000
47,48,2020-08-22 11:45:00,282,2.7,0,282,29.1,11,-5,70.7,2020-08-22 07:45:00.000
48,49,2020-08-22 12:00:00,221,2.7,0,221,29.3,12,14,77.0,2020-08-22 08:00:00.000
49,50,2020-08-22 12:15:00,152,2.8,0,152,29.7,13,29,84.0,2020-08-22 08:15:00.000
50,51,2020-08-22 12:30:00,427,2.9,0,427,30.1,15,42,54.8,2020-08-22 08:30:00.000
51,52,2020-08-22 12:45:00,438,3.0,0,438,30.5,18,50,52.9,2020-08-22 08:45:00.000
52,53,2020-08-22 13:00:00,540,3.0,0,540,30.7,21,57,40.6,2020-08-22 09:00:00.000
53,54,2020-08-22 13:15:00,618,3.0,108,520,30.5,24,61,30.1,2020-08-22 09:15:00.000
54,55,2020-08-22 13:30:00,514,3.0,29,488,30.2,28,65,40.0,2020-08-22 09:30:00.000
55,56,2020-08-22 13:45:00,325,3.1,0,325,30.0,31,67,60.5,2020-08-22 09:45:00.000
56,57,2020-08-22 14:00:00,327,3.0,0,327,29.7,34,69,58.4,2020-08-22 10:00:00.000
57,58,2020-08-22 14:15:00,416,2.8,0,416,29.1,38,71,44.2,2020-08-22 10:15:00.000
58,59,2020-08-22 14:30:00,277,2.6,0,277,28.6,42,73,60.6,2020-08-22 10:30:00.000
59,60,2020-08-22 14:45:00,415,2.4,75,363,28.0,45,74,36.4,2020-08-22 10:45:00.000
60,61,2020-08-22 15:00:00,473,2.3,229,321,27.6,49,75,21.8,2020-08-22 11:00:00.000
61,62,2020-08-22 15:15:00,408,2.2,143,321,27.4,52,75,26.0,2020-08-22 11:15:00.000
62,63,2020-08-22 15:30:00,387,2.2,207,272,27.3,56,76,22.0,2020-08-22 11:30:00.000
63,64,2020-08-22 15:45:00,261,2.1,0,261,27.2,60,77,40.7,2020-08-22 11:45:00.000
64,65,2020-08-22 16:00:00,193,2.1,0,193,27.1,63,77,49.6,2020-08-22 12:00:00.000
65,66,2020-08-22 16:15:00,192,2.0,0,192,26.9,67,77,40.8,2020-08-22 12:15:00.000
66,67,2020-08-22 16:30:00,129,1.9,0,129,26.7,71,78,50.7,2020-08-22 12:30:00.000
67,68,2020-08-22 16:45:00,136,1.8,54,123,26.5,74,78,32.3,2020-08-22 12:45:00.000
68,69,2020-08-22 17:00:00,139,1.7,393,59,26.3,78,78,3.3,2020-08-22 13:00:00.000
69,70,2020-08-22 17:15:00,61,1.7,0,61,25.9,82,78,34.6,2020-08-22 13:15:00.000
70,71,2020-08-22 17:30:00,21,1.6,0,21,25.4,85,78,53.4,2020-08-22 13:30:00.000
71,72,2020-08-22 17:45:00,4,1.6,0,4,25.0,89,78,64.0,2020-08-22 13:45:00.000
72,73,2020-08-22 18:00:00,0,1.6,0,0,24.7,93,78,63.8,2020-08-22 14:00:00.000
73,74,2020-08-22 18:15:00,0,1.6,0,0,24.5,96,78,24.4,2020-08-22 14:15:00.000
74,75,2020-08-22 18:30:00,0,1.6,0,0,24.3,100,78,21.4,2020-08-22 14:30:00.000
75,76,2020-08-22 18:45:00,0,1.6,0,0,24.2,104,78,25.1,2020-08-22 14:45:00.000
76,77,2020-08-22 19:00:00,0,1.6,0,0,24.0,107,77,23.0,2020-08-22 15:00:00.000
77,78,2020-08-22 19:15:00,0,1.8,0,0,23.9,111,77,30.5,2020-08-22 15:15:00.000
78,79,2020-08-22 19:30:00,0,2.0,0,0,23.8,115,77,9.6,2020-08-22 15:30:00.000
79,80,2020-08-22 19:45:00,0,2.2,0,0,23.7,118,76,20.3,2020-08-22 15:45:00.000
80,81,2020-08-22 20:00:00,0,2.3,0,0,23.6,122,76,14.6,2020-08-22 16:00:00.000
81,82,2020-08-22 20:15:00,0,2.2,0,0,23.6,126,75,13.3,2020-08-22 16:15:00.000
82,83,2020-08-22 20:30:00,0,2.1,0,0,23.6,129,74,14.0,2020-08-22 16:30:00.000
83,84,2020-08-22 20:45:00,0,2.0,0,0,23.5,133,73,14.0,2020-08-22 16:45:00.000
84,85,2020-08-22 21:00:00,0,2.0,0,0,23.5,136,72,14.0,2020-08-22 17:00:00.000
85,86,2020-08-22 21:15:00,0,1.9,0,0,23.5,140,71,14.0,2020-08-22 17:15:00.000
86,87,2020-08-22 21:30:00,0,1.9,0,0,23.4,143,69,14.0,2020-08-22 17:30:00.000
87,88,2020-08-22 21:45:00,0,1.9,0,0,23.3,147,67,14.0,2020-08-22 17:45:00.000
88,89,2020-08-22 22:00:00,0,1.9,0,0,23.3,150,64,13.2,2020-08-22 18:00:00.000
89,90,2020-08-22 22:15:00,0,1.8,0,0,23.2,154,61,13.0,2020-08-22 18:15:00.000
90,91,2020-08-22 22:30:00,0,1.7,0,0,23.2,157,57,13.0,2020-08-22 18:30:00.000
91,92,2020-08-22 22:45:00,0,1.7,0,0,23.1,160,51,26.7,2020-08-22 18:45:00.000
92,93,2020-08-22 23:00:00,0,1.6,0,0,23.1,163,44,6.6,2020-08-22 19:00:00.000
93,94,2020-08-22 23:15:00,0,1.6,0,0,23.0,165,33,15.8,2020-08-22 19:15:00.000
94,95,2020-08-22 23:30:00,0,1.6,0,0,23.0,167,20,19.2,2020-08-22 19:30:00.000
95,96,2020-08-22 23:45:00,0,1.5,0,0,23.0,167,4,14.0,2020-08-22 19:45:00.000
