,BLOCK_ID,DATA_DATETIME,GHI,WIND_SPEED,DNI,DHI,TEMPERATURE,ZENITH,AZIMUTH,CLOUD_OPACITY,ENTRY_TIME
0,1,2019-02-25 00:00:00,0,3.8,0,0,26.9,171,-179,0.0,2019-02-24 20:00:00.000
1,2,2019-02-25 00:15:00,0,3.8,0,0,26.9,170,-158,0.0,2019-02-24 20:15:00.000
2,3,2019-02-25 00:30:00,0,3.8,0,0,26.9,168,-141,0.0,2019-02-24 20:30:00.000
3,4,2019-02-25 00:45:00,0,3.7,0,0,26.9,165,-130,0.0,2019-02-24 20:45:00.000
4,5,2019-02-25 01:00:00,0,3.7,0,0,26.9,162,-122,0.0,2019-02-24 21:00:00.000
5,6,2019-02-25 01:15:00,0,3.7,0,0,26.8,159,-117,0.0,2019-02-24 21:15:00.000
6,7,2019-02-25 01:30:00,0,3.7,0,0,26.8,156,-113,0.0,2019-02-24 21:30:00.000
7,8,2019-02-25 01:45:00,0,3.6,0,0,26.8,152,-110,0.0,2019-02-24 21:45:00.000
8,9,2019-02-25 02:00:00,0,3.6,0,0,26.8,149,-108,0.0,2019-02-24 22:00:00.000
9,10,2019-02-25 02:15:00,0,3.6,0,0,26.8,145,-106,0.0,2019-02-24 22:15:00.000
10,11,2019-02-25 02:30:00,0,3.5,0,0,26.7,141,-105,0.0,2019-02-24 22:30:00.000
11,12,2019-02-25 02:45:00,0,3.5,0,0,26.7,138,-104,0.0,2019-02-24 22:45:00.000
12,13,2019-02-25 03:00:00,0,3.5,0,0,26.7,134,-103,0.0,2019-02-24 23:00:00.000
13,14,2019-02-25 03:15:00,0,3.4,0,0,26.6,131,-102,0.0,2019-02-24 23:15:00.000
14,15,2019-02-25 03:30:00,0,3.4,0,0,26.6,127,-102,0.0,2019-02-24 23:30:00.000
15,16,2019-02-25 03:45:00,0,3.3,0,0,26.6,123,-101,0.0,2019-02-24 23:45:00.000
16,17,2019-02-25 04:00:00,0,3.3,0,0,26.5,119,-101,0.0,2019-02-25 00:00:00.000
17,18,2019-02-25 04:15:00,0,3.3,0,0,26.5,116,-101,0.0,2019-02-25 00:15:00.000
18,19,2019-02-25 04:30:00,0,3.2,0,0,26.5,112,-100,0.0,2019-02-25 00:30:00.000
19,20,2019-02-25 04:45:00,0,3.2,0,0,26.4,108,-100,0.0,2019-02-25 00:45:00.000
20,21,2019-02-25 05:00:00,0,3.2,0,0,26.4,105,-100,0.0,2019-02-25 01:00:00.000
21,22,2019-02-25 05:15:00,0,3.1,0,0,26.4,101,-100,0.0,2019-02-25 01:15:00.000
22,23,2019-02-25 05:30:00,0,3.1,0,0,26.4,97,-100,0.0,2019-02-25 01:30:00.000
23,24,2019-02-25 05:45:00,0,3.0,0,0,26.4,94,-100,0.0,2019-02-25 01:45:00.000
24,25,2019-02-25 06:00:00,3,3.0,3,2,26.4,90,-100,0.0,2019-02-25 02:00:00.000
25,26,2019-02-25 06:15:00,31,2.9,58,26,26.4,86,-100,5.9,2019-02-25 02:15:00.000
26,27,2019-02-25 06:30:00,66,2.9,37,61,26.4,83,-100,19.0,2019-02-25 02:30:00.000
27,28,2019-02-25 06:45:00,117,2.8,151,88,26.4,79,-100,15.4,2019-02-25 02:45:00.000
28,29,2019-02-25 07:00:00,186,2.8,371,90,26.4,75,-100,7.2,2019-02-25 03:00:00.000
29,30,2019-02-25 07:15:00,255,2.7,508,92,26.4,71,-101,3.5,2019-02-25 03:15:00.000
30,31,2019-02-25 07:30:00,277,2.7,299,167,26.4,68,-101,15.1,2019-02-25 03:30:00.000
31,32,2019-02-25 07:45:00,281,2.7,68,251,26.4,64,-101,28.5,2019-02-25 03:45:00.000
32,33,2019-02-25 08:00:00,288,2.6,4,286,26.4,60,-102,36.9,2019-02-25 04:00:00.000
33,34,2019-02-25 08:15:00,366,2.6,80,320,26.4,57,-102,29.7,2019-02-25 04:15:00.000
34,35,2019-02-25 08:30:00,480,2.6,329,281,26.5,53,-103,17.2,2019-02-25 04:30:00.000
35,36,2019-02-25 08:45:00,480,2.6,184,361,26.5,49,-103,24.6,2019-02-25 04:45:00.000
36,37,2019-02-25 09:00:00,498,2.7,127,410,26.5,46,-104,28.0,2019-02-25 05:00:00.000
37,38,2019-02-25 09:15:00,611,2.7,348,353,26.6,42,-105,17.8,2019-02-25 05:15:00.000
38,39,2019-02-25 09:30:00,728,2.7,610,249,26.6,39,-107,8.1,2019-02-25 05:30:00.000
39,40,2019-02-25 09:45:00,836,2.7,862,129,26.6,35,-108,0.0,2019-02-25 05:45:00.000
40,41,2019-02-25 10:00:00,876,2.7,872,132,26.7,31,-110,0.0,2019-02-25 06:00:00.000
41,42,2019-02-25 10:15:00,891,2.8,806,179,26.7,28,-112,2.3,2019-02-25 06:15:00.000
42,43,2019-02-25 10:30:00,900,2.8,739,228,26.7,24,-116,4.6,2019-02-25 06:30:00.000
43,44,2019-02-25 10:45:00,946,2.9,809,192,26.8,21,-120,2.3,2019-02-25 06:45:00.000
44,45,2019-02-25 11:00:00,988,2.9,877,154,26.8,18,-125,0.2,2019-02-25 07:00:00.000
45,46,2019-02-25 11:15:00,980,2.9,798,210,26.8,15,-134,2.6,2019-02-25 07:15:00.000
46,47,2019-02-25 11:30:00,1003,2.9,835,189,26.9,13,-145,1.4,2019-02-25 07:30:00.000
47,48,2019-02-25 11:45:00,1024,3.0,879,162,26.9,11,-161,0.0,2019-02-25 07:45:00.000
48,49,2019-02-25 12:00:00,1027,3.0,879,162,26.9,10,179,0.0,2019-02-25 08:00:00.000
49,50,2019-02-25 12:15:00,1024,3.0,879,161,26.9,11,159,0.0,2019-02-25 08:15:00.000
50,51,2019-02-25 12:30:00,1016,3.0,878,161,27.0,13,144,0.0,2019-02-25 08:30:00.000
51,52,2019-02-25 12:45:00,1003,3.0,875,160,27.0,15,133,0.0,2019-02-25 08:45:00.000
52,53,2019-02-25 13:00:00,985,3.1,871,159,27.0,18,125,0.0,2019-02-25 09:00:00.000
53,54,2019-02-25 13:15:00,963,3.1,865,157,27.0,21,119,0.0,2019-02-25 09:15:00.000
54,55,2019-02-25 13:30:00,935,3.1,859,156,27.1,25,115,0.0,2019-02-25 09:30:00.000
55,56,2019-02-25 13:45:00,903,3.1,850,154,27.1,28,112,0.0,2019-02-25 09:45:00.000
56,57,2019-02-25 14:00:00,866,3.2,839,152,27.1,32,110,0.0,2019-02-25 10:00:00.000
57,58,2019-02-25 14:15:00,825,3.2,827,150,27.1,35,108,0.0,2019-02-25 10:15:00.000
58,59,2019-02-25 14:30:00,780,3.2,813,147,27.1,39,106,0.0,2019-02-25 10:30:00.000
59,60,2019-02-25 14:45:00,731,3.3,797,143,27.1,43,105,0.0,2019-02-25 10:45:00.000
60,61,2019-02-25 15:00:00,678,3.3,778,139,27.1,46,104,0.0,2019-02-25 11:00:00.000
61,62,2019-02-25 15:15:00,623,3.3,756,134,27.1,50,103,0.0,2019-02-25 11:15:00.000
62,63,2019-02-25 15:30:00,564,3.4,731,129,27.0,53,103,0.0,2019-02-25 11:30:00.000
63,64,2019-02-25 15:45:00,504,3.4,701,123,27.0,57,102,0.0,2019-02-25 11:45:00.000
64,65,2019-02-25 16:00:00,441,3.5,666,116,27.0,61,101,0.0,2019-02-25 12:00:00.000
65,66,2019-02-25 16:15:00,377,3.5,625,108,27.0,64,101,0.0,2019-02-25 12:15:00.000
66,67,2019-02-25 16:30:00,286,3.5,372,146,27.0,68,101,8.8,2019-02-25 12:30:00.000
67,68,2019-02-25 16:45:00,220,3.6,269,134,27.0,72,100,11.7,2019-02-25 12:45:00.000
68,69,2019-02-25 17:00:00,177,3.6,368,87,27.0,76,100,3.7,2019-02-25 13:00:00.000
69,70,2019-02-25 17:15:00,125,3.6,341,60,26.9,79,100,0.4,2019-02-25 13:15:00.000
70,71,2019-02-25 17:30:00,67,3.6,132,49,26.9,83,100,6.9,2019-02-25 13:30:00.000
71,72,2019-02-25 17:45:00,26,3.6,31,23,26.8,87,100,4.5,2019-02-25 13:45:00.000
72,73,2019-02-25 18:00:00,2,3.6,3,2,26.7,90,100,0.0,2019-02-25 14:00:00.000
73,74,2019-02-25 18:15:00,0,3.6,0,0,26.7,94,100,0.0,2019-02-25 14:15:00.000
74,75,2019-02-25 18:30:00,0,3.7,0,0,26.6,98,100,0.0,2019-02-25 14:30:00.000
75,76,2019-02-25 18:45:00,0,3.7,0,0,26.5,101,100,0.0,2019-02-25 14:45:00.000
76,77,2019-02-25 19:00:00,0,3.7,0,0,26.5,105,100,0.0,2019-02-25 15:00:00.000
77,78,2019-02-25 19:15:00,0,3.7,0,0,26.4,109,100,0.0,2019-02-25 15:15:00.000
78,79,2019-02-25 19:30:00,0,3.7,0,0,26.3,112,100,0.0,2019-02-25 15:30:00.000
79,80,2019-02-25 19:45:00,0,3.7,0,0,26.3,116,100,0.0,2019-02-25 15:45:00.000
80,81,2019-02-25 20:00:00,0,3.7,0,0,26.2,120,101,0.0,2019-02-25 16:00:00.000
81,82,2019-02-25 20:15:00,0,3.7,0,0,26.3,124,101,0.0,2019-02-25 16:15:00.000
82,83,2019-02-25 20:30:00,0,3.7,0,0,26.3,127,102,0.0,2019-02-25 16:30:00.000
83,84,2019-02-25 20:45:00,0,3.7,0,0,26.3,131,102,0.0,2019-02-25 16:45:00.000
84,85,2019-02-25 21:00:00,0,3.7,0,0,26.4,135,103,0.0,2019-02-25 17:00:00.000
85,86,2019-02-25 21:15:00,0,3.7,0,0,26.4,138,104,0.0,2019-02-25 17:15:00.000
86,87,2019-02-25 21:30:00,0,3.7,0,0,26.5,142,105,0.0,2019-02-25 17:30:00.000
87,88,2019-02-25 21:45:00,0,3.7,0,0,26.5,145,106,0.0,2019-02-25 17:45:00.000
88,89,2019-02-25 22:00:00,0,3.7,0,0,26.5,149,108,0.0,2019-02-25 18:00:00.000
89,90,2019-02-25 22:15:00,0,3.7,0,0,26.6,153,110,0.0,2019-02-25 18:15:00.000
90,91,2019-02-25 22:30:00,0,3.7,0,0,26.6,156,113,0.0,2019-02-25 18:30:00.000
91,92,2019-02-25 22:45:00,0,3.7,0,0,26.7,159,116,0.0,2019-02-25 18:45:00.000
92,93,2019-02-25 23:00:00,0,3.7,0,0,26.7,163,122,0.0,2019-02-25 19:00:00.000
93,94,2019-02-25 23:15:00,0,3.7,0,0,26.7,166,129,0.0,2019-02-25 19:15:00.000
94,95,2019-02-25 23:30:00,0,3.7,0,0,26.6,168,141,0.0,2019-02-25 19:30:00.000
95,96,2019-02-25 23:45:00,0,3.7,0,0,26.6,170,159,0.0,2019-02-25 19:45:00.000
