,BLOCK_ID,DATA_DATETIME,GHI,WIND_SPEED,DNI,DHI,TEMPERATURE,ZENITH,AZIMUTH,CLOUD_OPACITY,ENTRY_TIME
0,1,2021-08-14 00:00:00,0,0.5,0,0,22.7,164,-8,79.0,2021-08-13 20:00:00.000
1,2,2021-08-14 00:15:00,0,0.5,0,0,22.7,163,-21,78.0,2021-08-13 20:15:00.000
2,3,2021-08-14 00:30:00,0,0.5,0,0,22.6,162,-31,77.2,2021-08-13 20:30:00.000
3,4,2021-08-14 00:45:00,0,0.5,0,0,22.6,159,-40,67.0,2021-08-13 20:45:00.000
4,5,2021-08-14 01:00:00,0,0.5,0,0,22.5,157,-47,53.6,2021-08-13 21:00:00.000
5,6,2021-08-14 01:15:00,0,0.4,0,0,22.5,154,-52,46.6,2021-08-13 21:15:00.000
6,7,2021-08-14 01:30:00,0,0.4,0,0,22.4,151,-56,33.8,2021-08-13 21:30:00.000
7,8,2021-08-14 01:45:00,0,0.4,0,0,22.4,148,-60,26.1,2021-08-13 21:45:00.000
8,9,2021-08-14 02:00:00,0,0.4,0,0,22.3,144,-63,20.8,2021-08-13 22:00:00.000
9,10,2021-08-14 02:15:00,0,0.4,0,0,22.3,141,-65,11.2,2021-08-13 22:15:00.000
10,11,2021-08-14 02:30:00,0,0.4,0,0,22.2,138,-67,0.0,2021-08-13 22:30:00.000
11,12,2021-08-14 02:45:00,0,0.4,0,0,22.2,134,-68,0.0,2021-08-13 22:45:00.000
12,13,2021-08-14 03:00:00,0,0.4,0,0,22.1,131,-69,0.0,2021-08-13 23:00:00.000
13,14,2021-08-14 03:15:00,0,0.3,0,0,22.1,127,-71,20.3,2021-08-13 23:15:00.000
14,15,2021-08-14 03:30:00,0,0.3,0,0,22.1,124,-71,4.2,2021-08-13 23:30:00.000
15,16,2021-08-14 03:45:00,0,0.3,0,0,22.1,120,-72,0.0,2021-08-13 23:45:00.000
16,17,2021-08-14 04:00:00,0,0.3,0,0,22.0,117,-73,0.0,2021-08-14 00:00:00.000
17,18,2021-08-14 04:15:00,0,0.3,0,0,22.0,113,-73,14.0,2021-08-14 00:15:00.000
18,19,2021-08-14 04:30:00,0,0.3,0,0,22.0,109,-74,2.8,2021-08-14 00:30:00.000
19,20,2021-08-14 04:45:00,0,0.3,0,0,22.0,106,-74,37.9,2021-08-14 00:45:00.000
20,21,2021-08-14 05:00:00,0,0.4,0,0,22.0,102,-75,9.4,2021-08-14 01:00:00.000
21,22,2021-08-14 05:15:00,0,0.4,0,0,22.0,98,-75,4.2,2021-08-14 01:15:00.000
22,23,2021-08-14 05:30:00,0,0.5,0,0,22.0,95,-75,29.2,2021-08-14 01:30:00.000
23,24,2021-08-14 05:45:00,1,0.5,3,1,21.9,91,-75,0.0,2021-08-14 01:45:00.000
24,25,2021-08-14 06:00:00,20,0.6,111,11,22.0,88,-75,0.0,2021-08-14 02:00:00.000
25,26,2021-08-14 06:15:00,44,0.6,52,40,22.4,84,-75,26.5,2021-08-14 02:15:00.000
26,27,2021-08-14 06:30:00,57,0.6,0,57,22.8,80,-75,49.6,2021-08-14 02:30:00.000
27,28,2021-08-14 06:45:00,109,0.6,2,109,23.3,77,-75,35.8,2021-08-14 02:45:00.000
28,29,2021-08-14 07:00:00,162,0.6,69,141,23.7,73,-75,29.0,2021-08-14 03:00:00.000
29,30,2021-08-14 07:15:00,220,0.8,174,159,24.3,70,-74,23.4,2021-08-14 03:15:00.000
30,31,2021-08-14 07:30:00,279,1.0,262,171,24.8,66,-74,19.6,2021-08-14 03:30:00.000
31,32,2021-08-14 07:45:00,347,1.1,386,168,25.4,62,-73,14.4,2021-08-14 03:45:00.000
32,33,2021-08-14 08:00:00,382,1.3,336,208,26.0,59,-73,17.5,2021-08-14 04:00:00.000
33,34,2021-08-14 08:15:00,420,1.5,313,241,26.6,55,-72,19.1,2021-08-14 04:15:00.000
34,35,2021-08-14 08:30:00,476,1.7,367,247,27.2,52,-71,17.0,2021-08-14 04:30:00.000
35,36,2021-08-14 08:45:00,541,1.9,460,233,27.7,48,-70,13.4,2021-08-14 04:45:00.000
36,37,2021-08-14 09:00:00,586,2.1,482,243,28.2,44,-69,12.8,2021-08-14 05:00:00.000
37,38,2021-08-14 09:15:00,639,2.2,538,234,28.6,41,-68,10.9,2021-08-14 05:15:00.000
38,39,2021-08-14 09:30:00,673,2.4,531,252,28.9,38,-66,11.4,2021-08-14 05:30:00.000
39,40,2021-08-14 09:45:00,697,2.5,503,281,29.3,34,-64,12.7,2021-08-14 05:45:00.000
40,41,2021-08-14 10:00:00,740,2.6,546,271,29.5,31,-61,11.2,2021-08-14 06:00:00.000
41,42,2021-08-14 10:15:00,783,2.7,598,252,29.6,28,-58,9.4,2021-08-14 06:15:00.000
42,43,2021-08-14 10:30:00,826,2.8,662,223,29.6,25,-53,7.2,2021-08-14 06:30:00.000
43,44,2021-08-14 10:45:00,842,2.9,652,236,29.7,22,-48,7.6,2021-08-14 06:45:00.000
44,45,2021-08-14 11:00:00,917,3.0,841,121,29.8,19,-41,1.4,2021-08-14 07:00:00.000
45,46,2021-08-14 11:15:00,915,3.0,796,153,29.8,17,-31,3.0,2021-08-14 07:15:00.000
46,47,2021-08-14 11:30:00,788,3.1,409,393,29.8,15,-19,17.2,2021-08-14 07:30:00.000
47,48,2021-08-14 11:45:00,955,3.1,886,98,29.8,14,-6,0.0,2021-08-14 07:45:00.000
48,49,2021-08-14 12:00:00,955,3.1,885,98,29.8,14,9,0.0,2021-08-14 08:00:00.000
49,50,2021-08-14 12:15:00,949,3.2,883,99,29.6,15,23,0.0,2021-08-14 08:15:00.000
50,51,2021-08-14 12:30:00,939,3.3,880,99,29.5,17,34,0.0,2021-08-14 08:30:00.000
51,52,2021-08-14 12:45:00,924,3.3,876,99,29.3,20,43,0.0,2021-08-14 08:45:00.000
52,53,2021-08-14 13:00:00,905,3.3,871,99,29.1,22,49,0.0,2021-08-14 09:00:00.000
53,54,2021-08-14 13:15:00,881,3.2,866,98,28.8,25,55,0.0,2021-08-14 09:15:00.000
54,55,2021-08-14 13:30:00,854,3.0,859,98,28.6,28,59,0.0,2021-08-14 09:30:00.000
55,56,2021-08-14 13:45:00,822,2.8,852,96,28.3,32,62,0.0,2021-08-14 09:45:00.000
56,57,2021-08-14 14:00:00,705,2.6,554,250,28.0,35,64,10.4,2021-08-14 10:00:00.000
57,58,2021-08-14 14:15:00,667,2.5,533,249,27.9,38,66,10.7,2021-08-14 10:15:00.000
58,59,2021-08-14 14:30:00,516,2.4,187,375,27.7,42,68,26.8,2021-08-14 10:30:00.000
59,60,2021-08-14 14:45:00,367,2.3,0,367,27.5,45,70,44.2,2021-08-14 10:45:00.000
60,61,2021-08-14 15:00:00,250,2.2,0,250,27.4,49,71,59.0,2021-08-14 11:00:00.000
61,62,2021-08-14 15:15:00,270,2.1,0,270,27.3,52,72,51.2,2021-08-14 11:15:00.000
62,63,2021-08-14 15:30:00,317,2.1,4,315,27.3,56,72,36.8,2021-08-14 11:30:00.000
63,64,2021-08-14 15:45:00,304,2.0,83,264,27.2,60,73,31.6,2021-08-14 11:45:00.000
64,65,2021-08-14 16:00:00,309,2.0,237,202,27.1,63,74,20.6,2021-08-14 12:00:00.000
65,66,2021-08-14 16:15:00,271,2.0,274,164,26.9,67,74,17.7,2021-08-14 12:15:00.000
66,67,2021-08-14 16:30:00,208,2.0,154,155,26.7,70,74,23.4,2021-08-14 12:30:00.000
67,68,2021-08-14 16:45:00,161,1.9,116,128,26.5,74,75,24.2,2021-08-14 12:45:00.000
68,69,2021-08-14 17:00:00,121,1.9,126,94,26.2,78,75,21.4,2021-08-14 13:00:00.000
69,70,2021-08-14 17:15:00,98,1.9,382,38,25.7,81,75,2.7,2021-08-14 13:15:00.000
70,71,2021-08-14 17:30:00,33,1.8,45,27,25.2,85,75,39.4,2021-08-14 13:30:00.000
71,72,2021-08-14 17:45:00,5,1.8,0,5,24.6,88,75,58.9,2021-08-14 13:45:00.000
72,73,2021-08-14 18:00:00,0,1.7,0,0,24.2,92,75,56.4,2021-08-14 14:00:00.000
73,74,2021-08-14 18:15:00,0,1.8,0,0,23.9,96,75,33.3,2021-08-14 14:15:00.000
74,75,2021-08-14 18:30:00,0,1.8,0,0,23.7,99,75,31.4,2021-08-14 14:30:00.000
75,76,2021-08-14 18:45:00,0,1.8,0,0,23.4,103,75,19.6,2021-08-14 14:45:00.000
76,77,2021-08-14 19:00:00,0,1.8,0,0,23.2,107,74,13.8,2021-08-14 15:00:00.000
77,78,2021-08-14 19:15:00,0,1.8,0,0,23.1,110,74,19.7,2021-08-14 15:15:00.000
78,79,2021-08-14 19:30:00,0,1.8,0,0,23.0,114,74,18.2,2021-08-14 15:30:00.000
79,80,2021-08-14 19:45:00,0,1.8,0,0,23.0,117,73,21.2,2021-08-14 15:45:00.000
80,81,2021-08-14 20:00:00,0,1.8,0,0,22.9,121,72,21.6,2021-08-14 16:00:00.000
81,82,2021-08-14 20:15:00,0,1.8,0,0,22.8,125,72,25.5,2021-08-14 16:15:00.000
82,83,2021-08-14 20:30:00,0,1.7,0,0,22.8,128,71,50.0,2021-08-14 16:30:00.000
83,84,2021-08-14 20:45:00,0,1.7,0,0,22.7,132,69,52.8,2021-08-14 16:45:00.000
84,85,2021-08-14 21:00:00,0,1.7,0,0,22.7,135,68,42.2,2021-08-14 17:00:00.000
85,86,2021-08-14 21:15:00,0,1.6,0,0,22.7,139,67,17.4,2021-08-14 17:15:00.000
86,87,2021-08-14 21:30:00,0,1.6,0,0,22.7,142,65,13.6,2021-08-14 17:30:00.000
87,88,2021-08-14 21:45:00,0,1.5,0,0,22.6,145,62,49.2,2021-08-14 17:45:00.000
88,89,2021-08-14 22:00:00,0,1.5,0,0,22.6,149,60,57.4,2021-08-14 18:00:00.000
89,90,2021-08-14 22:15:00,0,1.4,0,0,22.6,152,56,64.6,2021-08-14 18:15:00.000
90,91,2021-08-14 22:30:00,0,1.3,0,0,22.6,155,52,68.4,2021-08-14 18:30:00.000
91,92,2021-08-14 22:45:00,0,1.3,0,0,22.5,158,46,67.8,2021-08-14 18:45:00.000
92,93,2021-08-14 23:00:00,0,1.2,0,0,22.5,160,39,70.2,2021-08-14 19:00:00.000
93,94,2021-08-14 23:15:00,0,1.2,0,0,22.5,162,29,73.3,2021-08-14 19:15:00.000
94,95,2021-08-14 23:30:00,0,1.1,0,0,22.4,164,18,74.0,2021-08-14 19:30:00.000
95,96,2021-08-14 23:45:00,0,1.1,0,0,22.4,165,5,73.0,2021-08-14 19:45:00.000
