,BLOCK_ID,DATA_DATETIME,GHI,WIND_SPEED,DNI,DHI,TEMPERATURE,ZENITH,AZIMUTH,CLOUD_OPACITY,ENTRY_TIME
0,1,2021-09-16 00:00:00,0,0.8,0,0,22.3,174,-48,96.2,2021-09-15 20:00:00.000
1,2,2021-09-16 00:15:00,0,0.8,0,0,22.3,171,-64,82.0,2021-09-15 20:15:00.000
2,3,2021-09-16 00:30:00,0,0.8,0,0,22.2,167,-71,75.6,2021-09-15 20:30:00.000
3,4,2021-09-16 00:45:00,0,0.8,0,0,22.2,163,-76,83.9,2021-09-15 20:45:00.000
4,5,2021-09-16 01:00:00,0,0.8,0,0,22.2,160,-78,96.2,2021-09-15 21:00:00.000
5,6,2021-09-16 01:15:00,0,0.8,0,0,22.2,156,-80,97.0,2021-09-15 21:15:00.000
6,7,2021-09-16 01:30:00,0,0.9,0,0,22.2,152,-81,96.2,2021-09-15 21:30:00.000
7,8,2021-09-16 01:45:00,0,0.9,0,0,22.1,149,-82,96.0,2021-09-15 21:45:00.000
8,9,2021-09-16 02:00:00,0,1.0,0,0,22.1,145,-83,96.8,2021-09-15 22:00:00.000
9,10,2021-09-16 02:15:00,0,0.9,0,0,22.1,141,-84,97.0,2021-09-15 22:15:00.000
10,11,2021-09-16 02:30:00,0,0.9,0,0,22.1,138,-84,87.4,2021-09-15 22:30:00.000
11,12,2021-09-16 02:45:00,0,0.9,0,0,22.1,134,-85,97.0,2021-09-15 22:45:00.000
12,13,2021-09-16 03:00:00,0,0.8,0,0,22.1,130,-85,97.0,2021-09-15 23:00:00.000
13,14,2021-09-16 03:15:00,0,0.8,0,0,22.1,126,-85,97.0,2021-09-15 23:15:00.000
14,15,2021-09-16 03:30:00,0,0.8,0,0,22.1,123,-86,97.0,2021-09-15 23:30:00.000
15,16,2021-09-16 03:45:00,0,0.8,0,0,22.1,119,-86,91.3,2021-09-15 23:45:00.000
16,17,2021-09-16 04:00:00,0,0.7,0,0,22.1,115,-86,74.8,2021-09-16 00:00:00.000
17,18,2021-09-16 04:15:00,0,0.7,0,0,22.1,111,-86,91.4,2021-09-16 00:15:00.000
18,19,2021-09-16 04:30:00,0,0.7,0,0,22.1,108,-86,93.8,2021-09-16 00:30:00.000
19,20,2021-09-16 04:45:00,0,0.7,0,0,22.1,104,-86,94.2,2021-09-16 00:45:00.000
20,21,2021-09-16 05:00:00,0,0.7,0,0,22.0,100,-86,97.0,2021-09-16 01:00:00.000
21,22,2021-09-16 05:15:00,0,0.7,0,0,22.0,96,-87,63.6,2021-09-16 01:15:00.000
22,23,2021-09-16 05:30:00,0,0.7,0,0,22.1,93,-87,87.6,2021-09-16 01:30:00.000
23,24,2021-09-16 05:45:00,1,0.6,0,1,22.1,89,-87,87.2,2021-09-16 01:45:00.000
24,25,2021-09-16 06:00:00,15,0.6,0,15,22.2,85,-87,70.2,2021-09-16 02:00:00.000
25,26,2021-09-16 06:15:00,41,0.6,0,41,22.4,81,-87,58.9,2021-09-16 02:15:00.000
26,27,2021-09-16 06:30:00,63,0.6,0,63,22.8,78,-87,58.8,2021-09-16 02:30:00.000
27,28,2021-09-16 06:45:00,63,0.5,0,63,23.1,74,-87,70.5,2021-09-16 02:45:00.000
28,29,2021-09-16 07:00:00,76,0.5,0,76,23.4,70,-87,72.4,2021-09-16 03:00:00.000
29,30,2021-09-16 07:15:00,90,0.4,0,90,23.8,67,-87,73.4,2021-09-16 03:15:00.000
30,31,2021-09-16 07:30:00,115,0.4,0,115,24.1,63,-87,71.2,2021-09-16 03:30:00.000
31,32,2021-09-16 07:45:00,102,0.3,0,102,24.5,59,-86,77.6,2021-09-16 03:45:00.000
32,33,2021-09-16 08:00:00,144,0.3,0,144,24.8,55,-86,72.4,2021-09-16 04:00:00.000
33,34,2021-09-16 08:15:00,242,0.3,0,242,25.1,51,-86,58.1,2021-09-16 04:15:00.000
34,35,2021-09-16 08:30:00,336,0.2,0,336,25.4,48,-86,46.6,2021-09-16 04:30:00.000
35,36,2021-09-16 08:45:00,326,0.2,0,326,25.7,44,-86,52.0,2021-09-16 04:45:00.000
36,37,2021-09-16 09:00:00,275,0.2,0,275,25.9,40,-86,62.2,2021-09-16 05:00:00.000
37,38,2021-09-16 09:15:00,303,0.1,0,303,26.1,36,-85,60.9,2021-09-16 05:15:00.000
38,39,2021-09-16 09:30:00,404,0.1,0,404,26.2,33,-85,50.4,2021-09-16 05:30:00.000
39,40,2021-09-16 09:45:00,459,0.2,0,459,26.4,29,-84,46.1,2021-09-16 05:45:00.000
40,41,2021-09-16 10:00:00,481,0.3,0,481,26.5,25,-84,45.6,2021-09-16 06:00:00.000
41,42,2021-09-16 10:15:00,567,0.3,36,533,26.6,22,-83,38.0,2021-09-16 06:15:00.000
42,43,2021-09-16 10:30:00,700,0.4,229,481,26.6,18,-81,25.4,2021-09-16 06:30:00.000
43,44,2021-09-16 10:45:00,663,0.4,129,539,26.6,14,-79,30.7,2021-09-16 06:45:00.000
44,45,2021-09-16 11:00:00,572,0.5,14,558,26.6,11,-75,41.2,2021-09-16 07:00:00.000
45,46,2021-09-16 11:15:00,468,0.5,0,468,26.5,7,-67,52.4,2021-09-16 07:15:00.000
46,47,2021-09-16 11:30:00,172,0.6,0,172,26.3,4,-43,82.6,2021-09-16 07:30:00.000
47,48,2021-09-16 11:45:00,53,0.7,0,53,26.1,3,19,94.6,2021-09-16 07:45:00.000
48,49,2021-09-16 12:00:00,39,0.8,0,39,25.9,6,60,96.0,2021-09-16 08:00:00.000
49,50,2021-09-16 12:15:00,61,0.9,0,61,25.7,9,72,93.8,2021-09-16 08:15:00.000
50,51,2021-09-16 12:30:00,102,1.0,0,102,25.4,13,78,89.4,2021-09-16 08:30:00.000
51,52,2021-09-16 12:45:00,95,1.2,0,95,25.1,16,80,90.0,2021-09-16 08:45:00.000
52,53,2021-09-16 13:00:00,70,1.3,0,70,24.9,20,82,92.4,2021-09-16 09:00:00.000
53,54,2021-09-16 13:15:00,87,1.3,0,87,24.7,24,83,90.3,2021-09-16 09:15:00.000
54,55,2021-09-16 13:30:00,43,1.3,0,43,24.5,27,84,95.0,2021-09-16 09:30:00.000
55,56,2021-09-16 13:45:00,65,1.3,0,65,24.3,31,85,92.1,2021-09-16 09:45:00.000
56,57,2021-09-16 14:00:00,60,1.3,0,60,24.2,35,85,92.4,2021-09-16 10:00:00.000
57,58,2021-09-16 14:15:00,73,1.4,0,73,24.0,39,86,90.2,2021-09-16 10:15:00.000
58,59,2021-09-16 14:30:00,104,1.4,0,104,23.8,42,86,85.2,2021-09-16 10:30:00.000
59,60,2021-09-16 14:45:00,124,1.5,0,124,23.6,46,86,80.9,2021-09-16 10:45:00.000
60,61,2021-09-16 15:00:00,106,1.5,0,106,23.4,50,86,82.2,2021-09-16 11:00:00.000
61,62,2021-09-16 15:15:00,73,1.3,0,73,23.4,54,86,86.7,2021-09-16 11:15:00.000
62,63,2021-09-16 15:30:00,68,1.1,0,68,23.3,57,87,85.8,2021-09-16 11:30:00.000
63,64,2021-09-16 15:45:00,39,0.9,0,39,23.3,61,87,90.5,2021-09-16 11:45:00.000
64,65,2021-09-16 16:00:00,33,0.7,0,33,23.2,65,87,91.2,2021-09-16 12:00:00.000
65,66,2021-09-16 16:15:00,18,0.7,0,18,23.1,69,87,94.0,2021-09-16 12:15:00.000
66,67,2021-09-16 16:30:00,29,0.6,0,29,23.0,72,87,87.6,2021-09-16 12:30:00.000
67,68,2021-09-16 16:45:00,46,0.5,0,46,22.9,76,87,74.7,2021-09-16 12:45:00.000
68,69,2021-09-16 17:00:00,24,0.5,0,24,22.8,80,87,80.4,2021-09-16 13:00:00.000
69,70,2021-09-16 17:15:00,16,0.5,0,16,22.7,84,87,76.1,2021-09-16 13:15:00.000
70,71,2021-09-16 17:30:00,5,0.6,0,5,22.7,87,87,79.6,2021-09-16 13:30:00.000
71,72,2021-09-16 17:45:00,0,0.7,0,0,22.6,91,87,89.0,2021-09-16 13:45:00.000
72,73,2021-09-16 18:00:00,0,0.8,0,0,22.5,95,87,91.4,2021-09-16 14:00:00.000
73,74,2021-09-16 18:15:00,0,0.8,0,0,22.5,99,87,90.1,2021-09-16 14:15:00.000
74,75,2021-09-16 18:30:00,0,0.9,0,0,22.4,102,87,89.6,2021-09-16 14:30:00.000
75,76,2021-09-16 18:45:00,0,1.0,0,0,22.4,106,87,89.0,2021-09-16 14:45:00.000
76,77,2021-09-16 19:00:00,0,1.0,0,0,22.4,110,86,85.8,2021-09-16 15:00:00.000
77,78,2021-09-16 19:15:00,0,1.0,0,0,22.3,114,86,88.3,2021-09-16 15:15:00.000
78,79,2021-09-16 19:30:00,0,1.0,0,0,22.2,117,86,89.0,2021-09-16 15:30:00.000
79,80,2021-09-16 19:45:00,0,1.1,0,0,22.2,121,86,87.7,2021-09-16 15:45:00.000
80,81,2021-09-16 20:00:00,0,1.2,0,0,22.1,125,86,85.4,2021-09-16 16:00:00.000
81,82,2021-09-16 20:15:00,0,1.1,0,0,22.1,128,85,87.0,2021-09-16 16:15:00.000
82,83,2021-09-16 20:30:00,0,1.1,0,0,22.0,132,85,88.6,2021-09-16 16:30:00.000
83,84,2021-09-16 20:45:00,0,1.1,0,0,22.0,136,85,87.7,2021-09-16 16:45:00.000
84,85,2021-09-16 21:00:00,0,1.0,0,0,21.9,140,84,85.4,2021-09-16 17:00:00.000
85,86,2021-09-16 21:15:00,0,1.0,0,0,21.9,143,84,85.3,2021-09-16 17:15:00.000
86,87,2021-09-16 21:30:00,0,0.9,0,0,21.8,147,83,85.2,2021-09-16 17:30:00.000
87,88,2021-09-16 21:45:00,0,0.9,0,0,21.7,151,82,82.5,2021-09-16 17:45:00.000
88,89,2021-09-16 22:00:00,0,0.9,0,0,21.7,155,81,79.5,2021-09-16 18:00:00.000
89,90,2021-09-16 22:15:00,0,0.9,0,0,21.6,158,80,80.1,2021-09-16 18:15:00.000
90,91,2021-09-16 22:30:00,0,0.9,0,0,21.5,162,78,81.0,2021-09-16 18:30:00.000
91,92,2021-09-16 22:45:00,0,0.9,0,0,21.4,166,75,80.0,2021-09-16 18:45:00.000
92,93,2021-09-16 23:00:00,0,0.9,0,0,21.3,169,70,79.2,2021-09-16 19:00:00.000
93,94,2021-09-16 23:15:00,0,0.8,0,0,21.3,173,59,77.3,2021-09-16 19:15:00.000
94,95,2021-09-16 23:30:00,0,0.6,0,0,21.2,175,34,75.6,2021-09-16 19:30:00.000
95,96,2021-09-16 23:45:00,0,0.5,0,0,21.2,176,-15,73.0,2021-09-16 19:45:00.000
