,BLOCK_ID,DATA_DATETIME,GHI,WIND_SPEED,DNI,DHI,TEMPERATURE,ZENITH,AZIMUTH,CLOUD_OPACITY,ENTRY_TIME
0,1,2021-08-08 00:00:00,0,2.0,0,0,23.2,162,-7,69.2,2021-08-07 20:00:00.000
1,2,2021-08-08 00:15:00,0,1.9,0,0,23.2,162,-18,74.0,2021-08-07 20:15:00.000
2,3,2021-08-08 00:30:00,0,1.8,0,0,23.2,160,-28,72.4,2021-08-07 20:30:00.000
3,4,2021-08-08 00:45:00,0,1.8,0,0,23.2,158,-36,67.1,2021-08-07 20:45:00.000
4,5,2021-08-08 01:00:00,0,1.7,0,0,23.2,156,-43,56.2,2021-08-07 21:00:00.000
5,6,2021-08-08 01:15:00,0,1.7,0,0,23.1,153,-49,35.0,2021-08-07 21:15:00.000
6,7,2021-08-08 01:30:00,0,1.7,0,0,23.0,150,-53,14.0,2021-08-07 21:30:00.000
7,8,2021-08-08 01:45:00,0,1.7,0,0,23.0,147,-57,46.0,2021-08-07 21:45:00.000
8,9,2021-08-08 02:00:00,0,1.6,0,0,22.9,144,-60,43.6,2021-08-07 22:00:00.000
9,10,2021-08-08 02:15:00,0,1.6,0,0,22.9,141,-62,44.1,2021-08-07 22:15:00.000
10,11,2021-08-08 02:30:00,0,1.6,0,0,22.9,137,-64,42.6,2021-08-07 22:30:00.000
11,12,2021-08-08 02:45:00,0,1.5,0,0,22.9,134,-66,30.7,2021-08-07 22:45:00.000
12,13,2021-08-08 03:00:00,0,1.5,0,0,22.8,130,-67,23.2,2021-08-07 23:00:00.000
13,14,2021-08-08 03:15:00,0,1.4,0,0,22.8,127,-68,30.0,2021-08-07 23:15:00.000
14,15,2021-08-08 03:30:00,0,1.3,0,0,22.9,123,-69,23.8,2021-08-07 23:30:00.000
15,16,2021-08-08 03:45:00,0,1.2,0,0,22.9,120,-70,56.5,2021-08-07 23:45:00.000
16,17,2021-08-08 04:00:00,0,1.2,0,0,22.9,116,-71,61.6,2021-08-08 00:00:00.000
17,18,2021-08-08 04:15:00,0,1.2,0,0,22.9,113,-72,49.7,2021-08-08 00:15:00.000
18,19,2021-08-08 04:30:00,0,1.1,0,0,22.8,109,-72,24.4,2021-08-08 00:30:00.000
19,20,2021-08-08 04:45:00,0,1.1,0,0,22.8,106,-72,37.2,2021-08-08 00:45:00.000
20,21,2021-08-08 05:00:00,0,1.1,0,0,22.8,102,-73,45.8,2021-08-08 01:00:00.000
21,22,2021-08-08 05:15:00,0,1.1,0,0,22.9,99,-73,18.0,2021-08-08 01:15:00.000
22,23,2021-08-08 05:30:00,0,1.1,0,0,22.9,95,-73,3.6,2021-08-08 01:30:00.000
23,24,2021-08-08 05:45:00,0,1.2,0,0,22.9,91,-73,13.7,2021-08-08 01:45:00.000
24,25,2021-08-08 06:00:00,15,1.2,2,15,23.0,88,-73,13.0,2021-08-08 02:00:00.000
25,26,2021-08-08 06:15:00,56,1.2,279,27,23.2,84,-73,0.0,2021-08-08 02:15:00.000
26,27,2021-08-08 06:30:00,105,1.3,402,39,23.3,81,-73,0.0,2021-08-08 02:30:00.000
27,28,2021-08-08 06:45:00,159,1.3,493,49,23.5,77,-73,0.0,2021-08-08 02:45:00.000
28,29,2021-08-08 07:00:00,216,1.4,562,56,23.7,73,-73,0.0,2021-08-08 03:00:00.000
29,30,2021-08-08 07:15:00,275,1.5,616,63,24.2,70,-72,0.0,2021-08-08 03:15:00.000
30,31,2021-08-08 07:30:00,333,1.5,660,68,24.6,66,-72,0.0,2021-08-08 03:30:00.000
31,32,2021-08-08 07:45:00,392,1.6,696,73,25.0,63,-72,0.0,2021-08-08 03:45:00.000
32,33,2021-08-08 08:00:00,449,1.7,726,77,25.4,59,-71,0.0,2021-08-08 04:00:00.000
33,34,2021-08-08 08:15:00,504,1.9,749,81,25.8,56,-70,0.0,2021-08-08 04:15:00.000
34,35,2021-08-08 08:30:00,557,2.1,769,85,26.2,52,-69,0.0,2021-08-08 04:30:00.000
35,36,2021-08-08 08:45:00,608,2.3,786,88,26.6,49,-68,0.0,2021-08-08 04:45:00.000
36,37,2021-08-08 09:00:00,619,2.4,642,167,27.0,45,-67,5.6,2021-08-08 05:00:00.000
37,38,2021-08-08 09:15:00,609,2.5,458,267,27.3,42,-65,13.1,2021-08-08 05:15:00.000
38,39,2021-08-08 09:30:00,691,2.5,623,201,27.7,38,-63,7.0,2021-08-08 05:30:00.000
39,40,2021-08-08 09:45:00,753,2.5,729,155,28.0,35,-61,3.5,2021-08-08 05:45:00.000
40,41,2021-08-08 10:00:00,782,2.5,721,169,28.4,32,-58,4.0,2021-08-08 06:00:00.000
41,42,2021-08-08 10:15:00,789,2.6,652,217,28.6,29,-55,6.6,2021-08-08 06:15:00.000
42,43,2021-08-08 10:30:00,795,2.6,596,258,28.8,26,-50,8.8,2021-08-08 06:30:00.000
43,44,2021-08-08 10:45:00,813,2.7,594,266,29.0,23,-45,9.0,2021-08-08 06:45:00.000
44,45,2021-08-08 11:00:00,800,2.8,513,320,29.3,20,-38,12.2,2021-08-08 07:00:00.000
45,46,2021-08-08 11:15:00,864,2.9,665,232,29.5,18,-29,6.6,2021-08-08 07:15:00.000
46,47,2021-08-08 11:30:00,836,2.9,563,298,29.7,17,-18,10.4,2021-08-08 07:30:00.000
47,48,2021-08-08 11:45:00,892,2.9,719,201,29.9,16,-6,4.9,2021-08-08 07:45:00.000
48,49,2021-08-08 12:00:00,848,3.0,590,281,30.1,16,7,9.6,2021-08-08 08:00:00.000
49,50,2021-08-08 12:15:00,841,2.9,588,280,30.1,17,20,9.8,2021-08-08 08:15:00.000
50,51,2021-08-08 12:30:00,923,2.8,862,106,30.2,19,30,0.0,2021-08-08 08:30:00.000
51,52,2021-08-08 12:45:00,893,2.8,806,139,30.2,21,39,1.8,2021-08-08 08:45:00.000
52,53,2021-08-08 13:00:00,880,2.7,820,127,30.1,23,46,1.2,2021-08-08 09:00:00.000
53,54,2021-08-08 13:15:00,868,2.4,852,103,29.9,26,51,0.0,2021-08-08 09:15:00.000
54,55,2021-08-08 13:30:00,842,2.2,846,102,29.7,29,55,0.0,2021-08-08 09:30:00.000
55,56,2021-08-08 13:45:00,769,2.0,689,186,29.4,32,59,5.1,2021-08-08 09:45:00.000
56,57,2021-08-08 14:00:00,771,1.7,814,108,29.1,35,61,0.6,2021-08-08 10:00:00.000
57,58,2021-08-08 14:15:00,626,1.6,419,298,28.7,39,64,15.1,2021-08-08 10:15:00.000
58,59,2021-08-08 14:30:00,440,1.5,61,394,28.3,42,66,36.8,2021-08-08 10:30:00.000
59,60,2021-08-08 14:45:00,479,1.5,185,351,27.9,46,67,26.2,2021-08-08 10:45:00.000
60,61,2021-08-08 15:00:00,583,1.4,711,119,27.6,49,68,3.0,2021-08-08 11:00:00.000
61,62,2021-08-08 15:15:00,551,1.4,774,81,27.4,53,69,0.0,2021-08-08 11:15:00.000
62,63,2021-08-08 15:30:00,498,1.4,757,76,27.2,56,70,0.0,2021-08-08 11:30:00.000
63,64,2021-08-08 15:45:00,443,1.4,735,71,27.0,60,71,0.0,2021-08-08 11:45:00.000
64,65,2021-08-08 16:00:00,387,1.4,709,66,26.8,63,72,0.0,2021-08-08 12:00:00.000
65,66,2021-08-08 16:15:00,240,1.4,140,184,26.6,67,72,27.4,2021-08-08 12:15:00.000
66,67,2021-08-08 16:30:00,156,1.3,0,156,26.4,70,73,42.4,2021-08-08 12:30:00.000
67,68,2021-08-08 16:45:00,72,1.3,0,72,26.3,74,73,66.2,2021-08-08 12:45:00.000
68,69,2021-08-08 17:00:00,50,1.2,0,50,26.0,77,73,68.2,2021-08-08 13:00:00.000
69,70,2021-08-08 17:15:00,38,1.2,0,38,25.5,81,73,62.9,2021-08-08 13:15:00.000
70,71,2021-08-08 17:30:00,20,1.2,0,20,25.0,85,73,62.6,2021-08-08 13:30:00.000
71,72,2021-08-08 17:45:00,3,1.3,0,3,24.4,88,73,81.4,2021-08-08 13:45:00.000
72,73,2021-08-08 18:00:00,0,1.3,0,0,24.0,92,73,87.0,2021-08-08 14:00:00.000
73,74,2021-08-08 18:15:00,0,1.2,0,0,23.9,95,73,97.0,2021-08-08 14:15:00.000
74,75,2021-08-08 18:30:00,0,1.1,0,0,23.7,99,73,97.0,2021-08-08 14:30:00.000
75,76,2021-08-08 18:45:00,0,1.1,0,0,23.6,103,73,97.0,2021-08-08 14:45:00.000
76,77,2021-08-08 19:00:00,0,1.0,0,0,23.5,106,73,97.0,2021-08-08 15:00:00.000
77,78,2021-08-08 19:15:00,0,1.0,0,0,23.4,110,72,97.0,2021-08-08 15:15:00.000
78,79,2021-08-08 19:30:00,0,1.0,0,0,23.3,113,72,97.0,2021-08-08 15:30:00.000
79,80,2021-08-08 19:45:00,0,1.0,0,0,23.2,117,71,90.4,2021-08-08 15:45:00.000
80,81,2021-08-08 20:00:00,0,1.0,0,0,23.1,120,70,63.8,2021-08-08 16:00:00.000
81,82,2021-08-08 20:15:00,0,0.9,0,0,23.0,124,70,97.0,2021-08-08 16:15:00.000
82,83,2021-08-08 20:30:00,0,0.8,0,0,22.9,127,69,97.0,2021-08-08 16:30:00.000
83,84,2021-08-08 20:45:00,0,0.7,0,0,22.8,131,67,97.0,2021-08-08 16:45:00.000
84,85,2021-08-08 21:00:00,0,0.7,0,0,22.7,134,66,97.0,2021-08-08 17:00:00.000
85,86,2021-08-08 21:15:00,0,0.6,0,0,22.6,138,64,97.0,2021-08-08 17:15:00.000
86,87,2021-08-08 21:30:00,0,0.6,0,0,22.6,141,62,97.0,2021-08-08 17:30:00.000
87,88,2021-08-08 21:45:00,0,0.6,0,0,22.6,144,60,97.0,2021-08-08 17:45:00.000
88,89,2021-08-08 22:00:00,0,0.6,0,0,22.5,148,57,97.0,2021-08-08 18:00:00.000
89,90,2021-08-08 22:15:00,0,0.6,0,0,22.5,151,53,97.0,2021-08-08 18:15:00.000
90,91,2021-08-08 22:30:00,0,0.6,0,0,22.5,154,49,97.0,2021-08-08 18:30:00.000
91,92,2021-08-08 22:45:00,0,0.6,0,0,22.4,156,43,97.0,2021-08-08 18:45:00.000
92,93,2021-08-08 23:00:00,0,0.6,0,0,22.4,159,36,97.0,2021-08-08 19:00:00.000
93,94,2021-08-08 23:15:00,0,0.5,0,0,22.4,161,27,97.0,2021-08-08 19:15:00.000
94,95,2021-08-08 23:30:00,0,0.5,0,0,22.4,162,17,97.0,2021-08-08 19:30:00.000
95,96,2021-08-08 23:45:00,0,0.4,0,0,22.4,163,5,97.0,2021-08-08 19:45:00.000
