,BLOCK_ID,DATA_DATETIME,GHI,WIND_SPEED,DNI,DHI,TEMPERATURE,ZENITH,AZIMUTH,CLOUD_OPACITY,ENTRY_TIME
0,1,2019-05-22 00:00:00,0,3.2,0,0,27.8,159,-12,0.0,2019-05-21 20:00:00.000
1,2,2019-05-22 00:15:00,0,3.3,0,0,27.7,158,-21,0.0,2019-05-21 20:15:00.000
2,3,2019-05-22 00:30:00,0,3.3,0,0,27.6,156,-29,0.0,2019-05-21 20:30:00.000
3,4,2019-05-22 00:45:00,0,3.4,0,0,27.6,154,-36,0.0,2019-05-21 20:45:00.000
4,5,2019-05-22 01:00:00,0,3.5,0,0,27.5,152,-42,0.0,2019-05-21 21:00:00.000
5,6,2019-05-22 01:15:00,0,3.6,0,0,27.5,149,-47,0.0,2019-05-21 21:15:00.000
6,7,2019-05-22 01:30:00,0,3.6,0,0,27.4,146,-51,0.0,2019-05-21 21:30:00.000
7,8,2019-05-22 01:45:00,0,3.7,0,0,27.3,143,-54,0.0,2019-05-21 21:45:00.000
8,9,2019-05-22 02:00:00,0,3.8,0,0,27.3,140,-57,0.0,2019-05-21 22:00:00.000
9,10,2019-05-22 02:15:00,0,3.8,0,0,27.2,137,-59,0.0,2019-05-21 22:15:00.000
10,11,2019-05-22 02:30:00,0,3.8,0,0,27.1,134,-61,0.0,2019-05-21 22:30:00.000
11,12,2019-05-22 02:45:00,0,3.7,0,0,27.1,131,-63,0.0,2019-05-21 22:45:00.000
12,13,2019-05-22 03:00:00,0,3.7,0,0,27.0,127,-64,0.0,2019-05-21 23:00:00.000
13,14,2019-05-22 03:15:00,0,3.8,0,0,26.9,124,-65,0.0,2019-05-21 23:15:00.000
14,15,2019-05-22 03:30:00,0,3.8,0,0,26.8,121,-66,0.0,2019-05-21 23:30:00.000
15,16,2019-05-22 03:45:00,0,3.8,0,0,26.7,117,-67,0.0,2019-05-21 23:45:00.000
16,17,2019-05-22 04:00:00,0,3.8,0,0,26.7,114,-68,0.0,2019-05-22 00:00:00.000
17,18,2019-05-22 04:15:00,0,3.9,0,0,26.6,110,-68,0.0,2019-05-22 00:15:00.000
18,19,2019-05-22 04:30:00,0,3.9,0,0,26.5,107,-69,0.0,2019-05-22 00:30:00.000
19,20,2019-05-22 04:45:00,0,3.9,0,0,26.4,103,-69,0.0,2019-05-22 00:45:00.000
20,21,2019-05-22 05:00:00,0,3.9,0,0,26.4,100,-70,0.0,2019-05-22 01:00:00.000
21,22,2019-05-22 05:15:00,0,3.5,0,0,26.4,96,-70,0.0,2019-05-22 01:15:00.000
22,23,2019-05-22 05:30:00,0,3.2,0,0,26.5,93,-70,0.0,2019-05-22 01:30:00.000
23,24,2019-05-22 05:45:00,7,3.0,22,5,26.6,89,-70,0.0,2019-05-22 01:45:00.000
24,25,2019-05-22 06:00:00,37,2.9,103,28,26.6,86,-70,7.7,2019-05-22 02:00:00.000
25,26,2019-05-22 06:15:00,55,3.0,0,55,26.7,82,-70,36.4,2019-05-22 02:15:00.000
26,27,2019-05-22 06:30:00,85,3.2,0,85,26.7,79,-70,37.7,2019-05-22 02:30:00.000
27,28,2019-05-22 06:45:00,116,3.5,0,116,26.8,75,-69,40.3,2019-05-22 02:45:00.000
28,29,2019-05-22 07:00:00,154,3.8,0,154,26.8,71,-69,38.6,2019-05-22 03:00:00.000
29,30,2019-05-22 07:15:00,174,4.3,0,174,26.9,68,-69,43.2,2019-05-22 03:15:00.000
30,31,2019-05-22 07:30:00,186,4.8,0,186,27.0,65,-68,48.9,2019-05-22 03:30:00.000
31,32,2019-05-22 07:45:00,286,5.3,90,240,27.0,61,-67,32.5,2019-05-22 03:45:00.000
32,33,2019-05-22 08:00:00,374,5.7,228,252,27.0,58,-67,21.4,2019-05-22 04:00:00.000
33,34,2019-05-22 08:15:00,306,5.6,7,302,27.0,54,-66,41.8,2019-05-22 04:15:00.000
34,35,2019-05-22 08:30:00,251,5.5,0,251,26.9,51,-64,56.8,2019-05-22 04:30:00.000
35,36,2019-05-22 08:45:00,342,5.4,5,339,26.8,47,-63,45.7,2019-05-22 04:45:00.000
36,37,2019-05-22 09:00:00,508,5.3,203,361,26.7,44,-61,24.7,2019-05-22 05:00:00.000
37,38,2019-05-22 09:15:00,641,5.3,522,246,26.7,41,-59,10.5,2019-05-22 05:15:00.000
38,39,2019-05-22 09:30:00,737,5.2,755,138,26.6,38,-57,2.5,2019-05-22 05:30:00.000
39,40,2019-05-22 09:45:00,778,5.1,788,130,26.5,35,-54,1.5,2019-05-22 05:45:00.000
40,41,2019-05-22 10:00:00,752,5.0,595,246,26.4,32,-50,8.5,2019-05-22 06:00:00.000
41,42,2019-05-22 10:15:00,735,4.9,469,324,26.3,29,-46,13.5,2019-05-22 06:15:00.000
42,43,2019-05-22 10:30:00,731,4.8,404,369,26.3,26,-41,16.2,2019-05-22 06:30:00.000
43,44,2019-05-22 10:45:00,728,4.7,354,405,26.2,24,-35,18.1,2019-05-22 06:45:00.000
44,45,2019-05-22 11:00:00,773,4.7,437,367,26.1,22,-27,14.4,2019-05-22 07:00:00.000
45,46,2019-05-22 11:15:00,699,4.6,237,477,26.2,21,-18,23.1,2019-05-22 07:15:00.000
46,47,2019-05-22 11:30:00,670,4.5,159,520,26.2,20,-8,26.7,2019-05-22 07:30:00.000
47,48,2019-05-22 11:45:00,616,4.5,75,545,26.2,19,2,32.7,2019-05-22 07:45:00.000
48,49,2019-05-22 12:00:00,628,4.4,95,539,26.2,20,12,31.2,2019-05-22 08:00:00.000
49,50,2019-05-22 12:15:00,688,4.3,212,490,26.3,21,22,24.0,2019-05-22 08:15:00.000
50,51,2019-05-22 12:30:00,552,4.2,44,511,26.3,23,30,38.3,2019-05-22 08:30:00.000
51,52,2019-05-22 12:45:00,146,4.2,0,146,26.3,25,37,83.4,2019-05-22 08:45:00.000
52,53,2019-05-22 13:00:00,106,4.1,0,106,26.4,27,43,87.6,2019-05-22 09:00:00.000
53,54,2019-05-22 13:15:00,75,4.0,0,75,26.4,30,48,91.1,2019-05-22 09:15:00.000
54,55,2019-05-22 13:30:00,52,4.0,0,52,26.4,33,52,93.5,2019-05-22 09:30:00.000
55,56,2019-05-22 13:45:00,114,3.9,0,114,26.5,36,55,85.2,2019-05-22 09:45:00.000
56,57,2019-05-22 14:00:00,180,3.8,0,180,26.5,39,58,75.6,2019-05-22 10:00:00.000
57,58,2019-05-22 14:15:00,166,3.7,0,166,26.5,42,60,76.1,2019-05-22 10:15:00.000
58,59,2019-05-22 14:30:00,167,3.5,0,167,26.6,45,62,74.4,2019-05-22 10:30:00.000
59,60,2019-05-22 14:45:00,200,3.4,0,200,26.6,49,63,66.9,2019-05-22 10:45:00.000
60,61,2019-05-22 15:00:00,267,3.2,0,267,26.6,52,65,52.1,2019-05-22 11:00:00.000
61,62,2019-05-22 15:15:00,326,3.1,12,320,26.7,56,66,35.5,2019-05-22 11:15:00.000
62,63,2019-05-22 15:30:00,288,3.0,8,283,26.7,59,67,36.4,2019-05-22 11:30:00.000
63,64,2019-05-22 15:45:00,237,2.9,0,237,26.7,62,68,40.3,2019-05-22 11:45:00.000
64,65,2019-05-22 16:00:00,189,2.8,0,189,26.8,66,68,44.6,2019-05-22 12:00:00.000
65,66,2019-05-22 16:15:00,145,2.7,0,145,26.8,69,69,48.9,2019-05-22 12:15:00.000
66,67,2019-05-22 16:30:00,126,2.6,0,126,26.8,73,69,43.9,2019-05-22 12:30:00.000
67,68,2019-05-22 16:45:00,93,2.5,0,93,26.9,76,69,45.3,2019-05-22 12:45:00.000
68,69,2019-05-22 17:00:00,70,2.5,0,70,26.9,80,70,39.5,2019-05-22 13:00:00.000
69,70,2019-05-22 17:15:00,38,2.4,0,38,26.8,83,70,41.5,2019-05-22 13:15:00.000
70,71,2019-05-22 17:30:00,14,2.4,0,14,26.7,87,70,49.8,2019-05-22 13:30:00.000
71,72,2019-05-22 17:45:00,0,2.4,0,0,26.7,90,70,58.0,2019-05-22 13:45:00.000
72,73,2019-05-22 18:00:00,0,2.4,0,0,26.6,94,70,57.2,2019-05-22 14:00:00.000
73,74,2019-05-22 18:15:00,0,2.4,0,0,26.5,98,70,46.9,2019-05-22 14:15:00.000
74,75,2019-05-22 18:30:00,0,2.4,0,0,26.4,101,69,36.8,2019-05-22 14:30:00.000
75,76,2019-05-22 18:45:00,0,2.4,0,0,26.4,105,69,40.2,2019-05-22 14:45:00.000
76,77,2019-05-22 19:00:00,0,2.4,0,0,26.3,108,69,18.0,2019-05-22 15:00:00.000
77,78,2019-05-22 19:15:00,0,2.4,0,0,26.2,112,68,44.3,2019-05-22 15:15:00.000
78,79,2019-05-22 19:30:00,0,2.5,0,0,26.1,115,67,27.7,2019-05-22 15:30:00.000
79,80,2019-05-22 19:45:00,0,2.5,0,0,26.1,118,67,23.7,2019-05-22 15:45:00.000
80,81,2019-05-22 20:00:00,0,2.6,0,0,26.0,122,66,22.8,2019-05-22 16:00:00.000
81,82,2019-05-22 20:15:00,0,2.6,0,0,26.1,125,65,42.9,2019-05-22 16:15:00.000
82,83,2019-05-22 20:30:00,0,2.7,0,0,26.3,129,63,30.9,2019-05-22 16:30:00.000
83,84,2019-05-22 20:45:00,0,2.8,0,0,26.4,132,62,34.7,2019-05-22 16:45:00.000
84,85,2019-05-22 21:00:00,0,2.8,0,0,26.5,135,60,49.7,2019-05-22 17:00:00.000
85,86,2019-05-22 21:15:00,0,2.9,0,0,26.6,138,58,50.2,2019-05-22 17:15:00.000
86,87,2019-05-22 21:30:00,0,3.0,0,0,26.7,142,55,37.0,2019-05-22 17:30:00.000
87,88,2019-05-22 21:45:00,0,3.1,0,0,26.9,145,52,37.0,2019-05-22 17:45:00.000
88,89,2019-05-22 22:00:00,0,3.1,0,0,27.0,148,49,36.3,2019-05-22 18:00:00.000
89,90,2019-05-22 22:15:00,0,3.2,0,0,27.1,150,44,0.0,2019-05-22 18:15:00.000
90,91,2019-05-22 22:30:00,0,3.3,0,0,27.2,153,39,0.0,2019-05-22 18:30:00.000
91,92,2019-05-22 22:45:00,0,3.4,0,0,27.4,155,33,0.0,2019-05-22 18:45:00.000
92,93,2019-05-22 23:00:00,0,3.4,0,0,27.4,157,26,0.0,2019-05-22 19:00:00.000
93,94,2019-05-22 23:15:00,0,3.5,0,0,27.4,158,17,0.0,2019-05-22 19:15:00.000
94,95,2019-05-22 23:30:00,0,3.6,0,0,27.3,159,8,0.0,2019-05-22 19:30:00.000
95,96,2019-05-22 23:45:00,0,3.7,0,0,27.2,159,-2,0.0,2019-05-22 19:45:00.000
