,BLOCK_ID,DATA_DATETIME,GHI,WIND_SPEED,DNI,DHI,TEMPERATURE,ZENITH,AZIMUTH,CLOUD_OPACITY,ENTRY_TIME
0,1,2018-12-18 00:00:00,0,3.4,0,0,27.0,157,-169,36.7,2018-12-17 20:00:00.000
1,2,2018-12-18 00:15:00,0,3.5,0,0,27.0,156,-161,36.8,2018-12-17 20:15:00.000
2,3,2018-12-18 00:30:00,0,3.5,0,0,26.9,154,-153,37.0,2018-12-17 20:30:00.000
3,4,2018-12-18 00:45:00,0,3.5,0,0,26.9,153,-147,37.0,2018-12-17 20:45:00.000
4,5,2018-12-18 01:00:00,0,3.6,0,0,26.9,150,-141,37.0,2018-12-17 21:00:00.000
5,6,2018-12-18 01:15:00,0,3.6,0,0,26.9,148,-137,37.0,2018-12-17 21:15:00.000
6,7,2018-12-18 01:30:00,0,3.7,0,0,26.9,145,-133,37.0,2018-12-17 21:30:00.000
7,8,2018-12-18 01:45:00,0,3.7,0,0,26.9,142,-129,37.0,2018-12-17 21:45:00.000
8,9,2018-12-18 02:00:00,0,3.7,0,0,26.9,139,-127,37.0,2018-12-17 22:00:00.000
9,10,2018-12-18 02:15:00,0,3.7,0,0,26.9,136,-124,37.0,2018-12-17 22:15:00.000
10,11,2018-12-18 02:30:00,0,3.7,0,0,26.9,133,-122,37.0,2018-12-17 22:30:00.000
11,12,2018-12-18 02:45:00,0,3.7,0,0,26.9,130,-121,37.0,2018-12-17 22:45:00.000
12,13,2018-12-18 03:00:00,0,3.7,0,0,26.9,127,-119,37.0,2018-12-17 23:00:00.000
13,14,2018-12-18 03:15:00,0,3.8,0,0,26.9,124,-118,37.0,2018-12-17 23:15:00.000
14,15,2018-12-18 03:30:00,0,3.8,0,0,27.0,120,-117,36.9,2018-12-17 23:30:00.000
15,16,2018-12-18 03:45:00,0,3.8,0,0,27.0,117,-116,36.8,2018-12-17 23:45:00.000
16,17,2018-12-18 04:00:00,0,3.8,0,0,27.0,113,-115,36.8,2018-12-18 00:00:00.000
17,18,2018-12-18 04:15:00,0,3.8,0,0,27.0,110,-115,37.0,2018-12-18 00:15:00.000
18,19,2018-12-18 04:30:00,0,3.8,0,0,27.0,107,-114,37.0,2018-12-18 00:30:00.000
19,20,2018-12-18 04:45:00,0,3.8,0,0,27.0,103,-114,37.0,2018-12-18 00:45:00.000
20,21,2018-12-18 05:00:00,0,3.8,0,0,27.0,100,-114,36.3,2018-12-18 01:00:00.000
21,22,2018-12-18 05:15:00,0,3.8,0,0,27.1,96,-113,37.6,2018-12-18 01:15:00.000
22,23,2018-12-18 05:30:00,0,3.8,0,0,27.1,93,-113,22.2,2018-12-18 01:30:00.000
23,24,2018-12-18 05:45:00,5,3.8,0,5,27.2,89,-113,18.0,2018-12-18 01:45:00.000
24,25,2018-12-18 06:00:00,30,3.7,0,30,27.3,86,-113,25.3,2018-12-18 02:00:00.000
25,26,2018-12-18 06:15:00,59,3.7,0,59,27.3,83,-114,33.7,2018-12-18 02:15:00.000
26,27,2018-12-18 06:30:00,104,3.7,48,95,27.4,79,-114,26.9,2018-12-18 02:30:00.000
27,28,2018-12-18 06:45:00,150,3.7,101,125,27.4,76,-114,24.8,2018-12-18 02:45:00.000
28,29,2018-12-18 07:00:00,201,3.7,167,150,27.5,72,-115,22.5,2018-12-18 03:00:00.000
29,30,2018-12-18 07:15:00,248,3.7,203,177,27.5,69,-115,21.9,2018-12-18 03:15:00.000
30,31,2018-12-18 07:30:00,313,3.7,310,182,27.6,66,-116,17.7,2018-12-18 03:30:00.000
31,32,2018-12-18 07:45:00,364,3.7,344,204,27.7,62,-117,16.6,2018-12-18 03:45:00.000
32,33,2018-12-18 08:00:00,405,3.7,330,235,27.7,59,-118,17.9,2018-12-18 04:00:00.000
33,34,2018-12-18 08:15:00,336,3.8,0,336,27.7,56,-119,38.7,2018-12-18 04:15:00.000
34,35,2018-12-18 08:30:00,364,3.9,0,364,27.6,52,-121,39.4,2018-12-18 04:30:00.000
35,36,2018-12-18 08:45:00,441,4.0,71,394,27.6,49,-122,32.4,2018-12-18 04:45:00.000
36,37,2018-12-18 09:00:00,590,4.1,428,291,27.6,46,-124,15.8,2018-12-18 05:00:00.000
37,38,2018-12-18 09:15:00,649,4.2,506,279,27.6,43,-126,12.7,2018-12-18 05:15:00.000
38,39,2018-12-18 09:30:00,655,4.3,417,336,27.5,40,-129,16.4,2018-12-18 05:30:00.000
39,40,2018-12-18 09:45:00,709,4.4,495,315,27.5,37,-132,13.6,2018-12-18 05:45:00.000
40,41,2018-12-18 10:00:00,775,4.5,621,263,27.5,34,-136,9.2,2018-12-18 06:00:00.000
41,42,2018-12-18 10:15:00,787,4.6,579,296,27.5,32,-140,10.9,2018-12-18 06:15:00.000
42,43,2018-12-18 10:30:00,796,4.7,542,324,27.4,30,-145,12.3,2018-12-18 06:30:00.000
43,44,2018-12-18 10:45:00,807,4.8,526,341,27.4,28,-151,13.0,2018-12-18 06:45:00.000
44,45,2018-12-18 11:00:00,827,4.9,549,334,27.4,26,-158,12.3,2018-12-18 07:00:00.000
45,46,2018-12-18 11:15:00,840,4.9,559,333,27.4,25,-165,12.0,2018-12-18 07:15:00.000
46,47,2018-12-18 11:30:00,850,4.8,574,326,27.5,24,-173,11.4,2018-12-18 07:30:00.000
47,48,2018-12-18 11:45:00,861,4.8,605,308,27.5,24,178,10.5,2018-12-18 07:45:00.000
48,49,2018-12-18 12:00:00,861,4.7,614,302,27.5,24,170,10.1,2018-12-18 08:00:00.000
49,50,2018-12-18 12:15:00,854,4.7,611,301,27.5,25,162,10.1,2018-12-18 08:15:00.000
50,51,2018-12-18 12:30:00,869,4.7,693,250,27.6,27,155,7.3,2018-12-18 08:30:00.000
51,52,2018-12-18 12:45:00,868,4.6,744,214,27.6,28,148,5.6,2018-12-18 08:45:00.000
52,53,2018-12-18 13:00:00,816,4.6,632,272,27.6,31,143,9.2,2018-12-18 09:00:00.000
53,54,2018-12-18 13:15:00,779,4.5,585,288,27.6,33,138,10.7,2018-12-18 09:15:00.000
54,55,2018-12-18 13:30:00,774,4.5,655,241,27.7,36,134,8.0,2018-12-18 09:30:00.000
55,56,2018-12-18 13:45:00,740,4.5,643,235,27.7,38,131,8.2,2018-12-18 09:45:00.000
56,57,2018-12-18 14:00:00,703,4.4,629,230,27.7,41,128,8.5,2018-12-18 10:00:00.000
57,58,2018-12-18 14:15:00,628,4.4,483,281,27.7,44,125,13.6,2018-12-18 10:15:00.000
58,59,2018-12-18 14:30:00,336,4.3,79,280,27.8,47,123,51.0,2018-12-18 10:30:00.000
59,60,2018-12-18 14:45:00,291,4.3,27,274,27.8,50,122,53.6,2018-12-18 10:45:00.000
60,61,2018-12-18 15:00:00,384,4.2,40,360,27.8,54,120,33.8,2018-12-18 11:00:00.000
61,62,2018-12-18 15:15:00,343,4.2,25,329,27.9,57,119,34.7,2018-12-18 11:15:00.000
62,63,2018-12-18 15:30:00,354,4.1,188,261,27.9,60,118,24.5,2018-12-18 11:30:00.000
63,64,2018-12-18 15:45:00,367,4.1,484,148,27.9,64,117,11.3,2018-12-18 11:45:00.000
64,65,2018-12-18 16:00:00,252,4.0,92,216,27.9,67,116,28.4,2018-12-18 12:00:00.000
65,66,2018-12-18 16:15:00,88,4.0,0,88,28.0,70,115,70.1,2018-12-18 12:15:00.000
66,67,2018-12-18 16:30:00,128,4.0,0,128,28.0,74,115,43.7,2018-12-18 12:30:00.000
67,68,2018-12-18 16:45:00,101,3.9,0,101,28.0,77,114,42.3,2018-12-18 12:45:00.000
68,69,2018-12-18 17:00:00,69,3.9,0,69,28.0,81,114,39.7,2018-12-18 13:00:00.000
69,70,2018-12-18 17:15:00,52,3.8,51,47,28.0,84,114,19.0,2018-12-18 13:15:00.000
70,71,2018-12-18 17:30:00,22,3.6,85,15,28.0,87,113,1.2,2018-12-18 13:30:00.000
71,72,2018-12-18 17:45:00,0,3.5,0,0,28.0,91,113,0.0,2018-12-18 13:45:00.000
72,73,2018-12-18 18:00:00,0,3.4,0,0,28.0,94,113,0.0,2018-12-18 14:00:00.000
73,74,2018-12-18 18:15:00,0,3.3,0,0,27.9,98,113,0.0,2018-12-18 14:15:00.000
74,75,2018-12-18 18:30:00,0,3.2,0,0,27.9,101,114,0.0,2018-12-18 14:30:00.000
75,76,2018-12-18 18:45:00,0,3.1,0,0,27.9,105,114,0.0,2018-12-18 14:45:00.000
76,77,2018-12-18 19:00:00,0,3.1,0,0,27.9,108,114,0.0,2018-12-18 15:00:00.000
77,78,2018-12-18 19:15:00,0,3.0,0,0,27.9,112,115,0.0,2018-12-18 15:15:00.000
78,79,2018-12-18 19:30:00,0,2.9,0,0,27.8,115,116,0.0,2018-12-18 15:30:00.000
79,80,2018-12-18 19:45:00,0,2.8,0,0,27.8,118,116,0.0,2018-12-18 15:45:00.000
80,81,2018-12-18 20:00:00,0,2.8,0,0,27.8,122,117,0.0,2018-12-18 16:00:00.000
81,82,2018-12-18 20:15:00,0,2.7,0,0,27.8,125,118,0.0,2018-12-18 16:15:00.000
82,83,2018-12-18 20:30:00,0,2.6,0,0,27.9,128,120,0.0,2018-12-18 16:30:00.000
83,84,2018-12-18 20:45:00,0,2.6,0,0,27.9,131,121,0.0,2018-12-18 16:45:00.000
84,85,2018-12-18 21:00:00,0,2.5,0,0,27.9,135,123,0.0,2018-12-18 17:00:00.000
85,86,2018-12-18 21:15:00,0,2.5,0,0,27.9,138,125,0.0,2018-12-18 17:15:00.000
86,87,2018-12-18 21:30:00,0,2.4,0,0,28.0,141,128,0.0,2018-12-18 17:30:00.000
87,88,2018-12-18 21:45:00,0,2.4,0,0,28.0,144,131,0.0,2018-12-18 17:45:00.000
88,89,2018-12-18 22:00:00,0,2.4,0,0,28.0,146,134,0.0,2018-12-18 18:00:00.000
89,90,2018-12-18 22:15:00,0,2.3,0,0,28.0,149,139,0.0,2018-12-18 18:15:00.000
90,91,2018-12-18 22:30:00,0,2.3,0,0,28.1,151,144,0.0,2018-12-18 18:30:00.000
91,92,2018-12-18 22:45:00,0,2.2,0,0,28.1,153,150,0.0,2018-12-18 18:45:00.000
92,93,2018-12-18 23:00:00,0,2.2,0,0,28.1,155,157,0.0,2018-12-18 19:00:00.000
93,94,2018-12-18 23:15:00,0,2.2,0,0,28.1,156,164,0.0,2018-12-18 19:15:00.000
94,95,2018-12-18 23:30:00,0,2.1,0,0,28.0,157,173,0.0,2018-12-18 19:30:00.000
95,96,2018-12-18 23:45:00,0,2.1,0,0,28.0,157,-178,0.0,2018-12-18 19:45:00.000
