,BLOCK_ID,DATA_DATETIME,GHI,WIND_SPEED,DNI,DHI,TEMPERATURE,ZENITH,AZIMUTH,CLOUD_OPACITY,ENTRY_TIME
0,1,2020-11-26 00:00:00,0,1.2,0,0,23.1,159,-162,29.6,2020-11-25 20:00:00.000
1,2,2020-11-26 00:15:00,0,1.1,0,0,23.1,157,-154,31.4,2020-11-25 20:15:00.000
2,3,2020-11-26 00:30:00,0,1.0,0,0,23.1,156,-146,25.6,2020-11-25 20:30:00.000
3,4,2020-11-26 00:45:00,0,1.0,0,0,23.1,153,-140,36.6,2020-11-25 20:45:00.000
4,5,2020-11-26 01:00:00,0,0.9,0,0,23.1,151,-135,64.6,2020-11-25 21:00:00.000
5,6,2020-11-26 01:15:00,0,0.9,0,0,23.1,148,-131,67.3,2020-11-25 21:15:00.000
6,7,2020-11-26 01:30:00,0,0.8,0,0,23.0,145,-127,86.8,2020-11-25 21:30:00.000
7,8,2020-11-26 01:45:00,0,0.8,0,0,23.0,142,-124,77.0,2020-11-25 21:45:00.000
8,9,2020-11-26 02:00:00,0,0.7,0,0,23.0,139,-122,48.6,2020-11-25 22:00:00.000
9,10,2020-11-26 02:15:00,0,0.8,0,0,23.0,136,-120,37.5,2020-11-25 22:15:00.000
10,11,2020-11-26 02:30:00,0,0.8,0,0,23.0,132,-118,41.0,2020-11-25 22:30:00.000
11,12,2020-11-26 02:45:00,0,0.8,0,0,23.0,129,-117,49.1,2020-11-25 22:45:00.000
12,13,2020-11-26 03:00:00,0,0.9,0,0,23.0,126,-115,51.0,2020-11-25 23:00:00.000
13,14,2020-11-26 03:15:00,0,0.9,0,0,23.0,122,-114,39.0,2020-11-25 23:15:00.000
14,15,2020-11-26 03:30:00,0,0.9,0,0,23.0,119,-114,28.0,2020-11-25 23:30:00.000
15,16,2020-11-26 03:45:00,0,1.0,0,0,23.1,115,-113,40.2,2020-11-25 23:45:00.000
16,17,2020-11-26 04:00:00,0,1.0,0,0,23.1,112,-112,26.4,2020-11-26 00:00:00.000
17,18,2020-11-26 04:15:00,0,1.0,0,0,23.1,108,-112,37.3,2020-11-26 00:15:00.000
18,19,2020-11-26 04:30:00,0,1.0,0,0,23.2,105,-111,34.4,2020-11-26 00:30:00.000
19,20,2020-11-26 04:45:00,0,1.0,0,0,23.2,101,-111,24.8,2020-11-26 00:45:00.000
20,21,2020-11-26 05:00:00,0,1.0,0,0,23.2,98,-111,28.8,2020-11-26 01:00:00.000
21,22,2020-11-26 05:15:00,0,1.0,0,0,23.3,94,-111,72.9,2020-11-26 01:15:00.000
22,23,2020-11-26 05:30:00,0,1.0,0,0,23.4,91,-111,53.0,2020-11-26 01:30:00.000
23,24,2020-11-26 05:45:00,11,1.0,0,11,23.4,87,-111,50.3,2020-11-26 01:45:00.000
24,25,2020-11-26 06:00:00,45,0.9,0,45,23.6,84,-111,31.0,2020-11-26 02:00:00.000
25,26,2020-11-26 06:15:00,82,0.9,24,78,23.9,80,-111,27.5,2020-11-26 02:15:00.000
26,27,2020-11-26 06:30:00,89,0.8,0,89,24.3,77,-112,47.6,2020-11-26 02:30:00.000
27,28,2020-11-26 06:45:00,137,0.8,0,137,24.6,73,-112,40.3,2020-11-26 02:45:00.000
28,29,2020-11-26 07:00:00,173,0.7,0,173,25.0,70,-112,40.2,2020-11-26 03:00:00.000
29,30,2020-11-26 07:15:00,205,0.7,0,205,25.6,67,-113,41.1,2020-11-26 03:15:00.000
30,31,2020-11-26 07:30:00,203,0.7,0,203,26.2,63,-114,50.0,2020-11-26 03:30:00.000
31,32,2020-11-26 07:45:00,247,0.6,5,244,26.8,60,-115,47.3,2020-11-26 03:45:00.000
32,33,2020-11-26 08:00:00,379,0.7,130,306,27.3,56,-116,27.3,2020-11-26 04:00:00.000
33,34,2020-11-26 08:15:00,380,0.7,61,344,27.6,53,-117,33.6,2020-11-26 04:15:00.000
34,35,2020-11-26 08:30:00,323,0.8,0,323,27.8,50,-118,48.4,2020-11-26 04:30:00.000
35,36,2020-11-26 08:45:00,348,0.8,0,348,28.1,46,-120,48.5,2020-11-26 04:45:00.000
36,37,2020-11-26 09:00:00,586,0.8,358,323,28.3,43,-122,18.8,2020-11-26 05:00:00.000
37,38,2020-11-26 09:15:00,677,0.8,527,274,28.5,40,-124,11.2,2020-11-26 05:15:00.000
38,39,2020-11-26 09:30:00,643,0.9,326,384,28.7,37,-127,19.6,2020-11-26 05:30:00.000
39,40,2020-11-26 09:45:00,642,0.9,253,433,28.9,34,-131,23.1,2020-11-26 05:45:00.000
40,41,2020-11-26 10:00:00,630,0.9,170,485,29.1,31,-135,27.2,2020-11-26 06:00:00.000
41,42,2020-11-26 10:15:00,732,0.8,378,401,29.3,29,-139,17.9,2020-11-26 06:15:00.000
42,43,2020-11-26 10:30:00,846,0.8,659,256,29.6,26,-145,7.4,2020-11-26 06:30:00.000
43,44,2020-11-26 10:45:00,908,0.8,812,170,29.9,25,-152,2.3,2020-11-26 06:45:00.000
44,45,2020-11-26 11:00:00,836,0.8,556,325,30.1,23,-160,11.2,2020-11-26 07:00:00.000
45,46,2020-11-26 11:15:00,671,0.8,136,545,30.3,22,-168,29.3,2020-11-26 07:15:00.000
46,47,2020-11-26 11:30:00,592,0.8,0,592,30.4,21,-178,37.8,2020-11-26 07:30:00.000
47,48,2020-11-26 11:45:00,614,0.9,44,573,30.6,22,173,35.4,2020-11-26 07:45:00.000
48,49,2020-11-26 12:00:00,519,0.9,0,519,30.6,22,164,45.0,2020-11-26 08:00:00.000
49,50,2020-11-26 12:15:00,481,0.8,0,481,30.5,24,155,48.5,2020-11-26 08:15:00.000
50,51,2020-11-26 12:30:00,527,0.8,0,527,30.3,26,148,42.6,2020-11-26 08:30:00.000
51,52,2020-11-26 12:45:00,555,0.7,12,544,30.1,28,142,38.2,2020-11-26 08:45:00.000
52,53,2020-11-26 13:00:00,597,0.7,79,529,29.9,30,137,31.6,2020-11-26 09:00:00.000
53,54,2020-11-26 13:15:00,528,0.6,4,525,29.6,33,132,37.5,2020-11-26 09:15:00.000
54,55,2020-11-26 13:30:00,563,0.5,109,475,29.2,36,129,30.6,2020-11-26 09:30:00.000
55,56,2020-11-26 13:45:00,703,0.4,559,266,28.8,39,126,9.3,2020-11-26 09:45:00.000
56,57,2020-11-26 14:00:00,620,0.4,391,327,28.5,42,123,15.6,2020-11-26 10:00:00.000
57,58,2020-11-26 14:15:00,646,0.5,623,206,28.4,45,121,6.3,2020-11-26 10:15:00.000
58,59,2020-11-26 14:30:00,643,0.6,788,117,28.4,48,119,0.0,2020-11-26 10:30:00.000
59,60,2020-11-26 14:45:00,592,0.7,770,113,28.3,51,118,0.0,2020-11-26 10:45:00.000
60,61,2020-11-26 15:00:00,497,0.8,532,189,28.1,55,116,8.0,2020-11-26 11:00:00.000
61,62,2020-11-26 15:15:00,421,0.9,402,206,27.9,58,115,13.3,2020-11-26 11:15:00.000
62,63,2020-11-26 15:30:00,304,0.9,65,273,27.7,62,114,28.8,2020-11-26 11:30:00.000
63,64,2020-11-26 15:45:00,194,1.0,0,194,27.5,65,113,47.2,2020-11-26 11:45:00.000
64,65,2020-11-26 16:00:00,205,1.0,3,204,27.2,68,113,33.4,2020-11-26 12:00:00.000
65,66,2020-11-26 16:15:00,101,1.0,0,101,26.9,72,112,59.6,2020-11-26 12:15:00.000
66,67,2020-11-26 16:30:00,73,1.0,0,73,26.5,75,112,61.8,2020-11-26 12:30:00.000
67,68,2020-11-26 16:45:00,64,1.0,35,58,26.2,79,111,49.6,2020-11-26 12:45:00.000
68,69,2020-11-26 17:00:00,54,1.0,24,51,25.9,82,111,35.0,2020-11-26 13:00:00.000
69,70,2020-11-26 17:15:00,17,1.0,0,17,25.6,86,111,59.6,2020-11-26 13:15:00.000
70,71,2020-11-26 17:30:00,1,1.0,0,1,25.3,89,111,81.2,2020-11-26 13:30:00.000
71,72,2020-11-26 17:45:00,0,1.0,0,0,25.0,93,111,97.0,2020-11-26 13:45:00.000
72,73,2020-11-26 18:00:00,0,1.0,0,0,24.7,96,111,36.2,2020-11-26 14:00:00.000
73,74,2020-11-26 18:15:00,0,1.0,0,0,24.6,100,111,48.5,2020-11-26 14:15:00.000
74,75,2020-11-26 18:30:00,0,1.1,0,0,24.5,103,111,52.6,2020-11-26 14:30:00.000
75,76,2020-11-26 18:45:00,0,1.1,0,0,24.4,107,112,31.7,2020-11-26 14:45:00.000
76,77,2020-11-26 19:00:00,0,1.1,0,0,24.3,110,112,30.2,2020-11-26 15:00:00.000
77,78,2020-11-26 19:15:00,0,1.1,0,0,24.3,114,113,25.4,2020-11-26 15:15:00.000
78,79,2020-11-26 19:30:00,0,1.1,0,0,24.3,117,113,28.8,2020-11-26 15:30:00.000
79,80,2020-11-26 19:45:00,0,1.1,0,0,24.3,121,114,23.1,2020-11-26 15:45:00.000
80,81,2020-11-26 20:00:00,0,1.1,0,0,24.2,124,115,56.4,2020-11-26 16:00:00.000
81,82,2020-11-26 20:15:00,0,1.2,0,0,24.2,128,116,51.6,2020-11-26 16:15:00.000
82,83,2020-11-26 20:30:00,0,1.2,0,0,24.2,131,118,62.0,2020-11-26 16:30:00.000
83,84,2020-11-26 20:45:00,0,1.3,0,0,24.1,134,119,64.8,2020-11-26 16:45:00.000
84,85,2020-11-26 21:00:00,0,1.3,0,0,24.1,137,121,75.4,2020-11-26 17:00:00.000
85,86,2020-11-26 21:15:00,0,1.3,0,0,24.0,141,123,54.0,2020-11-26 17:15:00.000
86,87,2020-11-26 21:30:00,0,1.3,0,0,24.0,144,126,53.2,2020-11-26 17:30:00.000
87,88,2020-11-26 21:45:00,0,1.3,0,0,23.9,147,129,61.6,2020-11-26 17:45:00.000
88,89,2020-11-26 22:00:00,0,1.2,0,0,23.9,149,133,52.6,2020-11-26 18:00:00.000
89,90,2020-11-26 22:15:00,0,1.2,0,0,23.8,152,138,36.3,2020-11-26 18:15:00.000
90,91,2020-11-26 22:30:00,0,1.2,0,0,23.8,154,144,37.0,2020-11-26 18:30:00.000
91,92,2020-11-26 22:45:00,0,1.2,0,0,23.8,156,151,40.5,2020-11-26 18:45:00.000
92,93,2020-11-26 23:00:00,0,1.1,0,0,23.7,158,159,40.4,2020-11-26 19:00:00.000
93,94,2020-11-26 23:15:00,0,1.1,0,0,23.7,159,168,49.6,2020-11-26 19:15:00.000
94,95,2020-11-26 23:30:00,0,1.1,0,0,23.7,160,178,54.2,2020-11-26 19:30:00.000
95,96,2020-11-26 23:45:00,0,1.0,0,0,23.7,159,-172,61.4,2020-11-26 19:45:00.000
