,BLOCK_ID,DATA_DATETIME,GHI,WIND_SPEED,DNI,DHI,TEMPERATURE,ZENITH,AZIMUTH,CLOUD_OPACITY,ENTRY_TIME
0,1,2019-06-25 00:00:00,0,1.3,0,0,22.8,156,-7,0.0,2019-06-24 20:00:00.000
1,2,2019-06-25 00:15:00,0,1.3,0,0,22.8,155,-15,0.0,2019-06-24 20:15:00.000
2,3,2019-06-25 00:30:00,0,1.2,0,0,22.7,154,-22,0.0,2019-06-24 20:30:00.000
3,4,2019-06-25 00:45:00,0,1.2,0,0,22.7,152,-29,0.0,2019-06-24 20:45:00.000
4,5,2019-06-25 01:00:00,0,1.1,0,0,22.6,150,-35,0.0,2019-06-24 21:00:00.000
5,6,2019-06-25 01:15:00,0,1.1,0,0,22.6,148,-40,0.0,2019-06-24 21:15:00.000
6,7,2019-06-25 01:30:00,0,1.0,0,0,22.6,145,-44,0.0,2019-06-24 21:30:00.000
7,8,2019-06-25 01:45:00,0,0.9,0,0,22.6,143,-48,0.0,2019-06-24 21:45:00.000
8,9,2019-06-25 02:00:00,0,0.9,0,0,22.6,140,-51,0.0,2019-06-24 22:00:00.000
9,10,2019-06-25 02:15:00,0,0.8,0,0,22.6,137,-54,0.0,2019-06-24 22:15:00.000
10,11,2019-06-25 02:30:00,0,0.8,0,0,22.5,134,-56,0.0,2019-06-24 22:30:00.000
11,12,2019-06-25 02:45:00,0,0.7,0,0,22.5,131,-58,0.0,2019-06-24 22:45:00.000
12,13,2019-06-25 03:00:00,0,0.7,0,0,22.4,127,-59,0.0,2019-06-24 23:00:00.000
13,14,2019-06-25 03:15:00,0,0.7,0,0,22.4,124,-61,0.0,2019-06-24 23:15:00.000
14,15,2019-06-25 03:30:00,0,0.7,0,0,22.4,121,-62,0.0,2019-06-24 23:30:00.000
15,16,2019-06-25 03:45:00,0,0.7,0,0,22.4,118,-63,0.0,2019-06-24 23:45:00.000
16,17,2019-06-25 04:00:00,0,0.7,0,0,22.4,114,-64,0.0,2019-06-25 00:00:00.000
17,18,2019-06-25 04:15:00,0,0.7,0,0,22.4,111,-65,0.0,2019-06-25 00:15:00.000
18,19,2019-06-25 04:30:00,0,0.7,0,0,22.4,107,-65,0.0,2019-06-25 00:30:00.000
19,20,2019-06-25 04:45:00,0,0.8,0,0,22.4,104,-66,0.0,2019-06-25 00:45:00.000
20,21,2019-06-25 05:00:00,0,0.8,0,0,22.4,101,-66,0.0,2019-06-25 01:00:00.000
21,22,2019-06-25 05:15:00,0,0.9,0,0,22.4,97,-66,0.0,2019-06-25 01:15:00.000
22,23,2019-06-25 05:30:00,0,1.0,0,0,22.4,94,-66,0.0,2019-06-25 01:30:00.000
23,24,2019-06-25 05:45:00,2,1.0,4,2,22.4,90,-67,0.0,2019-06-25 01:45:00.000
24,25,2019-06-25 06:00:00,25,1.1,90,17,22.5,87,-67,0.0,2019-06-25 02:00:00.000
25,26,2019-06-25 06:15:00,22,1.1,0,22,22.9,83,-66,64.3,2019-06-25 02:15:00.000
26,27,2019-06-25 06:30:00,62,1.2,0,62,23.2,80,-66,45.8,2019-06-25 02:30:00.000
27,28,2019-06-25 06:45:00,128,1.2,93,105,23.6,77,-66,21.8,2019-06-25 02:45:00.000
28,29,2019-06-25 07:00:00,212,1.3,480,71,24.0,73,-66,2.6,2019-06-25 03:00:00.000
29,30,2019-06-25 07:15:00,272,1.5,583,70,24.6,70,-65,0.0,2019-06-25 03:15:00.000
30,31,2019-06-25 07:30:00,327,1.7,626,76,25.2,66,-65,0.0,2019-06-25 03:30:00.000
31,32,2019-06-25 07:45:00,381,1.9,661,81,25.8,63,-64,0.0,2019-06-25 03:45:00.000
32,33,2019-06-25 08:00:00,434,2.1,690,86,26.3,60,-63,0.0,2019-06-25 04:00:00.000
33,34,2019-06-25 08:15:00,480,2.2,686,100,26.6,56,-62,1.1,2019-06-25 04:15:00.000
34,35,2019-06-25 08:30:00,535,2.3,736,93,26.9,53,-61,0.0,2019-06-25 04:30:00.000
35,36,2019-06-25 08:45:00,519,2.4,468,217,27.2,50,-59,10.9,2019-06-25 04:45:00.000
36,37,2019-06-25 09:00:00,498,2.5,266,317,27.5,47,-58,20.5,2019-06-25 05:00:00.000
37,38,2019-06-25 09:15:00,510,2.7,207,360,27.8,44,-55,23.7,2019-06-25 05:15:00.000
38,39,2019-06-25 09:30:00,542,2.8,218,376,28.1,40,-53,23.4,2019-06-25 05:30:00.000
39,40,2019-06-25 09:45:00,634,2.9,413,306,28.3,38,-50,14.6,2019-06-25 05:45:00.000
40,41,2019-06-25 10:00:00,677,3.0,467,294,28.6,35,-47,12.6,2019-06-25 06:00:00.000
41,42,2019-06-25 10:15:00,704,3.1,478,299,28.8,32,-43,12.3,2019-06-25 06:15:00.000
42,43,2019-06-25 10:30:00,757,3.2,581,251,29.0,30,-38,8.5,2019-06-25 06:30:00.000
43,44,2019-06-25 10:45:00,740,3.3,477,316,29.2,27,-33,12.5,2019-06-25 06:45:00.000
44,45,2019-06-25 11:00:00,706,3.4,348,392,29.4,26,-26,18.0,2019-06-25 07:00:00.000
45,46,2019-06-25 11:15:00,740,3.5,413,363,29.4,24,-19,15.1,2019-06-25 07:15:00.000
46,47,2019-06-25 11:30:00,816,3.6,622,245,29.4,23,-10,7.1,2019-06-25 07:30:00.000
47,48,2019-06-25 11:45:00,845,3.6,702,198,29.5,23,-2,4.2,2019-06-25 07:45:00.000
48,49,2019-06-25 12:00:00,880,3.6,823,123,29.5,23,7,0.0,2019-06-25 08:00:00.000
49,50,2019-06-25 12:15:00,874,3.6,821,123,29.5,24,16,0.0,2019-06-25 08:15:00.000
50,51,2019-06-25 12:30:00,864,3.5,819,122,29.5,25,23,0.0,2019-06-25 08:30:00.000
51,52,2019-06-25 12:45:00,824,3.5,728,174,29.4,27,30,3.0,2019-06-25 08:45:00.000
52,53,2019-06-25 13:00:00,826,3.4,793,131,29.4,29,36,0.6,2019-06-25 09:00:00.000
53,54,2019-06-25 13:15:00,798,3.2,767,141,29.3,31,41,1.3,2019-06-25 09:15:00.000
54,55,2019-06-25 13:30:00,770,3.1,754,143,29.3,34,45,1.5,2019-06-25 09:30:00.000
55,56,2019-06-25 13:45:00,750,3.0,786,118,29.2,36,49,0.0,2019-06-25 09:45:00.000
56,57,2019-06-25 14:00:00,715,2.9,774,117,29.1,39,52,0.0,2019-06-25 10:00:00.000
57,58,2019-06-25 14:15:00,678,2.8,761,115,29.0,42,55,0.0,2019-06-25 10:15:00.000
58,59,2019-06-25 14:30:00,637,2.8,747,113,28.9,45,57,0.0,2019-06-25 10:30:00.000
59,60,2019-06-25 14:45:00,586,2.8,698,124,28.8,49,59,1.3,2019-06-25 10:45:00.000
60,61,2019-06-25 15:00:00,542,2.7,692,116,28.7,52,60,0.8,2019-06-25 11:00:00.000
61,62,2019-06-25 15:15:00,455,2.7,481,182,28.5,55,61,8.5,2019-06-25 11:15:00.000
62,63,2019-06-25 15:30:00,425,2.7,539,142,28.2,58,63,5.2,2019-06-25 11:30:00.000
63,64,2019-06-25 15:45:00,358,2.6,413,162,28.0,62,64,9.6,2019-06-25 11:45:00.000
64,65,2019-06-25 16:00:00,268,2.6,159,200,27.7,65,64,21.9,2019-06-25 12:00:00.000
65,66,2019-06-25 16:15:00,195,2.5,31,183,27.3,69,65,32.4,2019-06-25 12:15:00.000
66,67,2019-06-25 16:30:00,138,2.3,0,138,27.0,72,65,40.5,2019-06-25 12:30:00.000
67,68,2019-06-25 16:45:00,135,2.2,44,124,26.7,75,66,24.5,2019-06-25 12:45:00.000
68,69,2019-06-25 17:00:00,87,2.1,13,84,26.3,79,66,31.4,2019-06-25 13:00:00.000
69,70,2019-06-25 17:15:00,34,2.1,0,34,25.9,82,66,57.3,2019-06-25 13:15:00.000
70,71,2019-06-25 17:30:00,24,2.0,0,24,25.5,86,67,30.4,2019-06-25 13:30:00.000
71,72,2019-06-25 17:45:00,7,1.9,11,6,25.0,89,67,0.0,2019-06-25 13:45:00.000
72,73,2019-06-25 18:00:00,0,1.9,0,0,24.7,93,67,0.0,2019-06-25 14:00:00.000
73,74,2019-06-25 18:15:00,0,1.9,0,0,24.5,96,66,0.0,2019-06-25 14:15:00.000
74,75,2019-06-25 18:30:00,0,1.9,0,0,24.4,99,66,0.0,2019-06-25 14:30:00.000
75,76,2019-06-25 18:45:00,0,2.0,0,0,24.2,103,66,0.0,2019-06-25 14:45:00.000
76,77,2019-06-25 19:00:00,0,2.0,0,0,24.1,106,65,0.0,2019-06-25 15:00:00.000
77,78,2019-06-25 19:15:00,0,2.0,0,0,24.1,110,65,0.0,2019-06-25 15:15:00.000
78,79,2019-06-25 19:30:00,0,2.1,0,0,24.0,113,64,0.0,2019-06-25 15:30:00.000
79,80,2019-06-25 19:45:00,0,2.1,0,0,23.9,116,63,0.0,2019-06-25 15:45:00.000
80,81,2019-06-25 20:00:00,0,2.1,0,0,23.9,120,62,0.0,2019-06-25 16:00:00.000
81,82,2019-06-25 20:15:00,0,2.1,0,0,23.8,123,61,0.0,2019-06-25 16:15:00.000
82,83,2019-06-25 20:30:00,0,2.1,0,0,23.8,126,60,0.0,2019-06-25 16:30:00.000
83,84,2019-06-25 20:45:00,0,2.1,0,0,23.8,130,58,0.0,2019-06-25 16:45:00.000
84,85,2019-06-25 21:00:00,0,2.1,0,0,23.7,133,57,0.0,2019-06-25 17:00:00.000
85,86,2019-06-25 21:15:00,0,2.1,0,0,23.7,136,54,0.0,2019-06-25 17:15:00.000
86,87,2019-06-25 21:30:00,0,2.0,0,0,23.7,139,52,0.0,2019-06-25 17:30:00.000
87,88,2019-06-25 21:45:00,0,2.0,0,0,23.6,142,49,0.0,2019-06-25 17:45:00.000
88,89,2019-06-25 22:00:00,0,2.0,0,0,23.6,144,46,0.0,2019-06-25 18:00:00.000
89,90,2019-06-25 22:15:00,0,2.0,0,0,23.6,147,42,0.0,2019-06-25 18:15:00.000
90,91,2019-06-25 22:30:00,0,2.0,0,0,23.5,149,37,0.0,2019-06-25 18:30:00.000
91,92,2019-06-25 22:45:00,0,2.0,0,0,23.5,151,31,0.0,2019-06-25 18:45:00.000
92,93,2019-06-25 23:00:00,0,1.9,0,0,23.5,153,25,0.0,2019-06-25 19:00:00.000
93,94,2019-06-25 23:15:00,0,1.9,0,0,23.4,155,18,0.0,2019-06-25 19:15:00.000
94,95,2019-06-25 23:30:00,0,1.8,0,0,23.4,156,10,0.0,2019-06-25 19:30:00.000
95,96,2019-06-25 23:45:00,0,1.8,0,0,23.3,156,2,0.0,2019-06-25 19:45:00.000
