,BLOCK_ID,DATA_DATETIME,GHI,WIND_SPEED,DNI,DHI,TEMPERATURE,ZENITH,AZIMUTH,CLOUD_OPACITY,ENTRY_TIME
0,1,2019-07-23 00:00:00,0,1.2,0,0,22.0,159,-5,0.0,2019-07-22 20:00:00.000
1,2,2019-07-23 00:15:00,0,1.2,0,0,22.0,158,-15,0.0,2019-07-22 20:15:00.000
2,3,2019-07-23 00:30:00,0,1.2,0,0,22.0,157,-23,0.0,2019-07-22 20:30:00.000
3,4,2019-07-23 00:45:00,0,1.3,0,0,22.0,155,-31,0.0,2019-07-22 20:45:00.000
4,5,2019-07-23 01:00:00,0,1.3,0,0,22.0,153,-37,0.0,2019-07-22 21:00:00.000
5,6,2019-07-23 01:15:00,0,1.2,0,0,22.0,151,-43,0.0,2019-07-22 21:15:00.000
6,7,2019-07-23 01:30:00,0,1.2,0,0,22.0,148,-47,0.0,2019-07-22 21:30:00.000
7,8,2019-07-23 01:45:00,0,1.1,0,0,22.0,145,-51,0.0,2019-07-22 21:45:00.000
8,9,2019-07-23 02:00:00,0,1.1,0,0,22.0,142,-54,0.0,2019-07-22 22:00:00.000
9,10,2019-07-23 02:15:00,0,1.2,0,0,22.0,139,-57,37.3,2019-07-22 22:15:00.000
10,11,2019-07-23 02:30:00,0,1.2,0,0,22.0,136,-59,40.4,2019-07-22 22:30:00.000
11,12,2019-07-23 02:45:00,0,1.3,0,0,22.0,133,-61,40.4,2019-07-22 22:45:00.000
12,13,2019-07-23 03:00:00,0,1.4,0,0,22.0,129,-62,40.4,2019-07-22 23:00:00.000
13,14,2019-07-23 03:15:00,0,1.4,0,0,22.1,126,-64,40.4,2019-07-22 23:15:00.000
14,15,2019-07-23 03:30:00,0,1.4,0,0,22.1,123,-65,41.0,2019-07-22 23:30:00.000
15,16,2019-07-23 03:45:00,0,1.4,0,0,22.1,119,-66,41.2,2019-07-22 23:45:00.000
16,17,2019-07-23 04:00:00,0,1.5,0,0,22.2,116,-67,49.2,2019-07-23 00:00:00.000
17,18,2019-07-23 04:15:00,0,1.5,0,0,22.2,112,-67,52.0,2019-07-23 00:15:00.000
18,19,2019-07-23 04:30:00,0,1.6,0,0,22.2,109,-68,52.0,2019-07-23 00:30:00.000
19,20,2019-07-23 04:45:00,0,1.7,0,0,22.2,105,-69,53.1,2019-07-23 00:45:00.000
20,21,2019-07-23 05:00:00,0,1.8,0,0,22.2,102,-69,59.4,2019-07-23 01:00:00.000
21,22,2019-07-23 05:15:00,0,1.8,0,0,22.2,98,-69,66.4,2019-07-23 01:15:00.000
22,23,2019-07-23 05:30:00,0,1.8,0,0,22.2,95,-69,56.6,2019-07-23 01:30:00.000
23,24,2019-07-23 05:45:00,0,1.9,0,0,22.2,91,-70,37.3,2019-07-23 01:45:00.000
24,25,2019-07-23 06:00:00,10,1.9,0,10,22.3,88,-70,37.3,2019-07-23 02:00:00.000
25,26,2019-07-23 06:15:00,33,1.9,0,33,22.5,84,-69,38.4,2019-07-23 02:15:00.000
26,27,2019-07-23 06:30:00,63,1.9,0,63,22.8,81,-69,36.6,2019-07-23 02:30:00.000
27,28,2019-07-23 06:45:00,87,2.0,0,87,23.1,77,-69,42.8,2019-07-23 02:45:00.000
28,29,2019-07-23 07:00:00,120,2.0,0,120,23.4,74,-69,41.8,2019-07-23 03:00:00.000
29,30,2019-07-23 07:15:00,183,2.0,23,175,24.0,70,-68,30.4,2019-07-23 03:15:00.000
30,31,2019-07-23 07:30:00,253,2.0,175,183,24.5,67,-68,20.8,2019-07-23 03:30:00.000
31,32,2019-07-23 07:45:00,295,2.0,190,209,25.1,63,-67,21.3,2019-07-23 03:45:00.000
32,33,2019-07-23 08:00:00,415,2.1,594,117,25.5,60,-67,3.4,2019-07-23 04:00:00.000
33,34,2019-07-23 08:15:00,452,2.2,540,153,25.7,57,-66,6.3,2019-07-23 04:15:00.000
34,35,2019-07-23 08:30:00,534,2.4,722,101,25.9,53,-65,0.0,2019-07-23 04:30:00.000
35,36,2019-07-23 08:45:00,524,2.5,476,217,26.1,50,-63,10.1,2019-07-23 04:45:00.000
36,37,2019-07-23 09:00:00,564,2.6,478,234,26.3,46,-62,10.5,2019-07-23 05:00:00.000
37,38,2019-07-23 09:15:00,572,2.7,377,296,26.6,43,-60,15.2,2019-07-23 05:15:00.000
38,39,2019-07-23 09:30:00,575,2.8,292,352,26.9,40,-58,19.5,2019-07-23 05:30:00.000
39,40,2019-07-23 09:45:00,528,2.9,112,440,27.2,37,-55,29.6,2019-07-23 05:45:00.000
40,41,2019-07-23 10:00:00,527,2.9,56,481,27.4,34,-52,32.9,2019-07-23 06:00:00.000
41,42,2019-07-23 10:15:00,741,2.9,554,266,27.6,31,-49,9.1,2019-07-23 06:15:00.000
42,43,2019-07-23 10:30:00,734,2.9,465,324,27.8,28,-44,12.7,2019-07-23 06:30:00.000
43,44,2019-07-23 10:45:00,779,2.9,544,288,28.0,26,-38,9.8,2019-07-23 06:45:00.000
44,45,2019-07-23 11:00:00,817,2.9,616,252,28.2,24,-32,7.3,2019-07-23 07:00:00.000
45,46,2019-07-23 11:15:00,838,3.0,656,229,28.4,22,-24,6.4,2019-07-23 07:15:00.000
46,47,2019-07-23 11:30:00,779,3.0,453,355,28.6,21,-15,13.8,2019-07-23 07:30:00.000
47,48,2019-07-23 11:45:00,772,3.1,431,366,28.8,20,-5,15.0,2019-07-23 07:45:00.000
48,49,2019-07-23 12:00:00,871,3.1,713,200,29.0,20,5,4.1,2019-07-23 08:00:00.000
49,50,2019-07-23 12:15:00,861,3.2,700,206,29.0,21,15,4.7,2019-07-23 08:15:00.000
50,51,2019-07-23 12:30:00,788,3.2,498,325,29.0,22,24,11.9,2019-07-23 08:30:00.000
51,52,2019-07-23 12:45:00,805,3.3,584,270,29.0,24,32,8.6,2019-07-23 08:45:00.000
52,53,2019-07-23 13:00:00,718,3.3,375,380,29.0,26,39,16.8,2019-07-23 09:00:00.000
53,54,2019-07-23 13:15:00,720,3.3,428,343,28.9,28,44,14.3,2019-07-23 09:15:00.000
54,55,2019-07-23 13:30:00,675,3.3,357,369,28.8,31,49,17.1,2019-07-23 09:30:00.000
55,56,2019-07-23 13:45:00,652,3.2,355,357,28.7,34,53,16.7,2019-07-23 09:45:00.000
56,57,2019-07-23 14:00:00,614,3.2,318,360,28.7,37,56,17.8,2019-07-23 10:00:00.000
57,58,2019-07-23 14:15:00,662,3.1,575,222,28.6,40,58,6.5,2019-07-23 10:15:00.000
58,59,2019-07-23 14:30:00,634,3.1,605,195,28.5,43,60,4.7,2019-07-23 10:30:00.000
59,60,2019-07-23 14:45:00,466,3.0,193,332,28.5,47,62,25.1,2019-07-23 10:45:00.000
60,61,2019-07-23 15:00:00,318,3.0,0,318,28.4,50,64,44.5,2019-07-23 11:00:00.000
61,62,2019-07-23 15:15:00,412,3.0,190,297,28.1,53,65,21.4,2019-07-23 11:15:00.000
62,63,2019-07-23 15:30:00,376,3.1,198,268,27.8,57,66,20.1,2019-07-23 11:30:00.000
63,64,2019-07-23 15:45:00,284,3.1,51,258,27.5,60,67,32.2,2019-07-23 11:45:00.000
64,65,2019-07-23 16:00:00,182,3.1,0,182,27.2,64,67,49.8,2019-07-23 12:00:00.000
65,66,2019-07-23 16:15:00,170,3.1,0,170,26.9,67,68,44.1,2019-07-23 12:15:00.000
66,67,2019-07-23 16:30:00,127,3.0,0,127,26.5,71,69,49.4,2019-07-23 12:30:00.000
67,68,2019-07-23 16:45:00,103,2.9,0,103,26.1,74,69,46.9,2019-07-23 12:45:00.000
68,69,2019-07-23 17:00:00,75,2.9,0,75,25.8,78,69,45.0,2019-07-23 13:00:00.000
69,70,2019-07-23 17:15:00,46,2.9,0,46,25.4,81,69,47.3,2019-07-23 13:15:00.000
70,71,2019-07-23 17:30:00,28,2.9,0,28,25.1,85,70,36.2,2019-07-23 13:30:00.000
71,72,2019-07-23 17:45:00,12,2.9,18,11,24.7,88,70,0.0,2019-07-23 13:45:00.000
72,73,2019-07-23 18:00:00,0,2.9,0,0,24.5,92,70,0.0,2019-07-23 14:00:00.000
73,74,2019-07-23 18:15:00,0,2.9,0,0,24.3,95,69,0.0,2019-07-23 14:15:00.000
74,75,2019-07-23 18:30:00,0,2.9,0,0,24.2,99,69,0.0,2019-07-23 14:30:00.000
75,76,2019-07-23 18:45:00,0,2.9,0,0,24.0,102,69,18.6,2019-07-23 14:45:00.000
76,77,2019-07-23 19:00:00,0,2.8,0,0,23.9,106,69,62.0,2019-07-23 15:00:00.000
77,78,2019-07-23 19:15:00,0,2.7,0,0,23.9,109,68,62.0,2019-07-23 15:15:00.000
78,79,2019-07-23 19:30:00,0,2.6,0,0,23.8,113,68,54.0,2019-07-23 15:30:00.000
79,80,2019-07-23 19:45:00,0,2.5,0,0,23.7,116,67,52.0,2019-07-23 15:45:00.000
80,81,2019-07-23 20:00:00,0,2.4,0,0,23.7,120,66,52.4,2019-07-23 16:00:00.000
81,82,2019-07-23 20:15:00,0,2.6,0,0,23.6,123,65,52.4,2019-07-23 16:15:00.000
82,83,2019-07-23 20:30:00,0,2.7,0,0,23.6,126,64,52.0,2019-07-23 16:30:00.000
83,84,2019-07-23 20:45:00,0,2.8,0,0,23.6,130,63,52.0,2019-07-23 16:45:00.000
84,85,2019-07-23 21:00:00,0,2.9,0,0,23.5,133,61,51.8,2019-07-23 17:00:00.000
85,86,2019-07-23 21:15:00,0,2.9,0,0,23.5,136,59,51.8,2019-07-23 17:15:00.000
86,87,2019-07-23 21:30:00,0,2.9,0,0,23.4,139,57,51.8,2019-07-23 17:30:00.000
87,88,2019-07-23 21:45:00,0,2.9,0,0,23.4,143,54,45.4,2019-07-23 17:45:00.000
88,89,2019-07-23 22:00:00,0,2.9,0,0,23.3,145,51,43.8,2019-07-23 18:00:00.000
89,90,2019-07-23 22:15:00,0,2.9,0,0,23.3,148,47,52.0,2019-07-23 18:15:00.000
90,91,2019-07-23 22:30:00,0,3.0,0,0,23.3,151,43,52.0,2019-07-23 18:30:00.000
91,92,2019-07-23 22:45:00,0,3.0,0,0,23.3,153,37,52.0,2019-07-23 18:45:00.000
92,93,2019-07-23 23:00:00,0,3.0,0,0,23.3,155,31,75.1,2019-07-23 19:00:00.000
93,94,2019-07-23 23:15:00,0,3.0,0,0,23.3,157,23,80.8,2019-07-23 19:15:00.000
94,95,2019-07-23 23:30:00,0,3.1,0,0,23.3,158,14,80.8,2019-07-23 19:30:00.000
95,96,2019-07-23 23:45:00,0,3.1,0,0,23.3,159,5,80.9,2019-07-23 19:45:00.000
