,BLOCK_ID,DATA_DATETIME,GHI,WIND_SPEED,DNI,DHI,TEMPERATURE,ZENITH,AZIMUTH,CLOUD_OPACITY,ENTRY_TIME
0,1,2019-11-28 00:00:00,0,0.8,0,0,23.7,159,-163,0.0,2019-11-27 20:00:00.000
1,2,2019-11-28 00:15:00,0,0.7,0,0,23.7,157,-154,0.0,2019-11-27 20:15:00.000
2,3,2019-11-28 00:30:00,0,0.7,0,0,23.6,155,-147,0.0,2019-11-27 20:30:00.000
3,4,2019-11-28 00:45:00,0,0.7,0,0,23.5,153,-141,0.0,2019-11-27 20:45:00.000
4,5,2019-11-28 01:00:00,0,0.7,0,0,23.5,151,-135,0.0,2019-11-27 21:00:00.000
5,6,2019-11-28 01:15:00,0,0.6,0,0,23.4,148,-131,0.0,2019-11-27 21:15:00.000
6,7,2019-11-28 01:30:00,0,0.5,0,0,23.4,145,-128,0.0,2019-11-27 21:30:00.000
7,8,2019-11-28 01:45:00,0,0.5,0,0,23.3,142,-125,0.0,2019-11-27 21:45:00.000
8,9,2019-11-28 02:00:00,0,0.4,0,0,23.3,139,-122,0.0,2019-11-27 22:00:00.000
9,10,2019-11-28 02:15:00,0,0.4,0,0,23.2,136,-120,0.0,2019-11-27 22:15:00.000
10,11,2019-11-28 02:30:00,0,0.4,0,0,23.2,132,-118,0.0,2019-11-27 22:30:00.000
11,12,2019-11-28 02:45:00,0,0.4,0,0,23.2,129,-117,0.0,2019-11-27 22:45:00.000
12,13,2019-11-28 03:00:00,0,0.4,0,0,23.1,126,-116,0.0,2019-11-27 23:00:00.000
13,14,2019-11-28 03:15:00,0,0.5,0,0,23.1,122,-115,0.0,2019-11-27 23:15:00.000
14,15,2019-11-28 03:30:00,0,0.5,0,0,23.1,119,-114,0.0,2019-11-27 23:30:00.000
15,16,2019-11-28 03:45:00,0,0.5,0,0,23.1,115,-113,0.0,2019-11-27 23:45:00.000
16,17,2019-11-28 04:00:00,0,0.5,0,0,23.0,112,-112,0.0,2019-11-28 00:00:00.000
17,18,2019-11-28 04:15:00,0,0.5,0,0,23.0,109,-112,0.0,2019-11-28 00:15:00.000
18,19,2019-11-28 04:30:00,0,0.5,0,0,23.0,105,-112,0.0,2019-11-28 00:30:00.000
19,20,2019-11-28 04:45:00,0,0.5,0,0,23.0,102,-111,0.0,2019-11-28 00:45:00.000
20,21,2019-11-28 05:00:00,0,0.5,0,0,23.1,98,-111,0.0,2019-11-28 01:00:00.000
21,22,2019-11-28 05:15:00,0,0.5,0,0,23.1,95,-111,0.0,2019-11-28 01:15:00.000
22,23,2019-11-28 05:30:00,0,0.5,0,0,23.2,91,-111,0.0,2019-11-28 01:30:00.000
23,24,2019-11-28 05:45:00,20,0.5,53,15,23.2,88,-111,0.3,2019-11-28 01:45:00.000
24,25,2019-11-28 06:00:00,59,0.5,226,34,23.4,84,-111,0.2,2019-11-28 02:00:00.000
25,26,2019-11-28 06:15:00,108,0.4,353,50,23.8,81,-111,0.0,2019-11-28 02:15:00.000
26,27,2019-11-28 06:30:00,163,0.4,447,63,24.2,77,-112,0.0,2019-11-28 02:30:00.000
27,28,2019-11-28 06:45:00,222,0.3,522,74,24.6,74,-112,0.0,2019-11-28 02:45:00.000
28,29,2019-11-28 07:00:00,281,0.2,582,83,25.1,70,-113,0.0,2019-11-28 03:00:00.000
29,30,2019-11-28 07:15:00,341,0.2,630,91,25.7,67,-113,0.0,2019-11-28 03:15:00.000
30,31,2019-11-28 07:30:00,400,0.1,670,99,26.4,63,-114,0.0,2019-11-28 03:30:00.000
31,32,2019-11-28 07:45:00,458,0.0,703,105,27.0,60,-115,0.0,2019-11-28 03:45:00.000
32,33,2019-11-28 08:00:00,514,0.1,730,111,27.6,56,-116,0.0,2019-11-28 04:00:00.000
33,34,2019-11-28 08:15:00,568,0.2,752,117,27.9,53,-117,0.0,2019-11-28 04:15:00.000
34,35,2019-11-28 08:30:00,620,0.3,772,122,28.1,50,-119,0.0,2019-11-28 04:30:00.000
35,36,2019-11-28 08:45:00,669,0.4,789,126,28.4,47,-120,0.0,2019-11-28 04:45:00.000
36,37,2019-11-28 09:00:00,714,0.6,803,130,28.7,43,-122,0.0,2019-11-28 05:00:00.000
37,38,2019-11-28 09:15:00,757,0.7,815,134,29.0,40,-125,0.0,2019-11-28 05:15:00.000
38,39,2019-11-28 09:30:00,795,0.9,826,138,29.3,37,-127,0.0,2019-11-28 05:30:00.000
39,40,2019-11-28 09:45:00,830,1.1,835,140,29.7,34,-131,0.0,2019-11-28 05:45:00.000
40,41,2019-11-28 10:00:00,851,1.2,808,163,30.0,32,-135,1.1,2019-11-28 06:00:00.000
41,42,2019-11-28 10:15:00,722,1.4,333,431,30.2,29,-140,18.7,2019-11-28 06:15:00.000
42,43,2019-11-28 10:30:00,738,1.5,330,443,30.5,27,-145,18.8,2019-11-28 06:30:00.000
43,44,2019-11-28 10:45:00,601,1.6,81,528,30.7,25,-152,35.0,2019-11-28 06:45:00.000
44,45,2019-11-28 11:00:00,374,1.7,0,374,30.9,23,-160,60.1,2019-11-28 07:00:00.000
45,46,2019-11-28 11:15:00,546,1.7,18,529,30.9,22,-168,42.2,2019-11-28 07:15:00.000
46,47,2019-11-28 11:30:00,684,1.7,128,565,30.9,22,-178,27.6,2019-11-28 07:30:00.000
47,48,2019-11-28 11:45:00,747,1.6,265,501,30.9,22,173,20.9,2019-11-28 07:45:00.000
48,49,2019-11-28 12:00:00,781,1.6,360,449,30.8,23,164,16.8,2019-11-28 08:00:00.000
49,50,2019-11-28 12:15:00,551,1.5,0,551,30.5,24,156,40.6,2019-11-28 08:15:00.000
50,51,2019-11-28 12:30:00,489,1.4,0,489,30.1,26,148,46.4,2019-11-28 08:30:00.000
51,52,2019-11-28 12:45:00,395,1.3,0,395,29.8,28,142,55.7,2019-11-28 08:45:00.000
52,53,2019-11-28 13:00:00,545,1.2,14,532,29.5,30,137,37.3,2019-11-28 09:00:00.000
53,54,2019-11-28 13:15:00,700,1.0,351,406,29.5,33,133,16.7,2019-11-28 09:15:00.000
54,55,2019-11-28 13:30:00,791,0.9,739,192,29.6,36,129,2.0,2019-11-28 09:30:00.000
55,56,2019-11-28 13:45:00,771,0.8,790,155,29.6,39,126,0.0,2019-11-28 09:45:00.000
56,57,2019-11-28 14:00:00,731,0.8,781,149,29.6,42,123,0.0,2019-11-28 10:00:00.000
57,58,2019-11-28 14:15:00,688,0.7,771,142,29.6,45,121,0.0,2019-11-28 10:15:00.000
58,59,2019-11-28 14:30:00,641,0.6,757,136,29.5,48,119,0.0,2019-11-28 10:30:00.000
59,60,2019-11-28 14:45:00,591,0.6,739,131,29.5,51,118,0.0,2019-11-28 10:45:00.000
60,61,2019-11-28 15:00:00,492,0.6,487,210,29.4,55,117,8.7,2019-11-28 11:00:00.000
61,62,2019-11-28 15:15:00,349,0.6,84,304,29.2,58,115,27.7,2019-11-28 11:15:00.000
62,63,2019-11-28 15:30:00,281,0.6,0,281,29.0,62,114,33.8,2019-11-28 11:30:00.000
63,64,2019-11-28 15:45:00,228,0.6,0,228,28.8,65,114,37.8,2019-11-28 11:45:00.000
64,65,2019-11-28 16:00:00,188,0.6,0,188,28.5,68,113,39.0,2019-11-28 12:00:00.000
65,66,2019-11-28 16:15:00,140,0.5,0,140,28.2,72,112,43.6,2019-11-28 12:15:00.000
66,67,2019-11-28 16:30:00,115,0.5,0,115,27.9,75,112,38.6,2019-11-28 12:30:00.000
67,68,2019-11-28 16:45:00,85,0.4,0,85,27.6,79,112,36.2,2019-11-28 12:45:00.000
68,69,2019-11-28 17:00:00,44,0.4,0,44,27.2,82,111,45.8,2019-11-28 13:00:00.000
69,70,2019-11-28 17:15:00,28,0.5,14,26,26.7,86,111,21.0,2019-11-28 13:15:00.000
70,71,2019-11-28 17:30:00,5,0.6,10,4,26.3,89,111,0.0,2019-11-28 13:30:00.000
71,72,2019-11-28 17:45:00,0,0.7,0,0,25.8,93,111,0.0,2019-11-28 13:45:00.000
72,73,2019-11-28 18:00:00,0,0.7,0,0,25.4,96,111,0.0,2019-11-28 14:00:00.000
73,74,2019-11-28 18:15:00,0,0.7,0,0,25.2,100,111,0.0,2019-11-28 14:15:00.000
74,75,2019-11-28 18:30:00,0,0.8,0,0,25.1,103,112,0.0,2019-11-28 14:30:00.000
75,76,2019-11-28 18:45:00,0,0.8,0,0,24.9,107,112,0.0,2019-11-28 14:45:00.000
76,77,2019-11-28 19:00:00,0,0.8,0,0,24.8,110,112,0.0,2019-11-28 15:00:00.000
77,78,2019-11-28 19:15:00,0,0.8,0,0,24.7,114,113,0.0,2019-11-28 15:15:00.000
78,79,2019-11-28 19:30:00,0,0.9,0,0,24.7,117,114,0.0,2019-11-28 15:30:00.000
79,80,2019-11-28 19:45:00,0,1.0,0,0,24.6,121,114,0.0,2019-11-28 15:45:00.000
80,81,2019-11-28 20:00:00,0,1.0,0,0,24.6,124,115,0.0,2019-11-28 16:00:00.000
81,82,2019-11-28 20:15:00,0,1.0,0,0,24.5,127,116,0.0,2019-11-28 16:15:00.000
82,83,2019-11-28 20:30:00,0,0.8,0,0,24.4,131,118,0.0,2019-11-28 16:30:00.000
83,84,2019-11-28 20:45:00,0,0.7,0,0,24.3,134,119,0.0,2019-11-28 16:45:00.000
84,85,2019-11-28 21:00:00,0,0.6,0,0,24.2,137,121,0.0,2019-11-28 17:00:00.000
85,86,2019-11-28 21:15:00,0,0.6,0,0,24.2,140,124,0.0,2019-11-28 17:15:00.000
86,87,2019-11-28 21:30:00,0,0.6,0,0,24.1,143,126,0.0,2019-11-28 17:30:00.000
87,88,2019-11-28 21:45:00,0,0.6,0,0,24.0,146,129,0.0,2019-11-28 17:45:00.000
88,89,2019-11-28 22:00:00,0,0.6,0,0,24.0,149,133,0.0,2019-11-28 18:00:00.000
89,90,2019-11-28 22:15:00,0,0.6,0,0,24.0,152,138,0.0,2019-11-28 18:15:00.000
90,91,2019-11-28 22:30:00,0,0.6,0,0,23.9,154,144,0.0,2019-11-28 18:30:00.000
91,92,2019-11-28 22:45:00,0,0.6,0,0,23.9,156,151,0.0,2019-11-28 18:45:00.000
92,93,2019-11-28 23:00:00,0,0.7,0,0,23.8,158,159,0.0,2019-11-28 19:00:00.000
93,94,2019-11-28 23:15:00,0,0.7,0,0,23.8,159,168,0.0,2019-11-28 19:15:00.000
94,95,2019-11-28 23:30:00,0,0.7,0,0,23.7,159,177,0.0,2019-11-28 19:30:00.000
95,96,2019-11-28 23:45:00,0,0.7,0,0,23.7,159,-173,0.0,2019-11-28 19:45:00.000
