,BLOCK_ID,DATA_DATETIME,GHI,WIND_SPEED,DNI,DHI,TEMPERATURE,ZENITH,AZIMUTH,CLOUD_OPACITY,ENTRY_TIME
0,1,2020-12-14 00:00:00,0,1.2,0,0,23.2,157,-168,47.0,2020-12-13 20:00:00.000
1,2,2020-12-14 00:15:00,0,1.2,0,0,23.1,156,-160,42.8,2020-12-13 20:15:00.000
2,3,2020-12-14 00:30:00,0,1.2,0,0,23.1,154,-153,30.6,2020-12-13 20:30:00.000
3,4,2020-12-14 00:45:00,0,1.2,0,0,23.1,153,-146,26.1,2020-12-13 20:45:00.000
4,5,2020-12-14 01:00:00,0,1.2,0,0,23.0,150,-141,26.4,2020-12-13 21:00:00.000
5,6,2020-12-14 01:15:00,0,1.2,0,0,23.0,148,-136,25.0,2020-12-13 21:15:00.000
6,7,2020-12-14 01:30:00,0,1.1,0,0,23.0,145,-132,29.0,2020-12-13 21:30:00.000
7,8,2020-12-14 01:45:00,0,1.0,0,0,23.0,142,-129,24.7,2020-12-13 21:45:00.000
8,9,2020-12-14 02:00:00,0,0.9,0,0,22.9,139,-126,23.2,2020-12-13 22:00:00.000
9,10,2020-12-14 02:15:00,0,0.9,0,0,22.9,136,-124,24.3,2020-12-13 22:15:00.000
10,11,2020-12-14 02:30:00,0,1.0,0,0,22.9,133,-122,25.0,2020-12-13 22:30:00.000
11,12,2020-12-14 02:45:00,0,1.0,0,0,22.9,130,-120,21.0,2020-12-13 22:45:00.000
12,13,2020-12-14 03:00:00,0,1.0,0,0,22.9,127,-119,21.0,2020-12-13 23:00:00.000
13,14,2020-12-14 03:15:00,0,0.9,0,0,22.8,123,-118,24.3,2020-12-13 23:15:00.000
14,15,2020-12-14 03:30:00,0,0.9,0,0,22.8,120,-117,25.0,2020-12-13 23:30:00.000
15,16,2020-12-14 03:45:00,0,0.9,0,0,22.8,117,-116,37.0,2020-12-13 23:45:00.000
16,17,2020-12-14 04:00:00,0,0.9,0,0,22.8,113,-115,31.0,2020-12-14 00:00:00.000
17,18,2020-12-14 04:15:00,0,1.0,0,0,22.8,110,-114,24.7,2020-12-14 00:15:00.000
18,19,2020-12-14 04:30:00,0,1.0,0,0,22.8,106,-114,24.8,2020-12-14 00:30:00.000
19,20,2020-12-14 04:45:00,0,1.0,0,0,22.7,103,-114,24.7,2020-12-14 00:45:00.000
20,21,2020-12-14 05:00:00,0,1.1,0,0,22.7,99,-113,20.8,2020-12-14 01:00:00.000
21,22,2020-12-14 05:15:00,0,1.1,0,0,22.8,96,-113,18.6,2020-12-14 01:15:00.000
22,23,2020-12-14 05:30:00,0,1.1,0,0,22.8,93,-113,4.0,2020-12-14 01:30:00.000
23,24,2020-12-14 05:45:00,6,1.2,0,6,22.8,89,-113,21.0,2020-12-14 01:45:00.000
24,25,2020-12-14 06:00:00,34,1.2,2,34,22.9,86,-113,19.4,2020-12-14 02:00:00.000
25,26,2020-12-14 06:15:00,61,1.1,0,61,23.3,82,-113,31.7,2020-12-14 02:15:00.000
26,27,2020-12-14 06:30:00,94,1.1,0,94,23.8,79,-114,34.2,2020-12-14 02:30:00.000
27,28,2020-12-14 06:45:00,119,1.1,0,119,24.2,75,-114,40.7,2020-12-14 02:45:00.000
28,29,2020-12-14 07:00:00,167,1.0,0,167,24.6,72,-115,36.0,2020-12-14 03:00:00.000
29,30,2020-12-14 07:15:00,186,1.0,0,186,25.3,69,-115,41.9,2020-12-14 03:15:00.000
30,31,2020-12-14 07:30:00,203,0.9,0,203,25.9,65,-116,46.4,2020-12-14 03:30:00.000
31,32,2020-12-14 07:45:00,216,0.9,0,216,26.6,62,-117,50.7,2020-12-14 03:45:00.000
32,33,2020-12-14 08:00:00,295,0.9,0,295,27.2,59,-118,40.4,2020-12-14 04:00:00.000
33,34,2020-12-14 08:15:00,416,0.9,191,307,27.7,55,-119,24.2,2020-12-14 04:15:00.000
34,35,2020-12-14 08:30:00,520,0.9,437,251,28.2,52,-120,13.6,2020-12-14 04:30:00.000
35,36,2020-12-14 08:45:00,652,1.0,829,106,28.7,49,-122,0.0,2020-12-14 04:45:00.000
36,37,2020-12-14 09:00:00,699,1.0,843,110,29.2,46,-124,0.0,2020-12-14 05:00:00.000
37,38,2020-12-14 09:15:00,742,0.9,855,114,29.5,43,-126,0.0,2020-12-14 05:15:00.000
38,39,2020-12-14 09:30:00,783,0.9,865,117,29.8,40,-129,0.0,2020-12-14 05:30:00.000
39,40,2020-12-14 09:45:00,819,0.8,873,120,30.1,37,-132,0.0,2020-12-14 05:45:00.000
40,41,2020-12-14 10:00:00,851,0.8,880,123,30.4,34,-136,0.0,2020-12-14 06:00:00.000
41,42,2020-12-14 10:15:00,880,0.8,886,125,30.7,32,-140,0.0,2020-12-14 06:15:00.000
42,43,2020-12-14 10:30:00,903,0.8,890,128,30.9,29,-145,0.0,2020-12-14 06:30:00.000
43,44,2020-12-14 10:45:00,859,0.8,677,258,31.1,27,-151,6.8,2020-12-14 06:45:00.000
44,45,2020-12-14 11:00:00,880,0.8,701,249,31.2,26,-158,6.0,2020-12-14 07:00:00.000
45,46,2020-12-14 11:15:00,733,0.8,267,490,31.2,25,-166,22.5,2020-12-14 07:15:00.000
46,47,2020-12-14 11:30:00,784,0.8,386,432,31.1,24,-174,17.5,2020-12-14 07:30:00.000
47,48,2020-12-14 11:45:00,880,0.8,653,283,31.0,24,178,7.5,2020-12-14 07:45:00.000
48,49,2020-12-14 12:00:00,806,0.8,445,400,30.9,24,169,15.0,2020-12-14 08:00:00.000
49,50,2020-12-14 12:15:00,750,0.8,318,463,30.7,25,161,20.1,2020-12-14 08:15:00.000
50,51,2020-12-14 12:30:00,782,0.8,426,401,30.4,27,154,15.6,2020-12-14 08:30:00.000
51,52,2020-12-14 12:45:00,749,0.8,377,418,30.2,28,148,17.5,2020-12-14 08:45:00.000
52,53,2020-12-14 13:00:00,618,0.8,117,516,29.9,31,142,30.3,2020-12-14 09:00:00.000
53,54,2020-12-14 13:15:00,657,0.8,247,452,29.5,33,138,23.4,2020-12-14 09:15:00.000
54,55,2020-12-14 13:30:00,624,0.8,212,450,29.1,36,134,24.8,2020-12-14 09:30:00.000
55,56,2020-12-14 13:45:00,693,0.8,479,317,28.8,38,130,12.8,2020-12-14 09:45:00.000
56,57,2020-12-14 14:00:00,453,0.8,74,396,28.4,41,127,40.2,2020-12-14 10:00:00.000
57,58,2020-12-14 14:15:00,380,0.8,0,380,28.3,44,125,46.6,2020-12-14 10:15:00.000
58,59,2020-12-14 14:30:00,351,0.9,0,351,28.2,48,123,47.4,2020-12-14 10:30:00.000
59,60,2020-12-14 14:45:00,226,1.0,0,226,28.1,51,121,63.6,2020-12-14 10:45:00.000
60,61,2020-12-14 15:00:00,226,1.0,0,226,27.9,54,120,60.0,2020-12-14 11:00:00.000
61,62,2020-12-14 15:15:00,32,1.1,0,32,27.8,57,118,93.6,2020-12-14 11:15:00.000
62,63,2020-12-14 15:30:00,64,1.2,0,64,27.6,61,117,85.9,2020-12-14 11:30:00.000
63,64,2020-12-14 15:45:00,90,1.2,0,90,27.4,64,116,77.7,2020-12-14 11:45:00.000
64,65,2020-12-14 16:00:00,20,1.3,0,20,27.2,67,116,94.4,2020-12-14 12:00:00.000
65,66,2020-12-14 16:15:00,59,1.3,0,59,26.9,71,115,79.5,2020-12-14 12:15:00.000
66,67,2020-12-14 16:30:00,10,1.4,0,10,26.5,74,114,95.6,2020-12-14 12:30:00.000
67,68,2020-12-14 16:45:00,18,1.5,0,18,26.2,77,114,88.9,2020-12-14 12:45:00.000
68,69,2020-12-14 17:00:00,15,1.5,0,15,25.9,81,114,85.4,2020-12-14 13:00:00.000
69,70,2020-12-14 17:15:00,10,1.5,0,10,25.6,84,113,78.7,2020-12-14 13:15:00.000
70,71,2020-12-14 17:30:00,7,1.6,0,7,25.3,88,113,63.6,2020-12-14 13:30:00.000
71,72,2020-12-14 17:45:00,0,1.6,0,0,25.1,91,113,66.0,2020-12-14 13:45:00.000
72,73,2020-12-14 18:00:00,0,1.7,0,0,24.8,95,113,67.9,2020-12-14 14:00:00.000
73,74,2020-12-14 18:15:00,0,1.7,0,0,24.7,98,113,91.0,2020-12-14 14:15:00.000
74,75,2020-12-14 18:30:00,0,1.8,0,0,24.6,102,114,89.8,2020-12-14 14:30:00.000
75,76,2020-12-14 18:45:00,0,1.8,0,0,24.5,105,114,89.5,2020-12-14 14:45:00.000
76,77,2020-12-14 19:00:00,0,1.9,0,0,24.4,108,114,87.6,2020-12-14 15:00:00.000
77,78,2020-12-14 19:15:00,0,2.0,0,0,24.4,112,115,72.5,2020-12-14 15:15:00.000
78,79,2020-12-14 19:30:00,0,2.1,0,0,24.3,115,115,78.4,2020-12-14 15:30:00.000
79,80,2020-12-14 19:45:00,0,2.2,0,0,24.3,119,116,85.0,2020-12-14 15:45:00.000
80,81,2020-12-14 20:00:00,0,2.3,0,0,24.2,122,117,82.6,2020-12-14 16:00:00.000
81,82,2020-12-14 20:15:00,0,2.3,0,0,24.1,125,118,70.5,2020-12-14 16:15:00.000
82,83,2020-12-14 20:30:00,0,2.4,0,0,24.1,129,120,68.4,2020-12-14 16:30:00.000
83,84,2020-12-14 20:45:00,0,2.4,0,0,24.0,132,121,67.0,2020-12-14 16:45:00.000
84,85,2020-12-14 21:00:00,0,2.5,0,0,23.9,135,123,71.6,2020-12-14 17:00:00.000
85,86,2020-12-14 21:15:00,0,2.5,0,0,23.9,138,125,59.0,2020-12-14 17:15:00.000
86,87,2020-12-14 21:30:00,0,2.5,0,0,23.9,141,128,45.0,2020-12-14 17:30:00.000
87,88,2020-12-14 21:45:00,0,2.6,0,0,23.9,144,131,75.0,2020-12-14 17:45:00.000
88,89,2020-12-14 22:00:00,0,2.6,0,0,23.8,147,135,75.0,2020-12-14 18:00:00.000
89,90,2020-12-14 22:15:00,0,2.5,0,0,23.8,149,139,75.1,2020-12-14 18:15:00.000
90,91,2020-12-14 22:30:00,0,2.4,0,0,23.8,152,144,89.2,2020-12-14 18:30:00.000
91,92,2020-12-14 22:45:00,0,2.3,0,0,23.8,154,150,84.5,2020-12-14 18:45:00.000
92,93,2020-12-14 23:00:00,0,2.2,0,0,23.8,155,157,85.2,2020-12-14 19:00:00.000
93,94,2020-12-14 23:15:00,0,2.0,0,0,23.7,157,165,93.5,2020-12-14 19:15:00.000
94,95,2020-12-14 23:30:00,0,1.9,0,0,23.7,157,174,96.5,2020-12-14 19:30:00.000
95,96,2020-12-14 23:45:00,0,1.8,0,0,23.7,157,-177,96.7,2020-12-14 19:45:00.000
