,BLOCK_ID,DATA_DATETIME,GHI,WIND_SPEED,DNI,DHI,TEMPERATURE,ZENITH,AZIMUTH,CLOUD_OPACITY,ENTRY_TIME
0,1,2018-12-10 00:00:00,0,1.7,0,0,26.4,157,-167,0.0,2018-12-09 20:00:00.000
1,2,2018-12-10 00:15:00,0,1.8,0,0,26.4,156,-159,0.0,2018-12-09 20:15:00.000
2,3,2018-12-10 00:30:00,0,1.8,0,0,26.3,155,-151,0.0,2018-12-09 20:30:00.000
3,4,2018-12-10 00:45:00,0,1.8,0,0,26.3,153,-145,0.0,2018-12-09 20:45:00.000
4,5,2018-12-10 01:00:00,0,1.8,0,0,26.3,150,-139,0.0,2018-12-09 21:00:00.000
5,6,2018-12-10 01:15:00,0,1.8,0,0,26.3,148,-135,0.0,2018-12-09 21:15:00.000
6,7,2018-12-10 01:30:00,0,1.9,0,0,26.3,145,-131,0.0,2018-12-09 21:30:00.000
7,8,2018-12-10 01:45:00,0,1.9,0,0,26.3,142,-128,0.0,2018-12-09 21:45:00.000
8,9,2018-12-10 02:00:00,0,1.9,0,0,26.3,139,-125,0.0,2018-12-09 22:00:00.000
9,10,2018-12-10 02:15:00,0,2.0,0,0,26.3,136,-123,0.0,2018-12-09 22:15:00.000
10,11,2018-12-10 02:30:00,0,2.0,0,0,26.3,133,-121,0.0,2018-12-09 22:30:00.000
11,12,2018-12-10 02:45:00,0,2.0,0,0,26.3,130,-119,0.0,2018-12-09 22:45:00.000
12,13,2018-12-10 03:00:00,0,2.1,0,0,26.3,126,-118,0.0,2018-12-09 23:00:00.000
13,14,2018-12-10 03:15:00,0,2.1,0,0,26.3,123,-117,0.0,2018-12-09 23:15:00.000
14,15,2018-12-10 03:30:00,0,2.2,0,0,26.4,120,-116,0.0,2018-12-09 23:30:00.000
15,16,2018-12-10 03:45:00,0,2.2,0,0,26.4,116,-115,0.0,2018-12-09 23:45:00.000
16,17,2018-12-10 04:00:00,0,2.3,0,0,26.4,113,-114,0.0,2018-12-10 00:00:00.000
17,18,2018-12-10 04:15:00,0,2.3,0,0,26.4,109,-114,0.0,2018-12-10 00:15:00.000
18,19,2018-12-10 04:30:00,0,2.4,0,0,26.4,106,-113,0.0,2018-12-10 00:30:00.000
19,20,2018-12-10 04:45:00,0,2.5,0,0,26.4,102,-113,0.0,2018-12-10 00:45:00.000
20,21,2018-12-10 05:00:00,0,2.5,0,0,26.4,99,-113,0.0,2018-12-10 01:00:00.000
21,22,2018-12-10 05:15:00,0,2.4,0,0,26.6,96,-113,0.0,2018-12-10 01:15:00.000
22,23,2018-12-10 05:30:00,0,2.4,0,0,26.7,92,-113,0.0,2018-12-10 01:30:00.000
23,24,2018-12-10 05:45:00,11,2.3,39,8,26.8,89,-113,0.0,2018-12-10 01:45:00.000
24,25,2018-12-10 06:00:00,33,2.3,22,31,26.9,85,-113,28.7,2018-12-10 02:00:00.000
25,26,2018-12-10 06:15:00,76,2.2,45,70,27.1,82,-113,21.7,2018-12-10 02:15:00.000
26,27,2018-12-10 06:30:00,110,2.2,13,107,27.2,78,-113,27.4,2018-12-10 02:30:00.000
27,28,2018-12-10 06:45:00,123,2.1,1,123,27.3,75,-114,41.7,2018-12-10 02:45:00.000
28,29,2018-12-10 07:00:00,216,2.0,195,152,27.4,71,-114,20.1,2018-12-10 03:00:00.000
29,30,2018-12-10 07:15:00,237,2.0,91,203,27.6,68,-115,27.6,2018-12-10 03:15:00.000
30,31,2018-12-10 07:30:00,265,1.9,38,249,27.7,65,-116,31.6,2018-12-10 03:30:00.000
31,32,2018-12-10 07:45:00,332,1.9,146,262,27.8,61,-117,25.4,2018-12-10 03:45:00.000
32,33,2018-12-10 08:00:00,411,1.8,305,248,27.9,58,-118,18.1,2018-12-10 04:00:00.000
33,34,2018-12-10 08:15:00,490,1.9,464,221,27.7,55,-119,11.8,2018-12-10 04:15:00.000
34,35,2018-12-10 08:30:00,551,1.9,544,212,27.6,51,-120,9.3,2018-12-10 04:30:00.000
35,36,2018-12-10 08:45:00,556,1.9,401,289,27.4,48,-122,15.3,2018-12-10 04:45:00.000
36,37,2018-12-10 09:00:00,592,1.9,397,312,27.3,45,-124,15.8,2018-12-10 05:00:00.000
37,38,2018-12-10 09:15:00,648,2.0,470,299,27.1,42,-126,13.2,2018-12-10 05:15:00.000
38,39,2018-12-10 09:30:00,648,2.0,370,361,27.0,39,-129,17.6,2018-12-10 05:30:00.000
39,40,2018-12-10 09:45:00,670,2.0,354,384,26.8,36,-132,18.5,2018-12-10 05:45:00.000
40,41,2018-12-10 10:00:00,787,2.1,637,255,26.7,33,-136,7.8,2018-12-10 06:00:00.000
41,42,2018-12-10 10:15:00,870,2.1,842,148,26.5,31,-140,1.2,2018-12-10 06:15:00.000
42,43,2018-12-10 10:30:00,869,2.1,761,202,26.4,29,-146,3.8,2018-12-10 06:30:00.000
43,44,2018-12-10 10:45:00,897,2.2,795,188,26.2,27,-152,2.5,2018-12-10 06:45:00.000
44,45,2018-12-10 11:00:00,929,2.2,855,155,26.1,25,-159,0.4,2018-12-10 07:00:00.000
45,46,2018-12-10 11:15:00,935,2.3,841,167,26.2,24,-167,0.5,2018-12-10 07:15:00.000
46,47,2018-12-10 11:30:00,943,2.4,851,163,26.2,23,-175,0.0,2018-12-10 07:30:00.000
47,48,2018-12-10 11:45:00,938,2.5,831,175,26.3,23,176,0.6,2018-12-10 07:45:00.000
48,49,2018-12-10 12:00:00,896,2.6,706,251,26.3,24,168,4.6,2018-12-10 08:00:00.000
49,50,2018-12-10 12:15:00,732,2.6,270,488,26.4,25,160,21.2,2018-12-10 08:15:00.000
50,51,2018-12-10 12:30:00,721,2.7,268,482,26.4,27,153,21.2,2018-12-10 08:30:00.000
51,52,2018-12-10 12:45:00,812,2.8,554,325,26.5,28,146,9.6,2018-12-10 08:45:00.000
52,53,2018-12-10 13:00:00,588,2.9,111,491,26.5,31,141,32.8,2018-12-10 09:00:00.000
53,54,2018-12-10 13:15:00,709,3.0,377,394,26.6,33,136,16.3,2018-12-10 09:15:00.000
54,55,2018-12-10 13:30:00,783,3.1,695,220,26.6,36,133,4.1,2018-12-10 09:30:00.000
55,56,2018-12-10 13:45:00,763,3.1,741,185,26.7,39,129,2.2,2018-12-10 09:45:00.000
56,57,2018-12-10 14:00:00,649,3.2,450,311,26.7,42,127,12.6,2018-12-10 10:00:00.000
57,58,2018-12-10 14:15:00,511,3.3,122,424,26.7,45,124,26.8,2018-12-10 10:15:00.000
58,59,2018-12-10 14:30:00,468,3.4,91,407,26.8,48,122,28.2,2018-12-10 10:30:00.000
59,60,2018-12-10 14:45:00,384,3.4,0,384,26.8,51,120,36.3,2018-12-10 10:45:00.000
60,61,2018-12-10 15:00:00,329,3.5,0,329,26.8,54,119,40.3,2018-12-10 11:00:00.000
61,62,2018-12-10 15:15:00,287,3.6,0,287,26.9,58,118,42.3,2018-12-10 11:15:00.000
62,63,2018-12-10 15:30:00,206,3.7,0,206,26.9,61,117,53.2,2018-12-10 11:30:00.000
63,64,2018-12-10 15:45:00,158,3.8,0,158,26.9,64,116,59.4,2018-12-10 11:45:00.000
64,65,2018-12-10 16:00:00,128,3.9,0,128,27.0,68,115,59.9,2018-12-10 12:00:00.000
65,66,2018-12-10 16:15:00,96,4.0,0,96,27.0,71,114,62.9,2018-12-10 12:15:00.000
66,67,2018-12-10 16:30:00,82,4.0,0,82,27.0,75,114,60.9,2018-12-10 12:30:00.000
67,68,2018-12-10 16:45:00,100,4.1,0,100,27.1,78,113,33.6,2018-12-10 12:45:00.000
68,69,2018-12-10 17:00:00,50,4.2,0,50,27.1,81,113,47.8,2018-12-10 13:00:00.000
69,70,2018-12-10 17:15:00,31,4.1,0,31,27.0,85,113,33.9,2018-12-10 13:15:00.000
70,71,2018-12-10 17:30:00,12,4.0,9,11,27.0,88,113,2.9,2018-12-10 13:30:00.000
71,72,2018-12-10 17:45:00,0,4.0,0,0,26.9,92,113,0.0,2018-12-10 13:45:00.000
72,73,2018-12-10 18:00:00,0,3.9,0,0,26.9,95,113,0.0,2018-12-10 14:00:00.000
73,74,2018-12-10 18:15:00,0,3.8,0,0,26.8,99,113,0.0,2018-12-10 14:15:00.000
74,75,2018-12-10 18:30:00,0,3.8,0,0,26.8,102,113,15.6,2018-12-10 14:30:00.000
75,76,2018-12-10 18:45:00,0,3.7,0,0,26.7,106,114,0.0,2018-12-10 14:45:00.000
76,77,2018-12-10 19:00:00,0,3.6,0,0,26.7,109,114,0.0,2018-12-10 15:00:00.000
77,78,2018-12-10 19:15:00,0,3.5,0,0,26.6,112,114,0.0,2018-12-10 15:15:00.000
78,79,2018-12-10 19:30:00,0,3.5,0,0,26.6,116,115,0.0,2018-12-10 15:30:00.000
79,80,2018-12-10 19:45:00,0,3.4,0,0,26.5,119,116,0.0,2018-12-10 15:45:00.000
80,81,2018-12-10 20:00:00,0,3.4,0,0,26.5,123,117,0.0,2018-12-10 16:00:00.000
81,82,2018-12-10 20:15:00,0,3.4,0,0,26.6,126,118,0.0,2018-12-10 16:15:00.000
82,83,2018-12-10 20:30:00,0,3.4,0,0,26.6,129,119,0.0,2018-12-10 16:30:00.000
83,84,2018-12-10 20:45:00,0,3.4,0,0,26.7,132,121,0.0,2018-12-10 16:45:00.000
84,85,2018-12-10 21:00:00,0,3.4,0,0,26.8,136,123,0.0,2018-12-10 17:00:00.000
85,86,2018-12-10 21:15:00,0,3.4,0,0,26.8,139,125,0.0,2018-12-10 17:15:00.000
86,87,2018-12-10 21:30:00,0,3.4,0,0,26.9,142,128,0.0,2018-12-10 17:30:00.000
87,88,2018-12-10 21:45:00,0,3.5,0,0,27.0,145,131,0.0,2018-12-10 17:45:00.000
88,89,2018-12-10 22:00:00,0,3.5,0,0,27.0,147,135,0.0,2018-12-10 18:00:00.000
89,90,2018-12-10 22:15:00,0,3.5,0,0,27.1,150,139,0.0,2018-12-10 18:15:00.000
90,91,2018-12-10 22:30:00,0,3.5,0,0,27.2,152,144,0.0,2018-12-10 18:30:00.000
91,92,2018-12-10 22:45:00,0,3.5,0,0,27.2,154,151,0.0,2018-12-10 18:45:00.000
92,93,2018-12-10 23:00:00,0,3.5,0,0,27.3,156,158,0.0,2018-12-10 19:00:00.000
93,94,2018-12-10 23:15:00,0,3.5,0,0,27.2,157,166,0.0,2018-12-10 19:15:00.000
94,95,2018-12-10 23:30:00,0,3.5,0,0,27.2,158,175,0.0,2018-12-10 19:30:00.000
95,96,2018-12-10 23:45:00,0,3.5,0,0,27.2,158,-176,0.0,2018-12-10 19:45:00.000
