,BLOCK_ID,DATA_DATETIME,GHI,WIND_SPEED,DNI,DHI,TEMPERATURE,ZENITH,AZIMUTH,CLOUD_OPACITY,ENTRY_TIME
0,1,2018-11-21 00:00:00,0,3.7,0,0,26.2,160,-160,0.0,2018-11-20 20:00:00.000
1,2,2018-11-21 00:15:00,0,3.8,0,0,26.1,158,-151,0.0,2018-11-20 20:15:00.000
2,3,2018-11-21 00:30:00,0,3.8,0,0,26.1,156,-144,0.0,2018-11-20 20:30:00.000
3,4,2018-11-21 00:45:00,0,3.9,0,0,26.0,154,-137,0.0,2018-11-20 20:45:00.000
4,5,2018-11-21 01:00:00,0,4.0,0,0,26.0,151,-132,0.0,2018-11-20 21:00:00.000
5,6,2018-11-21 01:15:00,0,4.0,0,0,25.9,148,-128,0.0,2018-11-20 21:15:00.000
6,7,2018-11-21 01:30:00,0,4.1,0,0,25.9,145,-125,0.0,2018-11-20 21:30:00.000
7,8,2018-11-21 01:45:00,0,4.2,0,0,25.8,142,-122,0.0,2018-11-20 21:45:00.000
8,9,2018-11-21 02:00:00,0,4.2,0,0,25.8,139,-120,0.0,2018-11-20 22:00:00.000
9,10,2018-11-21 02:15:00,0,4.2,0,0,25.8,136,-118,0.0,2018-11-20 22:15:00.000
10,11,2018-11-21 02:30:00,0,4.1,0,0,25.8,132,-116,0.0,2018-11-20 22:30:00.000
11,12,2018-11-21 02:45:00,0,4.1,0,0,25.8,129,-115,0.0,2018-11-20 22:45:00.000
12,13,2018-11-21 03:00:00,0,4.1,0,0,25.7,126,-114,0.0,2018-11-20 23:00:00.000
13,14,2018-11-21 03:15:00,0,4.1,0,0,25.7,122,-113,0.0,2018-11-20 23:15:00.000
14,15,2018-11-21 03:30:00,0,4.0,0,0,25.7,119,-112,0.0,2018-11-20 23:30:00.000
15,16,2018-11-21 03:45:00,0,4.0,0,0,25.7,115,-111,0.0,2018-11-20 23:45:00.000
16,17,2018-11-21 04:00:00,0,4.0,0,0,25.7,112,-111,0.0,2018-11-21 00:00:00.000
17,18,2018-11-21 04:15:00,0,3.9,0,0,25.7,108,-110,0.0,2018-11-21 00:15:00.000
18,19,2018-11-21 04:30:00,0,3.9,0,0,25.6,105,-110,0.0,2018-11-21 00:30:00.000
19,20,2018-11-21 04:45:00,0,3.9,0,0,25.6,101,-110,0.0,2018-11-21 00:45:00.000
20,21,2018-11-21 05:00:00,0,3.8,0,0,25.6,98,-110,0.0,2018-11-21 01:00:00.000
21,22,2018-11-21 05:15:00,0,3.7,0,0,25.8,94,-110,0.0,2018-11-21 01:15:00.000
22,23,2018-11-21 05:30:00,0,3.6,0,0,25.9,91,-110,0.0,2018-11-21 01:30:00.000
23,24,2018-11-21 05:45:00,25,3.5,97,17,26.0,87,-110,0.0,2018-11-21 01:45:00.000
24,25,2018-11-21 06:00:00,68,3.4,289,34,26.1,84,-110,0.0,2018-11-21 02:00:00.000
25,26,2018-11-21 06:15:00,100,3.3,149,75,26.2,80,-110,15.2,2018-11-21 02:15:00.000
26,27,2018-11-21 06:30:00,140,3.2,114,112,26.3,76,-110,20.5,2018-11-21 02:30:00.000
27,28,2018-11-21 06:45:00,204,3.1,285,119,26.5,73,-111,13.1,2018-11-21 02:45:00.000
28,29,2018-11-21 07:00:00,264,3.0,378,132,26.6,69,-111,10.0,2018-11-21 03:00:00.000
29,30,2018-11-21 07:15:00,292,3.0,249,190,26.7,66,-112,17.6,2018-11-21 03:15:00.000
30,31,2018-11-21 07:30:00,394,2.9,570,128,26.8,62,-112,4.9,2018-11-21 03:30:00.000
31,32,2018-11-21 07:45:00,468,2.8,704,105,26.9,59,-113,0.6,2018-11-21 03:45:00.000
32,33,2018-11-21 08:00:00,527,2.7,748,104,27.0,56,-114,0.0,2018-11-21 04:00:00.000
33,34,2018-11-21 08:15:00,580,2.7,769,109,27.0,52,-116,0.0,2018-11-21 04:15:00.000
34,35,2018-11-21 08:30:00,632,2.8,788,114,27.0,49,-117,0.0,2018-11-21 04:30:00.000
35,36,2018-11-21 08:45:00,681,2.8,803,118,27.0,46,-119,0.0,2018-11-21 04:45:00.000
36,37,2018-11-21 09:00:00,726,2.9,817,122,27.0,42,-121,0.0,2018-11-21 05:00:00.000
37,38,2018-11-21 09:15:00,768,2.9,829,126,27.0,39,-123,0.0,2018-11-21 05:15:00.000
38,39,2018-11-21 09:30:00,807,2.9,838,129,27.0,36,-126,0.0,2018-11-21 05:30:00.000
39,40,2018-11-21 09:45:00,841,3.0,847,131,27.0,33,-129,0.0,2018-11-21 05:45:00.000
40,41,2018-11-21 10:00:00,871,3.0,854,133,27.0,30,-133,0.0,2018-11-21 06:00:00.000
41,42,2018-11-21 10:15:00,897,3.1,860,135,27.0,28,-138,0.0,2018-11-21 06:15:00.000
42,43,2018-11-21 10:30:00,919,3.1,865,137,27.0,25,-144,0.0,2018-11-21 06:30:00.000
43,44,2018-11-21 10:45:00,740,3.1,313,454,27.0,23,-151,20.8,2018-11-21 06:45:00.000
44,45,2018-11-21 11:00:00,884,3.2,705,228,27.0,22,-159,6.8,2018-11-21 07:00:00.000
45,46,2018-11-21 11:15:00,920,3.2,755,214,27.0,21,-169,3.7,2018-11-21 07:15:00.000
46,47,2018-11-21 11:30:00,873,3.2,600,310,27.0,20,-179,9.0,2018-11-21 07:30:00.000
47,48,2018-11-21 11:45:00,698,3.2,292,424,27.1,20,171,27.1,2018-11-21 07:45:00.000
48,49,2018-11-21 12:00:00,736,3.2,353,408,27.1,21,162,22.5,2018-11-21 08:00:00.000
49,50,2018-11-21 12:15:00,896,3.2,722,230,27.1,23,153,4.6,2018-11-21 08:15:00.000
50,51,2018-11-21 12:30:00,627,3.2,144,496,27.1,25,146,32.1,2018-11-21 08:30:00.000
51,52,2018-11-21 12:45:00,900,3.2,851,142,27.1,27,139,0.2,2018-11-21 08:45:00.000
52,53,2018-11-21 13:00:00,869,3.2,821,155,27.1,30,134,1.0,2018-11-21 09:00:00.000
53,54,2018-11-21 13:15:00,848,3.2,845,134,27.2,32,130,0.0,2018-11-21 09:15:00.000
54,55,2018-11-21 13:30:00,807,3.2,805,150,27.2,35,127,1.0,2018-11-21 09:30:00.000
55,56,2018-11-21 13:45:00,748,3.3,712,191,27.2,38,124,3.6,2018-11-21 09:45:00.000
56,57,2018-11-21 14:00:00,733,3.3,800,134,27.2,42,121,0.0,2018-11-21 10:00:00.000
57,58,2018-11-21 14:15:00,628,3.2,534,249,27.2,45,119,8.6,2018-11-21 10:15:00.000
58,59,2018-11-21 14:30:00,496,3.2,214,351,27.2,48,117,22.4,2018-11-21 10:30:00.000
59,60,2018-11-21 14:45:00,440,3.1,162,342,27.2,51,116,24.7,2018-11-21 10:45:00.000
60,61,2018-11-21 15:00:00,395,3.1,124,322,27.2,55,115,26.2,2018-11-21 11:00:00.000
61,62,2018-11-21 15:15:00,326,3.1,40,305,27.2,58,114,31.9,2018-11-21 11:15:00.000
62,63,2018-11-21 15:30:00,326,3.0,187,238,27.3,62,113,22.1,2018-11-21 11:30:00.000
63,64,2018-11-21 15:45:00,297,3.0,222,204,27.3,65,112,17.6,2018-11-21 11:45:00.000
64,65,2018-11-21 16:00:00,247,3.0,192,177,27.3,69,111,18.0,2018-11-21 12:00:00.000
65,66,2018-11-21 16:15:00,176,2.9,40,165,27.3,72,111,26.9,2018-11-21 12:15:00.000
66,67,2018-11-21 16:30:00,141,2.9,53,128,27.3,76,110,22.9,2018-11-21 12:30:00.000
67,68,2018-11-21 16:45:00,89,2.9,0,89,27.3,79,110,29.8,2018-11-21 12:45:00.000
68,69,2018-11-21 17:00:00,53,2.8,0,53,27.3,83,110,28.6,2018-11-21 13:00:00.000
69,70,2018-11-21 17:15:00,27,2.7,0,27,27.3,86,110,19.1,2018-11-21 13:15:00.000
70,71,2018-11-21 17:30:00,2,2.5,0,2,27.2,90,110,29.7,2018-11-21 13:30:00.000
71,72,2018-11-21 17:45:00,0,2.4,0,0,27.2,93,110,31.6,2018-11-21 13:45:00.000
72,73,2018-11-21 18:00:00,0,2.2,0,0,27.2,97,110,36.7,2018-11-21 14:00:00.000
73,74,2018-11-21 18:15:00,0,2.1,0,0,27.2,100,110,37.0,2018-11-21 14:15:00.000
74,75,2018-11-21 18:30:00,0,2.0,0,0,27.1,104,110,37.0,2018-11-21 14:30:00.000
75,76,2018-11-21 18:45:00,0,1.8,0,0,27.1,107,110,37.0,2018-11-21 14:45:00.000
76,77,2018-11-21 19:00:00,0,1.7,0,0,27.1,111,111,37.0,2018-11-21 15:00:00.000
77,78,2018-11-21 19:15:00,0,1.6,0,0,27.0,114,111,37.0,2018-11-21 15:15:00.000
78,79,2018-11-21 19:30:00,0,1.6,0,0,27.0,118,112,37.0,2018-11-21 15:30:00.000
79,80,2018-11-21 19:45:00,0,1.5,0,0,27.0,121,113,37.0,2018-11-21 15:45:00.000
80,81,2018-11-21 20:00:00,0,1.4,0,0,27.0,125,114,37.0,2018-11-21 16:00:00.000
81,82,2018-11-21 20:15:00,0,1.4,0,0,27.0,128,115,37.0,2018-11-21 16:15:00.000
82,83,2018-11-21 20:30:00,0,1.4,0,0,27.0,132,116,37.0,2018-11-21 16:30:00.000
83,84,2018-11-21 20:45:00,0,1.3,0,0,27.1,135,118,37.0,2018-11-21 16:45:00.000
84,85,2018-11-21 21:00:00,0,1.3,0,0,27.1,138,120,37.0,2018-11-21 17:00:00.000
85,86,2018-11-21 21:15:00,0,1.3,0,0,27.1,141,122,36.1,2018-11-21 17:15:00.000
86,87,2018-11-21 21:30:00,0,1.3,0,0,27.1,145,124,7.2,2018-11-21 17:30:00.000
87,88,2018-11-21 21:45:00,0,1.3,0,0,27.2,148,128,0.0,2018-11-21 17:45:00.000
88,89,2018-11-21 22:00:00,0,1.3,0,0,27.2,151,132,0.0,2018-11-21 18:00:00.000
89,90,2018-11-21 22:15:00,0,1.3,0,0,27.2,153,137,0.0,2018-11-21 18:15:00.000
90,91,2018-11-21 22:30:00,0,1.3,0,0,27.2,156,143,0.0,2018-11-21 18:30:00.000
91,92,2018-11-21 22:45:00,0,1.4,0,0,27.3,158,150,0.0,2018-11-21 18:45:00.000
92,93,2018-11-21 23:00:00,0,1.4,0,0,27.3,159,158,0.0,2018-11-21 19:00:00.000
93,94,2018-11-21 23:15:00,0,1.4,0,0,27.3,160,168,0.0,2018-11-21 19:15:00.000
94,95,2018-11-21 23:30:00,0,1.3,0,0,27.2,161,179,0.0,2018-11-21 19:30:00.000
95,96,2018-11-21 23:45:00,0,1.3,0,0,27.2,161,-171,0.0,2018-11-21 19:45:00.000
