,BLOCK_ID,DATA_DATETIME,GHI,WIND_SPEED,DNI,DHI,TEMPERATURE,ZENITH,AZIMUTH,CLOUD_OPACITY,ENTRY_TIME
0,1,2020-05-25 00:00:00,0,1.1,0,0,23.9,158,-11,0.0,2020-05-24 20:00:00.000
1,2,2020-05-25 00:15:00,0,1.1,0,0,23.9,157,-20,0.0,2020-05-24 20:15:00.000
2,3,2020-05-25 00:30:00,0,1.1,0,0,23.8,156,-28,0.0,2020-05-24 20:30:00.000
3,4,2020-05-25 00:45:00,0,1.1,0,0,23.8,154,-35,0.0,2020-05-24 20:45:00.000
4,5,2020-05-25 01:00:00,0,1.1,0,0,23.8,151,-41,0.0,2020-05-24 21:00:00.000
5,6,2020-05-25 01:15:00,0,1.1,0,0,23.7,149,-45,0.0,2020-05-24 21:15:00.000
6,7,2020-05-25 01:30:00,0,1.1,0,0,23.7,146,-49,0.0,2020-05-24 21:30:00.000
7,8,2020-05-25 01:45:00,0,1.1,0,0,23.7,143,-53,0.0,2020-05-24 21:45:00.000
8,9,2020-05-25 02:00:00,0,1.1,0,0,23.6,140,-56,0.0,2020-05-24 22:00:00.000
9,10,2020-05-25 02:15:00,0,1.0,0,0,23.6,137,-58,0.0,2020-05-24 22:15:00.000
10,11,2020-05-25 02:30:00,0,1.0,0,0,23.6,134,-60,0.0,2020-05-24 22:30:00.000
11,12,2020-05-25 02:45:00,0,1.0,0,0,23.5,130,-62,0.0,2020-05-24 22:45:00.000
12,13,2020-05-25 03:00:00,0,1.0,0,0,23.5,127,-63,0.0,2020-05-24 23:00:00.000
13,14,2020-05-25 03:15:00,0,1.0,0,0,23.5,124,-64,0.0,2020-05-24 23:15:00.000
14,15,2020-05-25 03:30:00,0,1.1,0,0,23.5,120,-65,0.0,2020-05-24 23:30:00.000
15,16,2020-05-25 03:45:00,0,1.1,0,0,23.5,117,-66,0.0,2020-05-24 23:45:00.000
16,17,2020-05-25 04:00:00,0,1.1,0,0,23.5,114,-67,0.0,2020-05-25 00:00:00.000
17,18,2020-05-25 04:15:00,0,1.1,0,0,23.5,110,-68,0.0,2020-05-25 00:15:00.000
18,19,2020-05-25 04:30:00,0,1.1,0,0,23.4,107,-68,0.0,2020-05-25 00:30:00.000
19,20,2020-05-25 04:45:00,0,1.1,0,0,23.4,103,-68,0.0,2020-05-25 00:45:00.000
20,21,2020-05-25 05:00:00,0,1.1,0,0,23.4,100,-69,0.0,2020-05-25 01:00:00.000
21,22,2020-05-25 05:15:00,0,1.0,0,0,23.5,96,-69,0.0,2020-05-25 01:15:00.000
22,23,2020-05-25 05:30:00,0,1.0,0,0,23.5,93,-69,20.8,2020-05-25 01:30:00.000
23,24,2020-05-25 05:45:00,4,1.0,0,4,23.5,89,-69,26.0,2020-05-25 01:45:00.000
24,25,2020-05-25 06:00:00,32,0.9,20,30,23.7,86,-69,14.8,2020-05-25 02:00:00.000
25,26,2020-05-25 06:15:00,58,0.9,0,58,24.0,82,-69,26.2,2020-05-25 02:15:00.000
26,27,2020-05-25 06:30:00,93,0.9,0,93,24.3,79,-69,28.2,2020-05-25 02:30:00.000
27,28,2020-05-25 06:45:00,123,0.9,0,123,24.6,75,-69,32.8,2020-05-25 02:45:00.000
28,29,2020-05-25 07:00:00,162,0.9,0,162,25.0,72,-68,32.2,2020-05-25 03:00:00.000
29,30,2020-05-25 07:15:00,216,0.8,46,198,25.7,68,-68,27.1,2020-05-25 03:15:00.000
30,31,2020-05-25 07:30:00,258,0.8,69,229,26.3,65,-67,26.6,2020-05-25 03:30:00.000
31,32,2020-05-25 07:45:00,281,0.8,17,273,27.0,61,-66,31.1,2020-05-25 03:45:00.000
32,33,2020-05-25 08:00:00,302,0.9,10,296,27.6,58,-66,34.6,2020-05-25 04:00:00.000
33,34,2020-05-25 08:15:00,362,0.9,61,326,27.9,54,-65,29.7,2020-05-25 04:15:00.000
34,35,2020-05-25 08:30:00,463,0.9,274,290,28.2,51,-63,18.0,2020-05-25 04:30:00.000
35,36,2020-05-25 08:45:00,612,1.0,727,123,28.5,48,-62,0.0,2020-05-25 04:45:00.000
36,37,2020-05-25 09:00:00,657,1.0,742,127,28.8,44,-60,0.0,2020-05-25 05:00:00.000
37,38,2020-05-25 09:15:00,699,1.0,755,131,29.0,41,-58,0.0,2020-05-25 05:15:00.000
38,39,2020-05-25 09:30:00,737,0.9,766,134,29.2,38,-56,0.0,2020-05-25 05:30:00.000
39,40,2020-05-25 09:45:00,772,0.9,776,137,29.4,35,-53,0.0,2020-05-25 05:45:00.000
40,41,2020-05-25 10:00:00,804,0.9,784,140,29.5,32,-49,0.0,2020-05-25 06:00:00.000
41,42,2020-05-25 10:15:00,752,0.8,526,294,29.4,29,-45,9.5,2020-05-25 06:15:00.000
42,43,2020-05-25 10:30:00,722,0.8,384,380,29.3,27,-40,15.4,2020-05-25 06:30:00.000
43,44,2020-05-25 10:45:00,744,0.8,401,379,29.3,25,-34,14.8,2020-05-25 06:45:00.000
44,45,2020-05-25 11:00:00,866,0.7,736,187,29.1,23,-26,2.4,2020-05-25 07:00:00.000
45,46,2020-05-25 11:15:00,898,0.8,805,148,28.9,21,-18,0.0,2020-05-25 07:15:00.000
46,47,2020-05-25 11:30:00,903,0.8,806,148,28.7,20,-8,0.0,2020-05-25 07:30:00.000
47,48,2020-05-25 11:45:00,905,0.8,807,148,28.5,20,2,0.0,2020-05-25 07:45:00.000
48,49,2020-05-25 12:00:00,902,0.9,807,148,28.4,21,12,0.0,2020-05-25 08:00:00.000
49,50,2020-05-25 12:15:00,895,0.9,806,146,28.4,22,21,0.0,2020-05-25 08:15:00.000
50,51,2020-05-25 12:30:00,855,0.9,710,203,28.4,23,29,3.2,2020-05-25 08:30:00.000
51,52,2020-05-25 12:45:00,794,0.9,569,281,28.5,25,36,8.4,2020-05-25 08:45:00.000
52,53,2020-05-25 13:00:00,847,1.0,798,141,28.6,28,42,0.0,2020-05-25 09:00:00.000
53,54,2020-05-25 13:15:00,823,1.1,793,138,28.8,30,47,0.0,2020-05-25 09:15:00.000
54,55,2020-05-25 13:30:00,794,1.1,786,136,29.1,33,51,0.0,2020-05-25 09:30:00.000
55,56,2020-05-25 13:45:00,757,1.2,758,145,29.4,36,54,0.6,2020-05-25 09:45:00.000
56,57,2020-05-25 14:00:00,721,1.3,750,140,29.6,39,57,0.4,2020-05-25 10:00:00.000
57,58,2020-05-25 14:15:00,654,1.3,626,191,29.6,42,59,4.4,2020-05-25 10:15:00.000
58,59,2020-05-25 14:30:00,561,1.3,408,276,29.5,46,61,12.4,2020-05-25 10:30:00.000
59,60,2020-05-25 14:45:00,519,1.3,394,260,29.4,49,62,12.7,2020-05-25 10:45:00.000
60,61,2020-05-25 15:00:00,403,1.3,115,332,29.2,52,64,26.2,2020-05-25 11:00:00.000
61,62,2020-05-25 15:15:00,332,1.3,21,320,29.0,56,65,32.9,2020-05-25 11:15:00.000
62,63,2020-05-25 15:30:00,337,1.2,158,257,28.8,59,66,23.5,2020-05-25 11:30:00.000
63,64,2020-05-25 15:45:00,317,1.2,220,215,28.6,63,67,18.0,2020-05-25 11:45:00.000
64,65,2020-05-25 16:00:00,253,1.2,108,209,28.4,66,67,23.6,2020-05-25 12:00:00.000
65,66,2020-05-25 16:15:00,207,1.1,67,182,28.0,69,68,24.9,2020-05-25 12:15:00.000
66,67,2020-05-25 16:30:00,153,1.0,6,151,27.7,73,68,30.2,2020-05-25 12:30:00.000
67,68,2020-05-25 16:45:00,100,0.9,0,100,27.3,76,69,38.3,2020-05-25 12:45:00.000
68,69,2020-05-25 17:00:00,76,0.9,0,76,26.9,80,69,31.2,2020-05-25 13:00:00.000
69,70,2020-05-25 17:15:00,26,0.9,0,26,26.5,83,69,54.4,2020-05-25 13:15:00.000
70,71,2020-05-25 17:30:00,15,0.9,0,15,26.0,87,69,39.4,2020-05-25 13:30:00.000
71,72,2020-05-25 17:45:00,1,0.9,0,1,25.5,90,69,30.7,2020-05-25 13:45:00.000
72,73,2020-05-25 18:00:00,0,0.9,0,0,25.1,94,69,44.0,2020-05-25 14:00:00.000
73,74,2020-05-25 18:15:00,0,0.9,0,0,24.9,97,69,43.6,2020-05-25 14:15:00.000
74,75,2020-05-25 18:30:00,0,1.0,0,0,24.7,101,69,73.8,2020-05-25 14:30:00.000
75,76,2020-05-25 18:45:00,0,1.0,0,0,24.6,104,68,36.4,2020-05-25 14:45:00.000
76,77,2020-05-25 19:00:00,0,1.0,0,0,24.4,108,68,0.0,2020-05-25 15:00:00.000
77,78,2020-05-25 19:15:00,0,0.9,0,0,24.4,111,67,0.0,2020-05-25 15:15:00.000
78,79,2020-05-25 19:30:00,0,0.9,0,0,24.3,115,67,0.0,2020-05-25 15:30:00.000
79,80,2020-05-25 19:45:00,0,0.8,0,0,24.3,118,66,0.0,2020-05-25 15:45:00.000
80,81,2020-05-25 20:00:00,0,0.8,0,0,24.2,122,65,0.0,2020-05-25 16:00:00.000
81,82,2020-05-25 20:15:00,0,0.8,0,0,24.1,125,64,0.0,2020-05-25 16:15:00.000
82,83,2020-05-25 20:30:00,0,0.7,0,0,24.1,128,62,0.0,2020-05-25 16:30:00.000
83,84,2020-05-25 20:45:00,0,0.7,0,0,24.0,132,61,0.0,2020-05-25 16:45:00.000
84,85,2020-05-25 21:00:00,0,0.7,0,0,23.9,135,59,0.0,2020-05-25 17:00:00.000
85,86,2020-05-25 21:15:00,0,0.7,0,0,23.9,138,57,0.0,2020-05-25 17:15:00.000
86,87,2020-05-25 21:30:00,0,0.7,0,0,23.9,141,54,0.0,2020-05-25 17:30:00.000
87,88,2020-05-25 21:45:00,0,0.7,0,0,23.8,144,51,0.0,2020-05-25 17:45:00.000
88,89,2020-05-25 22:00:00,0,0.7,0,0,23.8,147,48,0.0,2020-05-25 18:00:00.000
89,90,2020-05-25 22:15:00,0,0.7,0,0,23.8,150,43,0.0,2020-05-25 18:15:00.000
90,91,2020-05-25 22:30:00,0,0.7,0,0,23.8,152,38,0.0,2020-05-25 18:30:00.000
91,92,2020-05-25 22:45:00,0,0.6,0,0,23.8,154,32,0.0,2020-05-25 18:45:00.000
92,93,2020-05-25 23:00:00,0,0.6,0,0,23.8,156,25,29.6,2020-05-25 19:00:00.000
93,94,2020-05-25 23:15:00,0,0.6,0,0,23.8,157,17,37.0,2020-05-25 19:15:00.000
94,95,2020-05-25 23:30:00,0,0.6,0,0,23.8,158,8,37.0,2020-05-25 19:30:00.000
95,96,2020-05-25 23:45:00,0,0.6,0,0,23.8,158,-2,37.0,2020-05-25 19:45:00.000
