,BLOCK_ID,DATA_DATETIME,GHI,WIND_SPEED,DNI,DHI,TEMPERATURE,ZENITH,AZIMUTH,CLOUD_OPACITY,ENTRY_TIME
0,1,2019-08-21 00:00:00,0,3.5,0,0,24.8,166,-11,36.7,2019-08-20 20:00:00.000
1,2,2019-08-21 00:15:00,0,3.5,0,0,24.7,165,-25,25.8,2019-08-20 20:15:00.000
2,3,2019-08-21 00:30:00,0,3.4,0,0,24.7,163,-36,0.0,2019-08-20 20:30:00.000
3,4,2019-08-21 00:45:00,0,3.4,0,0,24.7,161,-45,0.0,2019-08-20 20:45:00.000
4,5,2019-08-21 01:00:00,0,3.4,0,0,24.7,158,-52,0.0,2019-08-20 21:00:00.000
5,6,2019-08-21 01:15:00,0,3.4,0,0,24.6,155,-57,0.0,2019-08-20 21:15:00.000
6,7,2019-08-21 01:30:00,0,3.4,0,0,24.6,152,-61,0.0,2019-08-20 21:30:00.000
7,8,2019-08-21 01:45:00,0,3.3,0,0,24.6,148,-64,11.1,2019-08-20 21:45:00.000
8,9,2019-08-21 02:00:00,0,3.3,0,0,24.6,145,-66,37.0,2019-08-20 22:00:00.000
9,10,2019-08-21 02:15:00,0,3.3,0,0,24.5,141,-68,35.8,2019-08-20 22:15:00.000
10,11,2019-08-21 02:30:00,0,3.3,0,0,24.5,138,-70,37.4,2019-08-20 22:30:00.000
11,12,2019-08-21 02:45:00,0,3.4,0,0,24.5,134,-71,35.8,2019-08-20 22:45:00.000
12,13,2019-08-21 03:00:00,0,3.4,0,0,24.5,131,-72,37.0,2019-08-20 23:00:00.000
13,14,2019-08-21 03:15:00,0,3.4,0,0,24.5,127,-73,0.0,2019-08-20 23:15:00.000
14,15,2019-08-21 03:30:00,0,3.4,0,0,24.4,124,-74,0.0,2019-08-20 23:30:00.000
15,16,2019-08-21 03:45:00,0,3.4,0,0,24.4,120,-75,0.0,2019-08-20 23:45:00.000
16,17,2019-08-21 04:00:00,0,3.5,0,0,24.4,116,-75,0.0,2019-08-21 00:00:00.000
17,18,2019-08-21 04:15:00,0,3.5,0,0,24.4,113,-76,0.0,2019-08-21 00:15:00.000
18,19,2019-08-21 04:30:00,0,3.5,0,0,24.4,109,-76,0.0,2019-08-21 00:30:00.000
19,20,2019-08-21 04:45:00,0,3.5,0,0,24.4,106,-77,0.0,2019-08-21 00:45:00.000
20,21,2019-08-21 05:00:00,0,3.6,0,0,24.4,102,-77,0.0,2019-08-21 01:00:00.000
21,22,2019-08-21 05:15:00,0,3.7,0,0,24.6,98,-77,0.0,2019-08-21 01:15:00.000
22,23,2019-08-21 05:30:00,0,3.7,0,0,24.8,95,-77,0.0,2019-08-21 01:30:00.000
23,24,2019-08-21 05:45:00,1,3.8,2,1,25.0,91,-77,0.0,2019-08-21 01:45:00.000
24,25,2019-08-21 06:00:00,22,3.9,77,15,25.2,87,-77,0.0,2019-08-21 02:00:00.000
25,26,2019-08-21 06:15:00,58,4.0,153,41,25.4,84,-77,8.5,2019-08-21 02:15:00.000
26,27,2019-08-21 06:30:00,112,4.1,351,50,25.6,80,-77,2.7,2019-08-21 02:30:00.000
27,28,2019-08-21 06:45:00,159,4.2,342,78,25.9,76,-77,7.4,2019-08-21 02:45:00.000
28,29,2019-08-21 07:00:00,212,4.2,384,98,26.0,73,-77,8.1,2019-08-21 03:00:00.000
29,30,2019-08-21 07:15:00,292,4.1,622,69,26.1,69,-77,0.0,2019-08-21 03:15:00.000
30,31,2019-08-21 07:30:00,353,4.0,669,74,26.2,65,-76,0.0,2019-08-21 03:30:00.000
31,32,2019-08-21 07:45:00,413,3.8,708,78,26.2,62,-76,0.0,2019-08-21 03:45:00.000
32,33,2019-08-21 08:00:00,474,3.8,741,81,26.4,58,-75,0.0,2019-08-21 04:00:00.000
33,34,2019-08-21 08:15:00,439,3.9,346,240,26.6,54,-75,17.1,2019-08-21 04:15:00.000
34,35,2019-08-21 08:30:00,522,4.1,506,200,26.9,51,-74,11.1,2019-08-21 04:30:00.000
35,36,2019-08-21 08:45:00,613,4.2,691,142,27.2,47,-73,4.2,2019-08-21 04:45:00.000
36,37,2019-08-21 09:00:00,688,4.3,825,91,27.5,44,-72,0.0,2019-08-21 05:00:00.000
37,38,2019-08-21 09:15:00,718,4.4,771,128,27.7,40,-71,2.3,2019-08-21 05:15:00.000
38,39,2019-08-21 09:30:00,764,4.5,798,123,27.9,37,-69,1.8,2019-08-21 05:30:00.000
39,40,2019-08-21 09:45:00,782,4.6,731,169,28.1,33,-67,4.3,2019-08-21 05:45:00.000
40,41,2019-08-21 10:00:00,811,4.6,723,183,28.3,30,-65,4.8,2019-08-21 06:00:00.000
41,42,2019-08-21 10:15:00,819,4.6,656,231,28.4,26,-62,7.3,2019-08-21 06:15:00.000
42,43,2019-08-21 10:30:00,809,4.5,555,298,28.6,23,-58,11.1,2019-08-21 06:30:00.000
43,44,2019-08-21 10:45:00,760,4.5,372,411,28.7,20,-52,18.3,2019-08-21 06:45:00.000
44,45,2019-08-21 11:00:00,803,4.4,444,378,28.8,17,-45,15.3,2019-08-21 07:00:00.000
45,46,2019-08-21 11:15:00,844,4.4,522,339,28.9,15,-35,12.0,2019-08-21 07:15:00.000
46,47,2019-08-21 11:30:00,833,4.4,472,373,29.0,13,-21,13.9,2019-08-21 07:30:00.000
47,48,2019-08-21 11:45:00,878,4.3,587,304,29.1,12,-5,9.6,2019-08-21 07:45:00.000
48,49,2019-08-21 12:00:00,853,4.3,521,344,29.2,12,12,12.0,2019-08-21 08:00:00.000
49,50,2019-08-21 12:15:00,851,4.3,527,339,29.2,14,28,11.8,2019-08-21 08:15:00.000
50,51,2019-08-21 12:30:00,833,4.2,502,350,29.3,16,40,12.8,2019-08-21 08:30:00.000
51,52,2019-08-21 12:45:00,823,4.2,510,339,29.3,18,48,12.4,2019-08-21 08:45:00.000
52,53,2019-08-21 13:00:00,792,4.2,468,356,29.3,21,55,13.9,2019-08-21 09:00:00.000
53,54,2019-08-21 13:15:00,797,4.1,540,306,29.3,24,60,11.0,2019-08-21 09:15:00.000
54,55,2019-08-21 13:30:00,792,4.0,598,263,29.2,28,63,8.6,2019-08-21 09:30:00.000
55,56,2019-08-21 13:45:00,799,3.9,718,185,29.1,31,66,4.2,2019-08-21 09:45:00.000
56,57,2019-08-21 14:00:00,796,3.8,830,113,29.1,35,68,0.0,2019-08-21 10:00:00.000
57,58,2019-08-21 14:15:00,755,3.8,816,112,29.0,38,70,0.0,2019-08-21 10:15:00.000
58,59,2019-08-21 14:30:00,710,3.7,801,111,28.9,42,72,0.0,2019-08-21 10:30:00.000
59,60,2019-08-21 14:45:00,662,3.7,787,108,28.9,45,73,0.0,2019-08-21 10:45:00.000
60,61,2019-08-21 15:00:00,612,3.7,770,105,28.8,49,74,0.0,2019-08-21 11:00:00.000
61,62,2019-08-21 15:15:00,558,3.6,750,101,28.6,52,74,0.0,2019-08-21 11:15:00.000
62,63,2019-08-21 15:30:00,502,3.5,726,96,28.5,56,75,0.0,2019-08-21 11:30:00.000
63,64,2019-08-21 15:45:00,445,3.5,699,91,28.3,60,76,0.0,2019-08-21 11:45:00.000
64,65,2019-08-21 16:00:00,386,3.4,667,86,28.2,63,76,0.0,2019-08-21 12:00:00.000
65,66,2019-08-21 16:15:00,324,3.3,617,82,27.9,67,77,0.4,2019-08-21 12:15:00.000
66,67,2019-08-21 16:30:00,264,3.2,571,74,27.6,71,77,0.3,2019-08-21 12:30:00.000
67,68,2019-08-21 16:45:00,202,3.0,483,70,27.3,74,77,1.5,2019-08-21 12:45:00.000
68,69,2019-08-21 17:00:00,146,2.9,431,55,27.0,78,77,0.4,2019-08-21 13:00:00.000
69,70,2019-08-21 17:15:00,82,2.7,172,56,26.4,82,77,10.2,2019-08-21 13:15:00.000
70,71,2019-08-21 17:30:00,42,2.5,133,29,25.8,85,77,3.6,2019-08-21 13:30:00.000
71,72,2019-08-21 17:45:00,9,2.3,20,8,25.2,89,77,0.0,2019-08-21 13:45:00.000
72,73,2019-08-21 18:00:00,0,2.2,0,0,24.6,93,77,0.0,2019-08-21 14:00:00.000
73,74,2019-08-21 18:15:00,0,2.1,0,0,24.3,96,77,0.0,2019-08-21 14:15:00.000
74,75,2019-08-21 18:30:00,0,1.9,0,0,23.9,100,77,0.0,2019-08-21 14:30:00.000
75,76,2019-08-21 18:45:00,0,1.8,0,0,23.6,103,77,0.0,2019-08-21 14:45:00.000
76,77,2019-08-21 19:00:00,0,1.7,0,0,23.3,107,77,0.0,2019-08-21 15:00:00.000
77,78,2019-08-21 19:15:00,0,1.7,0,0,23.1,111,76,0.0,2019-08-21 15:15:00.000
78,79,2019-08-21 19:30:00,0,1.6,0,0,23.0,114,76,0.0,2019-08-21 15:30:00.000
79,80,2019-08-21 19:45:00,0,1.5,0,0,22.8,118,75,0.0,2019-08-21 15:45:00.000
80,81,2019-08-21 20:00:00,0,1.5,0,0,22.7,122,75,0.0,2019-08-21 16:00:00.000
81,82,2019-08-21 20:15:00,0,1.5,0,0,22.6,125,74,11.1,2019-08-21 16:15:00.000
82,83,2019-08-21 20:30:00,0,1.6,0,0,22.5,129,73,7.4,2019-08-21 16:30:00.000
83,84,2019-08-21 20:45:00,0,1.6,0,0,22.4,132,72,0.0,2019-08-21 16:45:00.000
84,85,2019-08-21 21:00:00,0,1.7,0,0,22.3,136,71,0.0,2019-08-21 17:00:00.000
85,86,2019-08-21 21:15:00,0,1.7,0,0,22.2,140,70,0.0,2019-08-21 17:15:00.000
86,87,2019-08-21 21:30:00,0,1.8,0,0,22.2,143,68,0.0,2019-08-21 17:30:00.000
87,88,2019-08-21 21:45:00,0,1.8,0,0,22.1,147,66,0.0,2019-08-21 17:45:00.000
88,89,2019-08-21 22:00:00,0,1.8,0,0,22.0,150,63,0.0,2019-08-21 18:00:00.000
89,90,2019-08-21 22:15:00,0,1.9,0,0,22.0,153,60,1.7,2019-08-21 18:15:00.000
90,91,2019-08-21 22:30:00,0,1.9,0,0,22.0,156,56,5.6,2019-08-21 18:30:00.000
91,92,2019-08-21 22:45:00,0,2.0,0,0,21.9,159,50,5.6,2019-08-21 18:45:00.000
92,93,2019-08-21 23:00:00,0,2.1,0,0,21.9,162,42,1.1,2019-08-21 19:00:00.000
93,94,2019-08-21 23:15:00,0,2.1,0,0,21.9,164,32,0.0,2019-08-21 19:15:00.000
94,95,2019-08-21 23:30:00,0,2.1,0,0,21.8,166,20,0.0,2019-08-21 19:30:00.000
95,96,2019-08-21 23:45:00,0,2.1,0,0,21.8,167,4,0.0,2019-08-21 19:45:00.000
