,BLOCK_ID,DATA_DATETIME,GHI,WIND_SPEED,DNI,DHI,TEMPERATURE,ZENITH,AZIMUTH,CLOUD_OPACITY,ENTRY_TIME
0,1,2021-09-02 00:00:00,0,0.7,0,0,22.5,170,-20,97.0,2021-09-01 20:00:00.000
1,2,2021-09-02 00:15:00,0,0.6,0,0,22.5,168,-37,93.9,2021-09-01 20:15:00.000
2,3,2021-09-02 00:30:00,0,0.6,0,0,22.4,166,-49,89.6,2021-09-01 20:30:00.000
3,4,2021-09-02 00:45:00,0,0.6,0,0,22.4,163,-57,87.2,2021-09-01 20:45:00.000
4,5,2021-09-02 01:00:00,0,0.6,0,0,22.3,159,-63,87.8,2021-09-01 21:00:00.000
5,6,2021-09-02 01:15:00,0,0.6,0,0,22.3,156,-67,92.3,2021-09-01 21:15:00.000
6,7,2021-09-02 01:30:00,0,0.7,0,0,22.3,152,-70,75.6,2021-09-01 21:30:00.000
7,8,2021-09-02 01:45:00,0,0.7,0,0,22.3,149,-72,55.5,2021-09-01 21:45:00.000
8,9,2021-09-02 02:00:00,0,0.7,0,0,22.3,145,-74,43.2,2021-09-01 22:00:00.000
9,10,2021-09-02 02:15:00,0,0.7,0,0,22.3,142,-75,43.9,2021-09-01 22:15:00.000
10,11,2021-09-02 02:30:00,0,0.6,0,0,22.3,138,-76,34.8,2021-09-01 22:30:00.000
11,12,2021-09-02 02:45:00,0,0.6,0,0,22.3,134,-77,42.6,2021-09-01 22:45:00.000
12,13,2021-09-02 03:00:00,0,0.6,0,0,22.2,131,-78,43.0,2021-09-01 23:00:00.000
13,14,2021-09-02 03:15:00,0,0.6,0,0,22.2,127,-79,59.6,2021-09-01 23:15:00.000
14,15,2021-09-02 03:30:00,0,0.5,0,0,22.2,123,-79,47.6,2021-09-01 23:30:00.000
15,16,2021-09-02 03:45:00,0,0.5,0,0,22.2,120,-80,55.9,2021-09-01 23:45:00.000
16,17,2021-09-02 04:00:00,0,0.5,0,0,22.2,116,-80,57.2,2021-09-02 00:00:00.000
17,18,2021-09-02 04:15:00,0,0.5,0,0,22.2,112,-80,51.2,2021-09-02 00:15:00.000
18,19,2021-09-02 04:30:00,0,0.5,0,0,22.2,109,-81,58.8,2021-09-02 00:30:00.000
19,20,2021-09-02 04:45:00,0,0.5,0,0,22.2,105,-81,60.4,2021-09-02 00:45:00.000
20,21,2021-09-02 05:00:00,0,0.5,0,0,22.1,101,-81,52.6,2021-09-02 01:00:00.000
21,22,2021-09-02 05:15:00,0,0.5,0,0,22.1,98,-81,34.4,2021-09-02 01:15:00.000
22,23,2021-09-02 05:30:00,0,0.6,0,0,22.2,94,-81,19.8,2021-09-02 01:30:00.000
23,24,2021-09-02 05:45:00,2,0.6,0,2,22.2,90,-81,27.1,2021-09-02 01:45:00.000
24,25,2021-09-02 06:00:00,21,0.6,0,21,22.3,86,-81,36.4,2021-09-02 02:00:00.000
25,26,2021-09-02 06:15:00,56,0.6,0,56,22.6,83,-81,29.2,2021-09-02 02:15:00.000
26,27,2021-09-02 06:30:00,92,0.6,8,90,23.0,79,-81,31.2,2021-09-02 02:30:00.000
27,28,2021-09-02 06:45:00,163,0.6,270,94,23.3,75,-81,15.4,2021-09-02 02:45:00.000
28,29,2021-09-02 07:00:00,208,0.6,269,124,23.7,72,-81,17.2,2021-09-02 03:00:00.000
29,30,2021-09-02 07:15:00,265,0.5,335,140,24.1,68,-81,15.2,2021-09-02 03:15:00.000
30,31,2021-09-02 07:30:00,303,0.4,283,180,24.5,64,-81,18.8,2021-09-02 03:30:00.000
31,32,2021-09-02 07:45:00,362,0.3,349,190,24.9,61,-80,16.4,2021-09-02 03:45:00.000
32,33,2021-09-02 08:00:00,423,0.3,413,197,25.2,57,-80,14.2,2021-09-02 04:00:00.000
33,34,2021-09-02 08:15:00,500,0.3,552,169,25.2,53,-80,9.0,2021-09-02 04:15:00.000
34,35,2021-09-02 08:30:00,559,0.4,607,164,25.2,49,-79,7.4,2021-09-02 04:30:00.000
35,36,2021-09-02 08:45:00,655,0.5,829,76,25.2,46,-79,0.0,2021-09-02 04:45:00.000
36,37,2021-09-02 09:00:00,659,0.5,657,172,25.4,42,-78,6.4,2021-09-02 05:00:00.000
37,38,2021-09-02 09:15:00,749,0.6,851,82,25.9,38,-77,0.0,2021-09-02 05:15:00.000
38,39,2021-09-02 09:30:00,791,0.6,860,84,26.5,35,-76,0.0,2021-09-02 05:30:00.000
39,40,2021-09-02 09:45:00,829,0.7,867,87,27.1,31,-74,0.0,2021-09-02 05:45:00.000
40,41,2021-09-02 10:00:00,863,0.7,873,89,27.6,27,-72,0.0,2021-09-02 06:00:00.000
41,42,2021-09-02 10:15:00,893,0.8,878,90,28.1,24,-70,0.0,2021-09-02 06:15:00.000
42,43,2021-09-02 10:30:00,918,1.0,882,92,28.5,20,-67,0.0,2021-09-02 06:30:00.000
43,44,2021-09-02 10:45:00,906,1.1,775,165,28.9,17,-62,3.6,2021-09-02 06:45:00.000
44,45,2021-09-02 11:00:00,908,1.2,735,195,29.2,14,-55,5.0,2021-09-02 07:00:00.000
45,46,2021-09-02 11:15:00,849,1.1,538,321,29.1,11,-44,12.3,2021-09-02 07:15:00.000
46,47,2021-09-02 11:30:00,491,1.0,69,424,29.0,9,-26,49.6,2021-09-02 07:30:00.000
47,48,2021-09-02 11:45:00,357,0.9,0,357,28.9,8,-1,63.5,2021-09-02 07:45:00.000
48,49,2021-09-02 12:00:00,439,0.9,0,439,28.8,9,24,55.0,2021-09-02 08:00:00.000
49,50,2021-09-02 12:15:00,291,0.9,0,291,28.7,11,42,69.9,2021-09-02 08:15:00.000
50,51,2021-09-02 12:30:00,547,0.9,0,547,28.7,14,54,42.8,2021-09-02 08:30:00.000
51,52,2021-09-02 12:45:00,386,1.0,0,386,28.6,17,61,59.0,2021-09-02 08:45:00.000
52,53,2021-09-02 13:00:00,436,1.0,0,436,28.5,20,66,52.6,2021-09-02 09:00:00.000
53,54,2021-09-02 13:15:00,463,1.1,0,463,28.4,24,70,48.3,2021-09-02 09:15:00.000
54,55,2021-09-02 13:30:00,313,1.1,0,313,28.3,27,72,63.8,2021-09-02 09:30:00.000
55,56,2021-09-02 13:45:00,413,1.2,0,413,28.2,31,74,50.3,2021-09-02 09:45:00.000
56,57,2021-09-02 14:00:00,445,1.2,0,445,28.1,34,76,44.0,2021-09-02 10:00:00.000
57,58,2021-09-02 14:15:00,483,1.2,42,450,28.0,38,77,35.8,2021-09-02 10:15:00.000
58,59,2021-09-02 14:30:00,380,1.2,0,380,27.9,42,78,46.4,2021-09-02 10:30:00.000
59,60,2021-09-02 14:45:00,298,1.2,0,298,27.8,45,79,54.9,2021-09-02 10:45:00.000
60,61,2021-09-02 15:00:00,252,1.1,0,252,27.6,49,79,58.6,2021-09-02 11:00:00.000
61,62,2021-09-02 15:15:00,219,1.1,0,219,27.3,53,80,60.5,2021-09-02 11:15:00.000
62,63,2021-09-02 15:30:00,164,1.1,0,164,27.0,56,80,67.2,2021-09-02 11:30:00.000
63,64,2021-09-02 15:45:00,111,1.0,0,111,26.7,60,81,74.9,2021-09-02 11:45:00.000
64,65,2021-09-02 16:00:00,87,1.0,0,87,26.4,64,81,77.0,2021-09-02 12:00:00.000
65,66,2021-09-02 16:15:00,82,1.0,0,82,26.1,67,81,74.3,2021-09-02 12:15:00.000
66,67,2021-09-02 16:30:00,129,1.0,0,129,25.8,71,81,49.4,2021-09-02 12:30:00.000
67,68,2021-09-02 16:45:00,119,1.0,0,119,25.6,75,81,40.3,2021-09-02 12:45:00.000
68,69,2021-09-02 17:00:00,89,1.0,0,89,25.3,79,82,36.2,2021-09-02 13:00:00.000
69,70,2021-09-02 17:15:00,61,1.1,10,60,25.1,82,82,28.1,2021-09-02 13:15:00.000
70,71,2021-09-02 17:30:00,19,1.2,2,19,24.8,86,82,54.0,2021-09-02 13:30:00.000
71,72,2021-09-02 17:45:00,1,1.2,0,1,24.6,90,82,86.7,2021-09-02 13:45:00.000
72,73,2021-09-02 18:00:00,0,1.3,0,0,24.4,93,82,64.4,2021-09-02 14:00:00.000
73,74,2021-09-02 18:15:00,0,1.3,0,0,24.3,97,81,51.2,2021-09-02 14:15:00.000
74,75,2021-09-02 18:30:00,0,1.4,0,0,24.1,101,81,26.8,2021-09-02 14:30:00.000
75,76,2021-09-02 18:45:00,0,1.4,0,0,24.0,105,81,27.3,2021-09-02 14:45:00.000
76,77,2021-09-02 19:00:00,0,1.4,0,0,23.9,108,81,17.6,2021-09-02 15:00:00.000
77,78,2021-09-02 19:15:00,0,1.3,0,0,23.9,112,81,23.4,2021-09-02 15:15:00.000
78,79,2021-09-02 19:30:00,0,1.3,0,0,23.8,116,80,27.8,2021-09-02 15:30:00.000
79,80,2021-09-02 19:45:00,0,1.2,0,0,23.8,119,80,21.9,2021-09-02 15:45:00.000
80,81,2021-09-02 20:00:00,0,1.2,0,0,23.8,123,80,23.2,2021-09-02 16:00:00.000
81,82,2021-09-02 20:15:00,0,1.1,0,0,23.7,127,79,18.7,2021-09-02 16:15:00.000
82,83,2021-09-02 20:30:00,0,1.1,0,0,23.6,130,78,18.8,2021-09-02 16:30:00.000
83,84,2021-09-02 20:45:00,0,1.1,0,0,23.5,134,78,15.0,2021-09-02 16:45:00.000
84,85,2021-09-02 21:00:00,0,1.0,0,0,23.4,138,77,15.0,2021-09-02 17:00:00.000
85,86,2021-09-02 21:15:00,0,0.9,0,0,23.3,141,76,15.3,2021-09-02 17:15:00.000
86,87,2021-09-02 21:30:00,0,0.8,0,0,23.3,145,74,15.2,2021-09-02 17:30:00.000
87,88,2021-09-02 21:45:00,0,0.7,0,0,23.2,149,73,19.0,2021-09-02 17:45:00.000
88,89,2021-09-02 22:00:00,0,0.7,0,0,23.1,152,71,19.0,2021-09-02 18:00:00.000
89,90,2021-09-02 22:15:00,0,0.6,0,0,23.1,156,68,19.0,2021-09-02 18:15:00.000
90,91,2021-09-02 22:30:00,0,0.6,0,0,23.0,159,64,19.0,2021-09-02 18:30:00.000
91,92,2021-09-02 22:45:00,0,0.6,0,0,22.9,162,59,19.0,2021-09-02 18:45:00.000
92,93,2021-09-02 23:00:00,0,0.6,0,0,22.8,165,51,16.6,2021-09-02 19:00:00.000
93,94,2021-09-02 23:15:00,0,0.6,0,0,22.8,168,40,16.0,2021-09-02 19:15:00.000
94,95,2021-09-02 23:30:00,0,0.7,0,0,22.7,170,23,16.0,2021-09-02 19:30:00.000
95,96,2021-09-02 23:45:00,0,0.7,0,0,22.7,171,1,15.7,2021-09-02 19:45:00.000
