,BLOCK_ID,DATA_DATETIME,GHI,WIND_SPEED,DNI,DHI,TEMPERATURE,ZENITH,AZIMUTH,CLOUD_OPACITY,ENTRY_TIME
0,1,2019-10-15 00:00:00,0,0.8,0,0,23.0,170,-135,0.0,2019-10-14 20:00:00.000
1,2,2019-10-15 00:15:00,0,0.8,0,0,22.9,167,-124,0.0,2019-10-14 20:15:00.000
2,3,2019-10-15 00:30:00,0,0.8,0,0,22.9,164,-116,0.0,2019-10-14 20:30:00.000
3,4,2019-10-15 00:45:00,0,0.8,0,0,22.8,160,-112,0.0,2019-10-14 20:45:00.000
4,5,2019-10-15 01:00:00,0,0.7,0,0,22.8,157,-108,0.0,2019-10-14 21:00:00.000
5,6,2019-10-15 01:15:00,0,0.7,0,0,22.8,153,-106,0.0,2019-10-14 21:15:00.000
6,7,2019-10-15 01:30:00,0,0.6,0,0,22.7,150,-104,0.0,2019-10-14 21:30:00.000
7,8,2019-10-15 01:45:00,0,0.6,0,0,22.7,146,-103,0.0,2019-10-14 21:45:00.000
8,9,2019-10-15 02:00:00,0,0.6,0,0,22.7,142,-102,0.0,2019-10-14 22:00:00.000
9,10,2019-10-15 02:15:00,0,0.6,0,0,22.7,139,-101,0.0,2019-10-14 22:15:00.000
10,11,2019-10-15 02:30:00,0,0.6,0,0,22.6,135,-100,0.0,2019-10-14 22:30:00.000
11,12,2019-10-15 02:45:00,0,0.6,0,0,22.6,131,-100,0.0,2019-10-14 22:45:00.000
12,13,2019-10-15 03:00:00,0,0.6,0,0,22.6,128,-99,0.0,2019-10-14 23:00:00.000
13,14,2019-10-15 03:15:00,0,0.6,0,0,22.6,124,-99,0.0,2019-10-14 23:15:00.000
14,15,2019-10-15 03:30:00,0,0.6,0,0,22.5,120,-99,0.0,2019-10-14 23:30:00.000
15,16,2019-10-15 03:45:00,0,0.6,0,0,22.5,116,-98,0.0,2019-10-14 23:45:00.000
16,17,2019-10-15 04:00:00,0,0.6,0,0,22.5,113,-98,0.0,2019-10-15 00:00:00.000
17,18,2019-10-15 04:15:00,0,0.6,0,0,22.5,109,-98,0.0,2019-10-15 00:15:00.000
18,19,2019-10-15 04:30:00,0,0.6,0,0,22.4,105,-98,0.0,2019-10-15 00:30:00.000
19,20,2019-10-15 04:45:00,0,0.6,0,0,22.4,102,-98,0.0,2019-10-15 00:45:00.000
20,21,2019-10-15 05:00:00,0,0.6,0,0,22.4,98,-98,0.0,2019-10-15 01:00:00.000
21,22,2019-10-15 05:15:00,0,0.6,0,0,22.5,94,-98,0.0,2019-10-15 01:15:00.000
22,23,2019-10-15 05:30:00,0,0.6,0,0,22.6,90,-98,0.0,2019-10-15 01:30:00.000
23,24,2019-10-15 05:45:00,25,0.6,63,20,22.7,87,-98,0.8,2019-10-15 01:45:00.000
24,25,2019-10-15 06:00:00,67,0.5,218,40,23.0,83,-98,0.5,2019-10-15 02:00:00.000
25,26,2019-10-15 06:15:00,113,0.5,269,65,23.5,79,-98,3.7,2019-10-15 02:15:00.000
26,27,2019-10-15 06:30:00,158,0.5,229,101,24.1,76,-98,10.2,2019-10-15 02:30:00.000
27,28,2019-10-15 06:45:00,205,0.5,228,135,24.6,72,-98,13.1,2019-10-15 02:45:00.000
28,29,2019-10-15 07:00:00,227,0.5,78,198,25.3,68,-99,24.0,2019-10-15 03:00:00.000
29,30,2019-10-15 07:15:00,250,0.5,22,240,26.1,64,-99,30.9,2019-10-15 03:15:00.000
30,31,2019-10-15 07:30:00,350,0.5,243,230,27.0,61,-99,17.3,2019-10-15 03:30:00.000
31,32,2019-10-15 07:45:00,482,0.5,669,118,27.8,57,-100,0.0,2019-10-15 03:45:00.000
32,33,2019-10-15 08:00:00,541,0.6,698,125,28.6,53,-100,0.0,2019-10-15 04:00:00.000
33,34,2019-10-15 08:15:00,597,0.5,722,130,29.3,50,-101,0.0,2019-10-15 04:15:00.000
34,35,2019-10-15 08:30:00,651,0.5,742,135,30.0,46,-102,0.0,2019-10-15 04:30:00.000
35,36,2019-10-15 08:45:00,701,0.4,759,139,30.6,42,-102,0.0,2019-10-15 04:45:00.000
36,37,2019-10-15 09:00:00,748,0.4,774,143,31.2,39,-103,0.0,2019-10-15 05:00:00.000
37,38,2019-10-15 09:15:00,791,0.4,787,146,31.4,35,-105,0.0,2019-10-15 05:15:00.000
38,39,2019-10-15 09:30:00,830,0.4,798,149,31.7,31,-106,0.0,2019-10-15 05:30:00.000
39,40,2019-10-15 09:45:00,865,0.4,807,152,31.9,28,-108,0.0,2019-10-15 05:45:00.000
40,41,2019-10-15 10:00:00,896,0.5,815,154,32.0,24,-111,0.0,2019-10-15 06:00:00.000
41,42,2019-10-15 10:15:00,923,0.5,821,156,31.9,21,-115,0.0,2019-10-15 06:15:00.000
42,43,2019-10-15 10:30:00,944,0.6,825,158,31.7,17,-119,0.0,2019-10-15 06:30:00.000
43,44,2019-10-15 10:45:00,961,0.7,824,162,31.5,14,-127,0.0,2019-10-15 06:45:00.000
44,45,2019-10-15 11:00:00,878,0.7,545,344,31.2,12,-138,9.7,2019-10-15 07:00:00.000
45,46,2019-10-15 11:15:00,822,0.8,379,448,30.8,9,-155,16.1,2019-10-15 07:15:00.000
46,47,2019-10-15 11:30:00,583,0.8,50,533,30.4,9,-178,40.6,2019-10-15 07:30:00.000
47,48,2019-10-15 11:45:00,458,0.9,0,458,29.9,9,159,53.2,2019-10-15 07:45:00.000
48,49,2019-10-15 12:00:00,206,1.0,0,206,29.6,11,140,78.8,2019-10-15 08:00:00.000
49,50,2019-10-15 12:15:00,302,1.1,0,302,29.5,14,128,68.5,2019-10-15 08:15:00.000
50,51,2019-10-15 12:30:00,251,1.1,0,251,29.4,17,121,73.4,2019-10-15 08:30:00.000
51,52,2019-10-15 12:45:00,164,1.2,0,164,29.3,20,115,82.3,2019-10-15 08:45:00.000
52,53,2019-10-15 13:00:00,54,1.3,0,54,29.2,24,112,94.0,2019-10-15 09:00:00.000
53,54,2019-10-15 13:15:00,43,1.4,0,43,29.2,27,109,95.0,2019-10-15 09:15:00.000
54,55,2019-10-15 13:30:00,42,1.4,0,42,29.2,31,107,95.0,2019-10-15 09:30:00.000
55,56,2019-10-15 13:45:00,201,1.5,0,201,29.2,34,105,74.4,2019-10-15 09:45:00.000
56,57,2019-10-15 14:00:00,459,1.6,0,459,29.1,38,104,38.7,2019-10-15 10:00:00.000
57,58,2019-10-15 14:15:00,536,1.6,170,410,29.1,42,103,23.6,2019-10-15 10:15:00.000
58,59,2019-10-15 14:30:00,489,1.6,132,395,29.0,45,102,25.2,2019-10-15 10:30:00.000
59,60,2019-10-15 14:45:00,390,1.5,26,373,28.9,49,101,35.3,2019-10-15 10:45:00.000
60,61,2019-10-15 15:00:00,207,1.5,0,207,28.7,53,101,62.3,2019-10-15 11:00:00.000
61,62,2019-10-15 15:15:00,134,1.4,0,134,28.5,56,100,72.5,2019-10-15 11:15:00.000
62,63,2019-10-15 15:30:00,209,1.4,0,209,28.2,60,100,50.9,2019-10-15 11:30:00.000
63,64,2019-10-15 15:45:00,280,1.3,101,237,28.0,64,99,23.7,2019-10-15 11:45:00.000
64,65,2019-10-15 16:00:00,268,1.3,262,168,27.7,68,99,13.0,2019-10-15 12:00:00.000
65,66,2019-10-15 16:15:00,214,1.3,224,140,27.4,71,99,13.5,2019-10-15 12:15:00.000
66,67,2019-10-15 16:30:00,137,1.3,12,133,27.1,75,98,26.5,2019-10-15 12:30:00.000
67,68,2019-10-15 16:45:00,71,1.3,0,71,26.8,79,98,46.2,2019-10-15 12:45:00.000
68,69,2019-10-15 17:00:00,34,1.3,0,34,26.5,82,98,53.8,2019-10-15 13:00:00.000
69,70,2019-10-15 17:15:00,22,1.2,8,21,26.1,86,98,26.0,2019-10-15 13:15:00.000
70,71,2019-10-15 17:30:00,3,1.2,6,3,25.7,90,98,0.0,2019-10-15 13:30:00.000
71,72,2019-10-15 17:45:00,0,1.2,0,0,25.3,93,98,0.0,2019-10-15 13:45:00.000
72,73,2019-10-15 18:00:00,0,1.1,0,0,24.9,97,98,0.0,2019-10-15 14:00:00.000
73,74,2019-10-15 18:15:00,0,1.1,0,0,24.8,101,98,0.0,2019-10-15 14:15:00.000
74,75,2019-10-15 18:30:00,0,1.0,0,0,24.7,105,98,0.0,2019-10-15 14:30:00.000
75,76,2019-10-15 18:45:00,0,1.0,0,0,24.5,108,98,9.3,2019-10-15 14:45:00.000
76,77,2019-10-15 19:00:00,0,1.0,0,0,24.4,112,98,31.0,2019-10-15 15:00:00.000
77,78,2019-10-15 19:15:00,0,0.9,0,0,24.3,116,99,31.0,2019-10-15 15:15:00.000
78,79,2019-10-15 19:30:00,0,0.9,0,0,24.3,119,99,6.2,2019-10-15 15:30:00.000
79,80,2019-10-15 19:45:00,0,0.9,0,0,24.2,123,99,0.0,2019-10-15 15:45:00.000
80,81,2019-10-15 20:00:00,0,0.8,0,0,24.1,127,100,0.0,2019-10-15 16:00:00.000
81,82,2019-10-15 20:15:00,0,0.8,0,0,24.0,131,100,0.0,2019-10-15 16:15:00.000
82,83,2019-10-15 20:30:00,0,0.7,0,0,24.0,134,101,0.0,2019-10-15 16:30:00.000
83,84,2019-10-15 20:45:00,0,0.6,0,0,23.9,138,101,0.0,2019-10-15 16:45:00.000
84,85,2019-10-15 21:00:00,0,0.5,0,0,23.9,142,102,0.0,2019-10-15 17:00:00.000
85,86,2019-10-15 21:15:00,0,0.5,0,0,23.8,145,103,0.0,2019-10-15 17:15:00.000
86,87,2019-10-15 21:30:00,0,0.5,0,0,23.7,149,105,0.0,2019-10-15 17:30:00.000
87,88,2019-10-15 21:45:00,0,0.5,0,0,23.7,153,106,0.0,2019-10-15 17:45:00.000
88,89,2019-10-15 22:00:00,0,0.5,0,0,23.6,156,109,0.0,2019-10-15 18:00:00.000
89,90,2019-10-15 22:15:00,0,0.5,0,0,23.5,160,112,0.0,2019-10-15 18:15:00.000
90,91,2019-10-15 22:30:00,0,0.5,0,0,23.5,163,116,0.0,2019-10-15 18:30:00.000
91,92,2019-10-15 22:45:00,0,0.6,0,0,23.4,166,123,0.0,2019-10-15 18:45:00.000
92,93,2019-10-15 23:00:00,0,0.6,0,0,23.4,169,134,0.0,2019-10-15 19:00:00.000
93,94,2019-10-15 23:15:00,0,0.6,0,0,23.3,171,152,0.0,2019-10-15 19:15:00.000
94,95,2019-10-15 23:30:00,0,0.6,0,0,23.3,172,178,0.0,2019-10-15 19:30:00.000
95,96,2019-10-15 23:45:00,0,0.5,0,0,23.2,172,-156,0.0,2019-10-15 19:45:00.000
