,BLOCK_ID,DATA_DATETIME,GHI,WIND_SPEED,DNI,DHI,TEMPERATURE,ZENITH,AZIMUTH,CLOUD_OPACITY,ENTRY_TIME
0,1,2020-09-14 00:00:00,0,1.1,0,0,22.8,174,-45,70.4,2020-09-13 20:00:00.000
1,2,2020-09-14 00:15:00,0,1.2,0,0,22.8,170,-62,66.0,2020-09-13 20:15:00.000
2,3,2020-09-14 00:30:00,0,1.2,0,0,22.8,167,-70,66.0,2020-09-13 20:30:00.000
3,4,2020-09-14 00:45:00,0,1.2,0,0,22.7,163,-74,53.0,2020-09-13 20:45:00.000
4,5,2020-09-14 01:00:00,0,1.2,0,0,22.7,160,-77,46.8,2020-09-13 21:00:00.000
5,6,2020-09-14 01:15:00,0,1.3,0,0,22.8,156,-79,61.9,2020-09-13 21:15:00.000
6,7,2020-09-14 01:30:00,0,1.3,0,0,22.8,153,-80,64.0,2020-09-13 21:30:00.000
7,8,2020-09-14 01:45:00,0,1.4,0,0,22.9,149,-82,65.8,2020-09-13 21:45:00.000
8,9,2020-09-14 02:00:00,0,1.5,0,0,22.9,145,-82,60.6,2020-09-13 22:00:00.000
9,10,2020-09-14 02:15:00,0,1.5,0,0,22.9,141,-83,54.5,2020-09-13 22:15:00.000
10,11,2020-09-14 02:30:00,0,1.6,0,0,22.9,138,-84,53.4,2020-09-13 22:30:00.000
11,12,2020-09-14 02:45:00,0,1.6,0,0,22.8,134,-84,58.3,2020-09-13 22:45:00.000
12,13,2020-09-14 03:00:00,0,1.6,0,0,22.8,130,-84,61.4,2020-09-13 23:00:00.000
13,14,2020-09-14 03:15:00,0,1.7,0,0,22.8,126,-85,61.4,2020-09-13 23:15:00.000
14,15,2020-09-14 03:30:00,0,1.7,0,0,22.8,123,-85,64.0,2020-09-13 23:30:00.000
15,16,2020-09-14 03:45:00,0,1.7,0,0,22.8,119,-85,63.8,2020-09-13 23:45:00.000
16,17,2020-09-14 04:00:00,0,1.8,0,0,22.8,115,-86,55.4,2020-09-14 00:00:00.000
17,18,2020-09-14 04:15:00,0,1.8,0,0,22.8,112,-86,46.5,2020-09-14 00:15:00.000
18,19,2020-09-14 04:30:00,0,1.7,0,0,22.8,108,-86,42.2,2020-09-14 00:30:00.000
19,20,2020-09-14 04:45:00,0,1.7,0,0,22.7,104,-86,47.7,2020-09-14 00:45:00.000
20,21,2020-09-14 05:00:00,0,1.7,0,0,22.7,100,-86,20.6,2020-09-14 01:00:00.000
21,22,2020-09-14 05:15:00,0,1.7,0,0,22.7,97,-86,14.6,2020-09-14 01:15:00.000
22,23,2020-09-14 05:30:00,0,1.7,0,0,22.7,93,-86,32.8,2020-09-14 01:30:00.000
23,24,2020-09-14 05:45:00,6,1.7,0,6,22.7,89,-86,28.5,2020-09-14 01:45:00.000
24,25,2020-09-14 06:00:00,33,1.7,0,33,22.8,85,-86,22.8,2020-09-14 02:00:00.000
25,26,2020-09-14 06:15:00,67,1.8,0,67,23.1,82,-86,26.7,2020-09-14 02:15:00.000
26,27,2020-09-14 06:30:00,95,2.0,0,95,23.4,78,-86,35.4,2020-09-14 02:30:00.000
27,28,2020-09-14 06:45:00,128,2.1,0,128,23.8,74,-86,37.9,2020-09-14 02:45:00.000
28,29,2020-09-14 07:00:00,152,2.2,0,152,24.1,70,-86,43.2,2020-09-14 03:00:00.000
29,30,2020-09-14 07:15:00,194,2.3,0,194,24.6,67,-86,41.2,2020-09-14 03:15:00.000
30,31,2020-09-14 07:30:00,213,2.3,0,213,25.1,63,-86,45.6,2020-09-14 03:30:00.000
31,32,2020-09-14 07:45:00,235,2.4,0,235,25.5,59,-86,47.8,2020-09-14 03:45:00.000
32,33,2020-09-14 08:00:00,196,2.5,0,196,26.0,55,-86,61.6,2020-09-14 04:00:00.000
33,34,2020-09-14 08:15:00,121,2.5,0,121,26.4,52,-86,79.3,2020-09-14 04:15:00.000
34,35,2020-09-14 08:30:00,390,2.6,25,373,26.8,48,-86,37.6,2020-09-14 04:30:00.000
35,36,2020-09-14 08:45:00,392,2.6,16,380,27.3,44,-85,42.1,2020-09-14 04:45:00.000
36,37,2020-09-14 09:00:00,607,2.7,396,304,27.6,40,-85,16.2,2020-09-14 05:00:00.000
37,38,2020-09-14 09:15:00,768,2.8,822,108,27.9,37,-85,0.0,2020-09-14 05:15:00.000
38,39,2020-09-14 09:30:00,777,2.9,713,179,28.1,33,-84,4.0,2020-09-14 05:30:00.000
39,40,2020-09-14 09:45:00,741,3.0,493,312,28.3,29,-84,12.4,2020-09-14 05:45:00.000
40,41,2020-09-14 10:00:00,743,3.1,416,367,28.5,25,-83,15.6,2020-09-14 06:00:00.000
41,42,2020-09-14 10:15:00,765,3.1,415,380,28.6,22,-82,15.8,2020-09-14 06:15:00.000
42,43,2020-09-14 10:30:00,812,3.2,486,350,28.8,18,-80,13.0,2020-09-14 06:30:00.000
43,44,2020-09-14 10:45:00,855,3.3,559,314,28.9,14,-77,10.3,2020-09-14 06:45:00.000
44,45,2020-09-14 11:00:00,889,3.3,617,283,29.0,11,-73,8.2,2020-09-14 07:00:00.000
45,46,2020-09-14 11:15:00,917,3.4,675,248,29.0,7,-64,6.3,2020-09-14 07:15:00.000
46,47,2020-09-14 11:30:00,985,3.4,861,126,29.1,4,-41,0.0,2020-09-14 07:30:00.000
47,48,2020-09-14 11:45:00,894,3.5,592,303,29.2,3,16,9.3,2020-09-14 07:45:00.000
48,49,2020-09-14 12:00:00,744,3.5,233,513,29.2,6,56,24.2,2020-09-14 08:00:00.000
49,50,2020-09-14 12:15:00,876,3.5,570,313,29.2,9,70,10.0,2020-09-14 08:15:00.000
50,51,2020-09-14 12:30:00,874,3.4,594,295,29.3,13,76,9.0,2020-09-14 08:30:00.000
51,52,2020-09-14 12:45:00,942,3.4,851,125,29.3,16,79,0.0,2020-09-14 08:45:00.000
52,53,2020-09-14 13:00:00,920,3.3,847,124,29.3,20,81,0.0,2020-09-14 09:00:00.000
53,54,2020-09-14 13:15:00,893,3.1,841,123,29.2,24,82,0.0,2020-09-14 09:15:00.000
54,55,2020-09-14 13:30:00,862,2.9,835,121,29.2,27,83,0.0,2020-09-14 09:30:00.000
55,56,2020-09-14 13:45:00,827,2.7,827,119,29.2,31,84,0.0,2020-09-14 09:45:00.000
56,57,2020-09-14 14:00:00,787,2.6,817,117,29.1,35,85,0.0,2020-09-14 10:00:00.000
57,58,2020-09-14 14:15:00,744,2.6,806,114,29.0,39,85,0.0,2020-09-14 10:15:00.000
58,59,2020-09-14 14:30:00,697,2.6,793,111,28.9,42,85,0.0,2020-09-14 10:30:00.000
59,60,2020-09-14 14:45:00,647,2.6,778,107,28.8,46,86,0.0,2020-09-14 10:45:00.000
60,61,2020-09-14 15:00:00,594,2.5,761,103,28.7,50,86,0.0,2020-09-14 11:00:00.000
61,62,2020-09-14 15:15:00,538,2.4,740,98,28.5,54,86,0.0,2020-09-14 11:15:00.000
62,63,2020-09-14 15:30:00,480,2.3,715,93,28.3,57,86,0.0,2020-09-14 11:30:00.000
63,64,2020-09-14 15:45:00,420,2.2,685,88,28.1,61,86,0.0,2020-09-14 11:45:00.000
64,65,2020-09-14 16:00:00,359,2.1,648,82,27.8,65,86,0.0,2020-09-14 12:00:00.000
65,66,2020-09-14 16:15:00,290,1.9,542,89,27.4,68,86,2.7,2020-09-14 12:15:00.000
66,67,2020-09-14 16:30:00,187,1.8,143,141,27.1,72,86,21.0,2020-09-14 12:30:00.000
67,68,2020-09-14 16:45:00,136,1.7,106,109,26.7,76,86,22.5,2020-09-14 12:45:00.000
68,69,2020-09-14 17:00:00,82,1.6,0,82,26.3,80,86,29.0,2020-09-14 13:00:00.000
69,70,2020-09-14 17:15:00,46,1.6,12,45,25.7,83,86,26.0,2020-09-14 13:15:00.000
70,71,2020-09-14 17:30:00,14,1.6,8,14,25.1,87,86,41.6,2020-09-14 13:30:00.000
71,72,2020-09-14 17:45:00,0,1.6,0,0,24.5,91,86,55.8,2020-09-14 13:45:00.000
72,73,2020-09-14 18:00:00,0,1.6,0,0,24.0,95,86,46.4,2020-09-14 14:00:00.000
73,74,2020-09-14 18:15:00,0,1.7,0,0,23.8,98,86,19.7,2020-09-14 14:15:00.000
74,75,2020-09-14 18:30:00,0,1.7,0,0,23.7,102,86,47.8,2020-09-14 14:30:00.000
75,76,2020-09-14 18:45:00,0,1.8,0,0,23.5,106,86,56.7,2020-09-14 14:45:00.000
76,77,2020-09-14 19:00:00,0,1.8,0,0,23.4,110,86,60.6,2020-09-14 15:00:00.000
77,78,2020-09-14 19:15:00,0,1.9,0,0,23.4,113,86,57.5,2020-09-14 15:15:00.000
78,79,2020-09-14 19:30:00,0,1.9,0,0,23.5,117,86,47.6,2020-09-14 15:30:00.000
79,80,2020-09-14 19:45:00,0,1.9,0,0,23.5,121,86,47.9,2020-09-14 15:45:00.000
80,81,2020-09-14 20:00:00,0,1.9,0,0,23.5,125,85,46.0,2020-09-14 16:00:00.000
81,82,2020-09-14 20:15:00,0,1.9,0,0,23.5,128,85,48.6,2020-09-14 16:15:00.000
82,83,2020-09-14 20:30:00,0,1.9,0,0,23.4,132,85,54.0,2020-09-14 16:30:00.000
83,84,2020-09-14 20:45:00,0,1.9,0,0,23.4,136,84,55.7,2020-09-14 16:45:00.000
84,85,2020-09-14 21:00:00,0,1.9,0,0,23.3,140,84,54.8,2020-09-14 17:00:00.000
85,86,2020-09-14 21:15:00,0,1.9,0,0,23.3,143,83,57.9,2020-09-14 17:15:00.000
86,87,2020-09-14 21:30:00,0,1.9,0,0,23.3,147,83,85.6,2020-09-14 17:30:00.000
87,88,2020-09-14 21:45:00,0,1.9,0,0,23.3,151,82,85.4,2020-09-14 17:45:00.000
88,89,2020-09-14 22:00:00,0,1.9,0,0,23.3,154,81,87.8,2020-09-14 18:00:00.000
89,90,2020-09-14 22:15:00,0,1.9,0,0,23.3,158,79,89.7,2020-09-14 18:15:00.000
90,91,2020-09-14 22:30:00,0,1.9,0,0,23.3,162,77,86.6,2020-09-14 18:30:00.000
91,92,2020-09-14 22:45:00,0,1.9,0,0,23.3,165,73,94.1,2020-09-14 18:45:00.000
92,93,2020-09-14 23:00:00,0,1.9,0,0,23.3,169,68,81.8,2020-09-14 19:00:00.000
93,94,2020-09-14 23:15:00,0,1.9,0,0,23.3,172,57,85.0,2020-09-14 19:15:00.000
94,95,2020-09-14 23:30:00,0,1.9,0,0,23.3,175,33,74.6,2020-09-14 19:30:00.000
95,96,2020-09-14 23:45:00,0,1.9,0,0,23.3,176,-12,68.4,2020-09-14 19:45:00.000
