,BLOCK_ID,DATA_DATETIME,GHI,WIND_SPEED,DNI,DHI,TEMPERATURE,ZENITH,AZIMUTH,CLOUD_OPACITY,ENTRY_TIME
0,1,2019-02-23 00:00:00,0,5.5,0,0,26.8,170,-179,0.0,2019-02-22 20:00:00.000
1,2,2019-02-23 00:15:00,0,5.5,0,0,26.7,169,-159,0.0,2019-02-22 20:15:00.000
2,3,2019-02-23 00:30:00,0,5.5,0,0,26.7,167,-143,0.0,2019-02-22 20:30:00.000
3,4,2019-02-23 00:45:00,0,5.5,0,0,26.6,165,-132,0.0,2019-02-22 20:45:00.000
4,5,2019-02-23 01:00:00,0,5.6,0,0,26.6,162,-124,0.0,2019-02-22 21:00:00.000
5,6,2019-02-23 01:15:00,0,5.6,0,0,26.5,159,-119,0.0,2019-02-22 21:15:00.000
6,7,2019-02-23 01:30:00,0,5.6,0,0,26.5,155,-115,0.0,2019-02-22 21:30:00.000
7,8,2019-02-23 01:45:00,0,5.6,0,0,26.4,152,-112,0.0,2019-02-22 21:45:00.000
8,9,2019-02-23 02:00:00,0,5.7,0,0,26.4,148,-109,0.0,2019-02-22 22:00:00.000
9,10,2019-02-23 02:15:00,0,5.7,0,0,26.4,145,-108,0.0,2019-02-22 22:15:00.000
10,11,2019-02-23 02:30:00,0,5.7,0,0,26.3,141,-106,0.0,2019-02-22 22:30:00.000
11,12,2019-02-23 02:45:00,0,5.7,0,0,26.3,138,-105,0.0,2019-02-22 22:45:00.000
12,13,2019-02-23 03:00:00,0,5.7,0,0,26.3,134,-104,0.0,2019-02-22 23:00:00.000
13,14,2019-02-23 03:15:00,0,5.7,0,0,26.2,130,-103,0.0,2019-02-22 23:15:00.000
14,15,2019-02-23 03:30:00,0,5.7,0,0,26.2,127,-103,0.0,2019-02-22 23:30:00.000
15,16,2019-02-23 03:45:00,0,5.7,0,0,26.2,123,-102,0.0,2019-02-22 23:45:00.000
16,17,2019-02-23 04:00:00,0,5.8,0,0,26.1,119,-102,0.0,2019-02-23 00:00:00.000
17,18,2019-02-23 04:15:00,0,5.8,0,0,26.1,116,-101,0.0,2019-02-23 00:15:00.000
18,19,2019-02-23 04:30:00,0,5.8,0,0,26.1,112,-101,0.0,2019-02-23 00:30:00.000
19,20,2019-02-23 04:45:00,0,5.8,0,0,26.0,108,-101,0.0,2019-02-23 00:45:00.000
20,21,2019-02-23 05:00:00,0,5.8,0,0,26.0,105,-101,15.9,2019-02-23 01:00:00.000
21,22,2019-02-23 05:15:00,0,5.6,0,0,26.2,101,-101,40.7,2019-02-23 01:15:00.000
22,23,2019-02-23 05:30:00,0,5.5,0,0,26.3,97,-101,50.7,2019-02-23 01:30:00.000
23,24,2019-02-23 05:45:00,0,5.4,0,0,26.4,94,-100,48.1,2019-02-23 01:45:00.000
24,25,2019-02-23 06:00:00,1,5.3,0,1,26.5,90,-101,33.8,2019-02-23 02:00:00.000
25,26,2019-02-23 06:15:00,21,5.1,0,21,26.6,86,-101,34.7,2019-02-23 02:15:00.000
26,27,2019-02-23 06:30:00,56,5.0,0,56,26.7,83,-101,29.5,2019-02-23 02:30:00.000
27,28,2019-02-23 06:45:00,117,4.9,164,84,26.8,79,-101,14.1,2019-02-23 02:45:00.000
28,29,2019-02-23 07:00:00,194,4.7,473,72,27.0,75,-101,1.9,2019-02-23 03:00:00.000
29,30,2019-02-23 07:15:00,261,4.6,583,76,27.1,72,-101,0.0,2019-02-23 03:15:00.000
30,31,2019-02-23 07:30:00,325,4.5,640,84,27.2,68,-102,0.0,2019-02-23 03:30:00.000
31,32,2019-02-23 07:45:00,390,4.4,686,92,27.3,64,-102,0.0,2019-02-23 03:45:00.000
32,33,2019-02-23 08:00:00,454,4.2,724,98,27.4,61,-102,0.0,2019-02-23 04:00:00.000
33,34,2019-02-23 08:15:00,516,4.2,755,103,27.3,57,-103,0.0,2019-02-23 04:15:00.000
34,35,2019-02-23 08:30:00,576,4.1,781,108,27.2,53,-104,0.0,2019-02-23 04:30:00.000
35,36,2019-02-23 08:45:00,623,4.1,758,134,27.2,50,-104,1.5,2019-02-23 04:45:00.000
36,37,2019-02-23 09:00:00,682,4.0,791,131,27.1,46,-105,1.0,2019-02-23 05:00:00.000
37,38,2019-02-23 09:15:00,740,3.9,838,121,27.0,42,-106,0.0,2019-02-23 05:15:00.000
38,39,2019-02-23 09:30:00,788,3.9,851,125,26.9,39,-108,0.0,2019-02-23 05:30:00.000
39,40,2019-02-23 09:45:00,833,3.8,863,128,26.9,35,-109,0.0,2019-02-23 05:45:00.000
40,41,2019-02-23 10:00:00,873,3.8,873,130,26.8,32,-111,0.0,2019-02-23 06:00:00.000
41,42,2019-02-23 10:15:00,909,3.7,881,133,26.7,28,-114,0.0,2019-02-23 06:15:00.000
42,43,2019-02-23 10:30:00,940,3.7,886,136,26.6,25,-117,0.0,2019-02-23 06:30:00.000
43,44,2019-02-23 10:45:00,966,3.6,885,143,26.6,22,-121,0.0,2019-02-23 06:45:00.000
44,45,2019-02-23 11:00:00,987,3.6,882,150,26.5,18,-127,0.0,2019-02-23 07:00:00.000
45,46,2019-02-23 11:15:00,1003,3.5,878,157,26.5,16,-135,0.0,2019-02-23 07:15:00.000
46,47,2019-02-23 11:30:00,1014,3.5,875,162,26.6,13,-147,0.0,2019-02-23 07:30:00.000
47,48,2019-02-23 11:45:00,1022,3.5,877,163,26.6,12,-162,0.0,2019-02-23 07:45:00.000
48,49,2019-02-23 12:00:00,1024,3.4,879,162,26.6,11,179,0.0,2019-02-23 08:00:00.000
49,50,2019-02-23 12:15:00,1022,3.4,879,161,26.6,12,161,0.0,2019-02-23 08:15:00.000
50,51,2019-02-23 12:30:00,1014,3.4,878,160,26.7,13,146,0.0,2019-02-23 08:30:00.000
51,52,2019-02-23 12:45:00,1001,3.4,876,159,26.7,16,135,0.0,2019-02-23 08:45:00.000
52,53,2019-02-23 13:00:00,984,3.3,872,158,26.7,19,127,0.0,2019-02-23 09:00:00.000
53,54,2019-02-23 13:15:00,961,3.3,867,156,26.7,22,121,0.0,2019-02-23 09:15:00.000
54,55,2019-02-23 13:30:00,928,3.3,841,166,26.8,25,117,0.6,2019-02-23 09:30:00.000
55,56,2019-02-23 13:45:00,896,3.3,831,165,26.8,28,114,0.7,2019-02-23 09:45:00.000
56,57,2019-02-23 14:00:00,807,3.3,639,264,26.8,32,111,6.7,2019-02-23 10:00:00.000
57,58,2019-02-23 14:15:00,824,3.3,830,148,26.8,35,109,0.0,2019-02-23 10:15:00.000
58,59,2019-02-23 14:30:00,779,3.4,816,145,26.8,39,107,0.0,2019-02-23 10:30:00.000
59,60,2019-02-23 14:45:00,719,3.4,752,166,26.8,43,106,1.6,2019-02-23 10:45:00.000
60,61,2019-02-23 15:00:00,632,3.4,586,226,26.8,46,105,6.9,2019-02-23 11:00:00.000
61,62,2019-02-23 15:15:00,587,3.5,598,202,26.8,50,104,5.8,2019-02-23 11:15:00.000
62,63,2019-02-23 15:30:00,564,3.5,731,129,26.9,53,103,0.3,2019-02-23 11:30:00.000
63,64,2019-02-23 15:45:00,506,3.6,711,120,26.9,57,103,0.0,2019-02-23 11:45:00.000
64,65,2019-02-23 16:00:00,440,3.6,657,119,26.9,61,102,0.7,2019-02-23 12:00:00.000
65,66,2019-02-23 16:15:00,348,3.7,426,163,26.9,64,102,8.5,2019-02-23 12:15:00.000
66,67,2019-02-23 16:30:00,257,3.7,181,188,26.9,68,101,18.8,2019-02-23 12:30:00.000
67,68,2019-02-23 16:45:00,196,3.8,93,167,26.9,72,101,22.0,2019-02-23 12:45:00.000
68,69,2019-02-23 17:00:00,139,3.8,21,133,26.9,75,101,26.4,2019-02-23 13:00:00.000
69,70,2019-02-23 17:15:00,97,3.7,3,97,26.9,79,101,23.5,2019-02-23 13:15:00.000
70,71,2019-02-23 17:30:00,55,3.7,2,54,26.9,83,101,25.4,2019-02-23 13:30:00.000
71,72,2019-02-23 17:45:00,18,3.7,0,18,26.8,87,100,38.8,2019-02-23 13:45:00.000
72,73,2019-02-23 18:00:00,1,3.7,0,1,26.8,90,100,52.8,2019-02-23 14:00:00.000
73,74,2019-02-23 18:15:00,0,3.6,0,0,26.8,94,100,52.6,2019-02-23 14:15:00.000
74,75,2019-02-23 18:30:00,0,3.6,0,0,26.8,98,100,52.0,2019-02-23 14:30:00.000
75,76,2019-02-23 18:45:00,0,3.6,0,0,26.7,101,100,36.4,2019-02-23 14:45:00.000
76,77,2019-02-23 19:00:00,0,3.5,0,0,26.7,105,101,0.0,2019-02-23 15:00:00.000
77,78,2019-02-23 19:15:00,0,3.5,0,0,26.7,109,101,0.0,2019-02-23 15:15:00.000
78,79,2019-02-23 19:30:00,0,3.5,0,0,26.6,112,101,0.0,2019-02-23 15:30:00.000
79,80,2019-02-23 19:45:00,0,3.4,0,0,26.6,116,101,0.0,2019-02-23 15:45:00.000
80,81,2019-02-23 20:00:00,0,3.4,0,0,26.6,120,102,0.0,2019-02-23 16:00:00.000
81,82,2019-02-23 20:15:00,0,3.5,0,0,26.6,123,102,0.0,2019-02-23 16:15:00.000
82,83,2019-02-23 20:30:00,0,3.6,0,0,26.6,127,102,0.0,2019-02-23 16:30:00.000
83,84,2019-02-23 20:45:00,0,3.7,0,0,26.6,131,103,0.0,2019-02-23 16:45:00.000
84,85,2019-02-23 21:00:00,0,3.8,0,0,26.6,134,104,0.0,2019-02-23 17:00:00.000
85,86,2019-02-23 21:15:00,0,3.9,0,0,26.6,138,105,0.0,2019-02-23 17:15:00.000
86,87,2019-02-23 21:30:00,0,4.0,0,0,26.7,142,106,0.0,2019-02-23 17:30:00.000
87,88,2019-02-23 21:45:00,0,4.2,0,0,26.7,145,107,0.0,2019-02-23 17:45:00.000
88,89,2019-02-23 22:00:00,0,4.3,0,0,26.7,149,109,0.0,2019-02-23 18:00:00.000
89,90,2019-02-23 22:15:00,0,4.4,0,0,26.7,152,111,0.0,2019-02-23 18:15:00.000
90,91,2019-02-23 22:30:00,0,4.5,0,0,26.7,156,114,0.0,2019-02-23 18:30:00.000
91,92,2019-02-23 22:45:00,0,4.6,0,0,26.7,159,118,0.0,2019-02-23 18:45:00.000
92,93,2019-02-23 23:00:00,0,4.7,0,0,26.7,162,124,0.0,2019-02-23 19:00:00.000
93,94,2019-02-23 23:15:00,0,4.7,0,0,26.6,165,132,0.0,2019-02-23 19:15:00.000
94,95,2019-02-23 23:30:00,0,4.8,0,0,26.6,168,143,0.0,2019-02-23 19:30:00.000
95,96,2019-02-23 23:45:00,0,4.8,0,0,26.6,170,160,0.0,2019-02-23 19:45:00.000
