,BLOCK_ID,DATA_DATETIME,GHI,WIND_SPEED,DNI,DHI,TEMPERATURE,ZENITH,AZIMUTH,CLOUD_OPACITY,ENTRY_TIME
0,1,2021-07-06 00:00:00,0,0.9,0,0,22.8,156,-6,58.4,2021-07-05 20:00:00.000
1,2,2021-07-06 00:15:00,0,1.0,0,0,22.8,156,-14,84.2,2021-07-05 20:15:00.000
2,3,2021-07-06 00:30:00,0,1.0,0,0,22.8,155,-22,79.2,2021-07-05 20:30:00.000
3,4,2021-07-06 00:45:00,0,1.0,0,0,22.8,153,-29,79.2,2021-07-05 20:45:00.000
4,5,2021-07-06 01:00:00,0,1.0,0,0,22.8,151,-35,86.0,2021-07-05 21:00:00.000
5,6,2021-07-06 01:15:00,0,0.9,0,0,22.8,149,-40,78.4,2021-07-05 21:15:00.000
6,7,2021-07-06 01:30:00,0,0.9,0,0,22.8,146,-44,80.2,2021-07-05 21:30:00.000
7,8,2021-07-06 01:45:00,0,0.9,0,0,22.7,143,-48,85.3,2021-07-05 21:45:00.000
8,9,2021-07-06 02:00:00,0,0.9,0,0,22.7,141,-51,85.2,2021-07-05 22:00:00.000
9,10,2021-07-06 02:15:00,0,0.8,0,0,22.7,138,-54,82.1,2021-07-05 22:15:00.000
10,11,2021-07-06 02:30:00,0,0.7,0,0,22.6,134,-56,66.4,2021-07-05 22:30:00.000
11,12,2021-07-06 02:45:00,0,0.6,0,0,22.5,131,-58,61.3,2021-07-05 22:45:00.000
12,13,2021-07-06 03:00:00,0,0.5,0,0,22.5,128,-60,37.6,2021-07-05 23:00:00.000
13,14,2021-07-06 03:15:00,0,0.4,0,0,22.5,125,-61,20.4,2021-07-05 23:15:00.000
14,15,2021-07-06 03:30:00,0,0.2,0,0,22.5,122,-62,36.6,2021-07-05 23:30:00.000
15,16,2021-07-06 03:45:00,0,0.1,0,0,22.5,118,-63,18.7,2021-07-05 23:45:00.000
16,17,2021-07-06 04:00:00,0,0.1,0,0,22.5,115,-64,16.4,2021-07-06 00:00:00.000
17,18,2021-07-06 04:15:00,0,0.1,0,0,22.5,111,-65,15.7,2021-07-06 00:15:00.000
18,19,2021-07-06 04:30:00,0,0.2,0,0,22.5,108,-66,15.0,2021-07-06 00:30:00.000
19,20,2021-07-06 04:45:00,0,0.3,0,0,22.6,105,-66,17.4,2021-07-06 00:45:00.000
20,21,2021-07-06 05:00:00,0,0.4,0,0,22.6,101,-67,16.0,2021-07-06 01:00:00.000
21,22,2021-07-06 05:15:00,0,0.4,0,0,22.5,98,-67,15.3,2021-07-06 01:15:00.000
22,23,2021-07-06 05:30:00,0,0.5,0,0,22.5,94,-67,15.7,2021-07-06 01:30:00.000
23,24,2021-07-06 05:45:00,1,0.5,0,1,22.4,91,-67,40.6,2021-07-06 01:45:00.000
24,25,2021-07-06 06:00:00,16,0.5,0,16,22.4,87,-67,22.6,2021-07-06 02:00:00.000
25,26,2021-07-06 06:15:00,52,0.4,103,39,22.7,84,-67,14.0,2021-07-06 02:15:00.000
26,27,2021-07-06 06:30:00,86,0.3,113,69,22.9,81,-67,17.6,2021-07-06 02:30:00.000
27,28,2021-07-06 06:45:00,125,0.3,107,99,23.1,77,-67,21.4,2021-07-06 02:45:00.000
28,29,2021-07-06 07:00:00,174,0.3,191,120,23.5,74,-66,17.8,2021-07-06 03:00:00.000
29,30,2021-07-06 07:15:00,203,0.2,122,162,24.0,70,-66,23.8,2021-07-06 03:15:00.000
30,31,2021-07-06 07:30:00,272,0.2,287,157,24.5,67,-65,16.0,2021-07-06 03:30:00.000
31,32,2021-07-06 07:45:00,339,0.3,435,146,25.0,63,-65,9.9,2021-07-06 03:45:00.000
32,33,2021-07-06 08:00:00,314,0.4,117,256,25.5,60,-64,27.0,2021-07-06 04:00:00.000
33,34,2021-07-06 08:15:00,314,0.4,29,297,26.0,57,-63,35.1,2021-07-06 04:15:00.000
34,35,2021-07-06 08:30:00,456,0.6,386,223,26.4,53,-62,14.6,2021-07-06 04:30:00.000
35,36,2021-07-06 08:45:00,553,0.7,633,148,26.9,50,-60,4.6,2021-07-06 04:45:00.000
36,37,2021-07-06 09:00:00,619,0.9,742,111,27.3,47,-59,1.2,2021-07-06 05:00:00.000
37,38,2021-07-06 09:15:00,668,1.1,788,99,27.6,44,-57,0.0,2021-07-06 05:15:00.000
38,39,2021-07-06 09:30:00,662,1.3,620,192,27.9,41,-54,6.4,2021-07-06 05:30:00.000
39,40,2021-07-06 09:45:00,650,1.4,466,281,28.2,38,-51,12.6,2021-07-06 05:45:00.000
40,41,2021-07-06 10:00:00,698,1.6,538,256,28.3,35,-48,10.0,2021-07-06 06:00:00.000
41,42,2021-07-06 10:15:00,735,1.6,579,245,28.3,32,-44,8.6,2021-07-06 06:15:00.000
42,43,2021-07-06 10:30:00,693,1.7,391,353,28.2,30,-40,16.4,2021-07-06 06:30:00.000
43,44,2021-07-06 10:45:00,751,1.8,508,299,28.1,27,-34,11.6,2021-07-06 06:45:00.000
44,45,2021-07-06 11:00:00,851,1.8,788,139,28.0,25,-28,1.6,2021-07-06 07:00:00.000
45,46,2021-07-06 11:15:00,842,1.8,716,187,27.9,24,-20,4.0,2021-07-06 07:15:00.000
46,47,2021-07-06 11:30:00,814,1.8,606,255,27.8,23,-12,8.0,2021-07-06 07:30:00.000
47,48,2021-07-06 11:45:00,760,1.8,440,352,27.7,22,-3,14.5,2021-07-06 07:45:00.000
48,49,2021-07-06 12:00:00,700,1.8,288,434,27.6,22,6,21.2,2021-07-06 08:00:00.000
49,50,2021-07-06 12:15:00,821,1.8,639,234,27.5,23,15,7.0,2021-07-06 08:15:00.000
50,51,2021-07-06 12:30:00,734,1.7,418,353,27.4,24,23,16.0,2021-07-06 08:30:00.000
51,52,2021-07-06 12:45:00,761,1.7,513,300,27.3,26,30,11.5,2021-07-06 08:45:00.000
52,53,2021-07-06 13:00:00,795,1.6,668,206,27.1,28,36,5.6,2021-07-06 09:00:00.000
53,54,2021-07-06 13:15:00,619,1.5,216,433,26.9,30,41,24.5,2021-07-06 09:15:00.000
54,55,2021-07-06 13:30:00,748,1.4,667,190,26.7,33,46,5.8,2021-07-06 09:30:00.000
55,56,2021-07-06 13:45:00,702,1.3,581,229,26.5,36,49,8.3,2021-07-06 09:45:00.000
56,57,2021-07-06 14:00:00,718,1.2,758,127,26.3,39,52,1.8,2021-07-06 10:00:00.000
57,58,2021-07-06 14:15:00,695,1.2,800,97,26.3,42,55,0.0,2021-07-06 10:15:00.000
58,59,2021-07-06 14:30:00,655,1.2,789,94,26.2,45,57,0.0,2021-07-06 10:30:00.000
59,60,2021-07-06 14:45:00,538,1.1,459,231,26.2,48,59,12.0,2021-07-06 10:45:00.000
60,61,2021-07-06 15:00:00,431,1.1,204,301,26.2,51,61,24.0,2021-07-06 11:00:00.000
61,62,2021-07-06 15:15:00,426,1.0,317,243,26.2,54,62,17.5,2021-07-06 11:15:00.000
62,63,2021-07-06 15:30:00,387,0.9,311,220,26.1,58,63,17.2,2021-07-06 11:30:00.000
63,64,2021-07-06 15:45:00,278,0.9,41,257,26.1,61,64,33.1,2021-07-06 11:45:00.000
64,65,2021-07-06 16:00:00,229,0.8,0,229,26.1,65,65,36.4,2021-07-06 12:00:00.000
65,66,2021-07-06 16:15:00,173,0.7,0,173,25.9,68,66,43.7,2021-07-06 12:15:00.000
66,67,2021-07-06 16:30:00,177,0.7,107,144,25.8,71,66,28.4,2021-07-06 12:30:00.000
67,68,2021-07-06 16:45:00,147,0.6,85,124,25.7,75,66,24.9,2021-07-06 12:45:00.000
68,69,2021-07-06 17:00:00,106,0.6,48,96,25.5,78,67,25.4,2021-07-06 13:00:00.000
69,70,2021-07-06 17:15:00,76,0.5,126,58,25.1,82,67,16.0,2021-07-06 13:15:00.000
70,71,2021-07-06 17:30:00,33,0.5,19,30,24.6,85,67,30.4,2021-07-06 13:30:00.000
71,72,2021-07-06 17:45:00,4,0.4,0,4,24.1,89,67,59.7,2021-07-06 13:45:00.000
72,73,2021-07-06 18:00:00,0,0.3,0,0,23.7,92,67,54.4,2021-07-06 14:00:00.000
73,74,2021-07-06 18:15:00,0,0.3,0,0,23.6,96,67,36.4,2021-07-06 14:15:00.000
74,75,2021-07-06 18:30:00,0,0.3,0,0,23.4,99,67,24.8,2021-07-06 14:30:00.000
75,76,2021-07-06 18:45:00,0,0.3,0,0,23.3,102,66,33.0,2021-07-06 14:45:00.000
76,77,2021-07-06 19:00:00,0,0.3,0,0,23.2,106,66,51.6,2021-07-06 15:00:00.000
77,78,2021-07-06 19:15:00,0,0.3,0,0,23.1,109,65,48.7,2021-07-06 15:15:00.000
78,79,2021-07-06 19:30:00,0,0.3,0,0,23.0,113,65,48.1,2021-07-06 15:30:00.000
79,80,2021-07-06 19:45:00,0,0.3,0,0,22.9,116,64,35.4,2021-07-06 15:45:00.000
80,81,2021-07-06 20:00:00,0,0.3,0,0,22.8,119,63,38.4,2021-07-06 16:00:00.000
81,82,2021-07-06 20:15:00,0,0.4,0,0,22.8,123,62,46.2,2021-07-06 16:15:00.000
82,83,2021-07-06 20:30:00,0,0.4,0,0,22.8,126,61,57.0,2021-07-06 16:30:00.000
83,84,2021-07-06 20:45:00,0,0.4,0,0,22.8,129,59,63.9,2021-07-06 16:45:00.000
84,85,2021-07-06 21:00:00,0,0.4,0,0,22.7,132,58,47.0,2021-07-06 17:00:00.000
85,86,2021-07-06 21:15:00,0,0.4,0,0,22.7,136,56,41.9,2021-07-06 17:15:00.000
86,87,2021-07-06 21:30:00,0,0.4,0,0,22.7,139,53,49.0,2021-07-06 17:30:00.000
87,88,2021-07-06 21:45:00,0,0.4,0,0,22.7,142,50,60.9,2021-07-06 17:45:00.000
88,89,2021-07-06 22:00:00,0,0.4,0,0,22.7,144,47,58.2,2021-07-06 18:00:00.000
89,90,2021-07-06 22:15:00,0,0.3,0,0,22.7,147,43,60.1,2021-07-06 18:15:00.000
90,91,2021-07-06 22:30:00,0,0.3,0,0,22.7,150,38,67.4,2021-07-06 18:30:00.000
91,92,2021-07-06 22:45:00,0,0.2,0,0,22.7,152,33,69.2,2021-07-06 18:45:00.000
92,93,2021-07-06 23:00:00,0,0.1,0,0,22.7,154,27,69.2,2021-07-06 19:00:00.000
93,94,2021-07-06 23:15:00,0,0.1,0,0,22.7,155,19,75.1,2021-07-06 19:15:00.000
94,95,2021-07-06 23:30:00,0,0.1,0,0,22.6,156,11,81.4,2021-07-06 19:30:00.000
95,96,2021-07-06 23:45:00,0,0.1,0,0,22.6,157,3,79.5,2021-07-06 19:45:00.000
