,BLOCK_ID,DATA_DATETIME,GHI,WIND_SPEED,DNI,DHI,TEMPERATURE,ZENITH,AZIMUTH,CLOUD_OPACITY,ENTRY_TIME
0,1,2020-03-09 00:00:00,0,1.1,0,0,23.1,176,-170,37.0,2020-03-08 20:00:00.000
1,2,2020-03-09 00:15:00,0,1.1,0,0,23.1,174,-135,37.0,2020-03-08 20:15:00.000
2,3,2020-03-09 00:30:00,0,1.2,0,0,23.0,171,-118,37.0,2020-03-08 20:30:00.000
3,4,2020-03-09 00:45:00,0,1.2,0,0,23.0,167,-110,37.0,2020-03-08 20:45:00.000
4,5,2020-03-09 01:00:00,0,1.2,0,0,23.0,164,-106,37.0,2020-03-08 21:00:00.000
5,6,2020-03-09 01:15:00,0,1.2,0,0,23.0,160,-103,37.0,2020-03-08 21:15:00.000
6,7,2020-03-09 01:30:00,0,1.1,0,0,23.1,156,-101,37.0,2020-03-08 21:30:00.000
7,8,2020-03-09 01:45:00,0,1.1,0,0,23.1,153,-100,25.9,2020-03-08 21:45:00.000
8,9,2020-03-09 02:00:00,0,1.1,0,0,23.2,149,-98,0.0,2020-03-08 22:00:00.000
9,10,2020-03-09 02:15:00,0,1.1,0,0,23.2,145,-98,0.0,2020-03-08 22:15:00.000
10,11,2020-03-09 02:30:00,0,1.1,0,0,23.2,142,-97,0.0,2020-03-08 22:30:00.000
11,12,2020-03-09 02:45:00,0,1.1,0,0,23.2,138,-97,0.0,2020-03-08 22:45:00.000
12,13,2020-03-09 03:00:00,0,1.1,0,0,23.2,134,-96,0.0,2020-03-08 23:00:00.000
13,14,2020-03-09 03:15:00,0,1.0,0,0,23.2,130,-96,0.0,2020-03-08 23:15:00.000
14,15,2020-03-09 03:30:00,0,1.0,0,0,23.3,127,-96,0.0,2020-03-08 23:30:00.000
15,16,2020-03-09 03:45:00,0,1.0,0,0,23.3,123,-95,0.0,2020-03-08 23:45:00.000
16,17,2020-03-09 04:00:00,0,0.9,0,0,23.3,119,-95,0.0,2020-03-09 00:00:00.000
17,18,2020-03-09 04:15:00,0,1.0,0,0,23.2,115,-95,0.0,2020-03-09 00:15:00.000
18,19,2020-03-09 04:30:00,0,1.0,0,0,23.1,112,-95,0.0,2020-03-09 00:30:00.000
19,20,2020-03-09 04:45:00,0,1.0,0,0,23.0,108,-95,0.0,2020-03-09 00:45:00.000
20,21,2020-03-09 05:00:00,0,1.0,0,0,23.0,104,-95,0.0,2020-03-09 01:00:00.000
21,22,2020-03-09 05:15:00,0,1.0,0,0,23.0,101,-95,15.6,2020-03-09 01:15:00.000
22,23,2020-03-09 05:30:00,0,1.0,0,0,22.9,97,-95,52.0,2020-03-09 01:30:00.000
23,24,2020-03-09 05:45:00,0,1.0,0,0,22.9,93,-95,57.0,2020-03-09 01:45:00.000
24,25,2020-03-09 06:00:00,3,1.0,0,3,23.0,89,-95,58.4,2020-03-09 02:00:00.000
25,26,2020-03-09 06:15:00,29,0.9,0,29,23.3,86,-95,35.9,2020-03-09 02:15:00.000
26,27,2020-03-09 06:30:00,80,0.9,118,62,23.6,82,-95,16.8,2020-03-09 02:30:00.000
27,28,2020-03-09 06:45:00,126,0.9,148,95,23.9,78,-95,18.4,2020-03-09 02:45:00.000
28,29,2020-03-09 07:00:00,178,0.9,193,125,24.3,74,-95,18.5,2020-03-09 03:00:00.000
29,30,2020-03-09 07:15:00,258,0.7,430,113,24.9,71,-95,9.0,2020-03-09 03:15:00.000
30,31,2020-03-09 07:30:00,303,0.6,379,156,25.6,67,-95,12.7,2020-03-09 03:30:00.000
31,32,2020-03-09 07:45:00,349,0.6,338,195,26.3,63,-96,15.7,2020-03-09 03:45:00.000
32,33,2020-03-09 08:00:00,463,0.5,678,116,26.9,59,-96,3.1,2020-03-09 04:00:00.000
33,34,2020-03-09 08:15:00,535,0.6,764,103,27.3,56,-96,0.9,2020-03-09 04:15:00.000
34,35,2020-03-09 08:30:00,597,0.7,801,103,27.8,52,-97,0.4,2020-03-09 04:30:00.000
35,36,2020-03-09 08:45:00,653,0.8,810,112,28.2,48,-97,0.6,2020-03-09 04:45:00.000
36,37,2020-03-09 09:00:00,711,0.9,846,108,28.7,44,-97,0.0,2020-03-09 05:00:00.000
37,38,2020-03-09 09:15:00,762,0.9,859,112,29.1,41,-98,0.0,2020-03-09 05:15:00.000
38,39,2020-03-09 09:30:00,810,0.9,871,115,29.5,37,-99,0.0,2020-03-09 05:30:00.000
39,40,2020-03-09 09:45:00,831,1.0,796,166,29.9,33,-100,2.6,2020-03-09 05:45:00.000
40,41,2020-03-09 10:00:00,892,0.9,882,125,30.2,30,-101,0.2,2020-03-09 06:00:00.000
41,42,2020-03-09 10:15:00,912,0.8,839,159,30.5,26,-102,1.8,2020-03-09 06:15:00.000
42,43,2020-03-09 10:30:00,887,0.7,662,275,30.7,22,-104,7.6,2020-03-09 06:30:00.000
43,44,2020-03-09 10:45:00,944,0.6,768,217,30.9,19,-107,4.1,2020-03-09 06:45:00.000
44,45,2020-03-09 11:00:00,962,0.5,761,228,31.0,15,-111,4.3,2020-03-09 07:00:00.000
45,46,2020-03-09 11:15:00,960,0.4,710,265,30.8,12,-118,5.9,2020-03-09 07:15:00.000
46,47,2020-03-09 11:30:00,980,0.4,736,253,30.5,9,-129,4.9,2020-03-09 07:30:00.000
47,48,2020-03-09 11:45:00,1034,0.4,884,155,30.3,6,-152,0.3,2020-03-09 07:45:00.000
48,49,2020-03-09 12:00:00,1030,0.4,867,167,30.0,6,171,0.8,2020-03-09 08:00:00.000
49,50,2020-03-09 12:15:00,1035,0.5,892,150,29.8,7,140,0.0,2020-03-09 08:15:00.000
50,51,2020-03-09 12:30:00,1026,0.6,890,149,29.6,10,123,0.0,2020-03-09 08:30:00.000
51,52,2020-03-09 12:45:00,1003,0.8,858,167,29.4,13,114,0.9,2020-03-09 08:45:00.000
52,53,2020-03-09 13:00:00,984,0.9,854,166,29.3,17,109,0.9,2020-03-09 09:00:00.000
53,54,2020-03-09 13:15:00,969,1.1,878,146,29.1,20,106,0.0,2020-03-09 09:15:00.000
54,55,2020-03-09 13:30:00,940,1.3,870,145,29.0,24,103,0.0,2020-03-09 09:30:00.000
55,56,2020-03-09 13:45:00,906,1.5,855,148,28.8,28,101,0.0,2020-03-09 09:45:00.000
56,57,2020-03-09 14:00:00,867,1.7,838,151,28.7,31,100,0.0,2020-03-09 10:00:00.000
57,58,2020-03-09 14:15:00,824,1.6,819,153,28.7,35,99,0.0,2020-03-09 10:15:00.000
58,59,2020-03-09 14:30:00,777,1.6,800,152,28.6,39,98,0.0,2020-03-09 10:30:00.000
59,60,2020-03-09 14:45:00,728,1.5,784,148,28.6,42,98,0.0,2020-03-09 10:45:00.000
60,61,2020-03-09 15:00:00,602,1.5,469,274,28.5,46,97,11.0,2020-03-09 11:00:00.000
61,62,2020-03-09 15:15:00,398,1.6,0,398,28.3,50,97,35.7,2020-03-09 11:15:00.000
62,63,2020-03-09 15:30:00,163,1.7,0,163,28.1,54,96,71.3,2020-03-09 11:30:00.000
63,64,2020-03-09 15:45:00,86,1.8,0,86,27.9,57,96,82.6,2020-03-09 11:45:00.000
64,65,2020-03-09 16:00:00,132,1.9,0,132,27.7,61,96,69.8,2020-03-09 12:00:00.000
65,66,2020-03-09 16:15:00,48,1.9,0,48,27.4,65,95,86.7,2020-03-09 12:15:00.000
66,67,2020-03-09 16:30:00,89,2.0,0,89,27.1,68,95,71.0,2020-03-09 12:30:00.000
67,68,2020-03-09 16:45:00,46,2.1,0,46,26.9,72,95,80.9,2020-03-09 12:45:00.000
68,69,2020-03-09 17:00:00,43,2.1,0,43,26.5,76,95,76.2,2020-03-09 13:00:00.000
69,70,2020-03-09 17:15:00,19,2.1,0,19,26.2,80,95,83.8,2020-03-09 13:15:00.000
70,71,2020-03-09 17:30:00,27,2.1,0,27,25.8,83,95,57.6,2020-03-09 13:30:00.000
71,72,2020-03-09 17:45:00,16,2.2,0,16,25.4,87,95,30.6,2020-03-09 13:45:00.000
72,73,2020-03-09 18:00:00,1,2.2,0,1,25.0,91,95,31.8,2020-03-09 14:00:00.000
73,74,2020-03-09 18:15:00,0,2.2,0,0,24.9,95,95,26.3,2020-03-09 14:15:00.000
74,75,2020-03-09 18:30:00,0,2.2,0,0,24.7,98,95,17.9,2020-03-09 14:30:00.000
75,76,2020-03-09 18:45:00,0,2.2,0,0,24.5,102,95,25.8,2020-03-09 14:45:00.000
76,77,2020-03-09 19:00:00,0,2.2,0,0,24.3,106,95,45.4,2020-03-09 15:00:00.000
77,78,2020-03-09 19:15:00,0,2.1,0,0,24.3,110,95,45.7,2020-03-09 15:15:00.000
78,79,2020-03-09 19:30:00,0,2.1,0,0,24.2,113,95,45.8,2020-03-09 15:30:00.000
79,80,2020-03-09 19:45:00,0,2.0,0,0,24.1,117,95,45.1,2020-03-09 15:45:00.000
80,81,2020-03-09 20:00:00,0,1.9,0,0,24.1,121,95,9.0,2020-03-09 16:00:00.000
81,82,2020-03-09 20:15:00,0,1.9,0,0,24.0,125,95,0.0,2020-03-09 16:15:00.000
82,83,2020-03-09 20:30:00,0,1.9,0,0,23.9,128,95,0.0,2020-03-09 16:30:00.000
83,84,2020-03-09 20:45:00,0,1.9,0,0,23.8,132,96,0.0,2020-03-09 16:45:00.000
84,85,2020-03-09 21:00:00,0,1.8,0,0,23.8,136,96,0.0,2020-03-09 17:00:00.000
85,86,2020-03-09 21:15:00,0,1.8,0,0,23.7,139,96,0.0,2020-03-09 17:15:00.000
86,87,2020-03-09 21:30:00,0,1.8,0,0,23.7,143,97,0.0,2020-03-09 17:30:00.000
87,88,2020-03-09 21:45:00,0,1.9,0,0,23.6,147,97,0.0,2020-03-09 17:45:00.000
88,89,2020-03-09 22:00:00,0,1.9,0,0,23.6,151,98,0.0,2020-03-09 18:00:00.000
89,90,2020-03-09 22:15:00,0,1.8,0,0,23.6,154,99,0.0,2020-03-09 18:15:00.000
90,91,2020-03-09 22:30:00,0,1.8,0,0,23.5,158,101,0.0,2020-03-09 18:30:00.000
91,92,2020-03-09 22:45:00,0,1.8,0,0,23.5,162,103,0.0,2020-03-09 18:45:00.000
92,93,2020-03-09 23:00:00,0,1.8,0,0,23.5,165,106,0.0,2020-03-09 19:00:00.000
93,94,2020-03-09 23:15:00,0,1.7,0,0,23.5,169,111,0.0,2020-03-09 19:15:00.000
94,95,2020-03-09 23:30:00,0,1.7,0,0,23.4,172,121,0.0,2020-03-09 19:30:00.000
95,96,2020-03-09 23:45:00,0,1.7,0,0,23.4,175,145,0.0,2020-03-09 19:45:00.000
