,BLOCK_ID,DATA_DATETIME,GHI,WIND_SPEED,DNI,DHI,TEMPERATURE,ZENITH,AZIMUTH,CLOUD_OPACITY,ENTRY_TIME
0,1,2021-06-09 00:00:00,0,0.7,0,0,22.4,156,-9,20.6,2021-06-08 20:00:00.000
1,2,2021-06-09 00:15:00,0,0.7,0,0,22.4,155,-17,15.4,2021-06-08 20:15:00.000
2,3,2021-06-09 00:30:00,0,0.7,0,0,22.4,154,-25,2.8,2021-06-08 20:30:00.000
3,4,2021-06-09 00:45:00,0,0.7,0,0,22.4,152,-31,21.5,2021-06-08 20:45:00.000
4,5,2021-06-09 01:00:00,0,0.7,0,0,22.3,150,-37,21.8,2021-06-08 21:00:00.000
5,6,2021-06-09 01:15:00,0,0.7,0,0,22.3,148,-42,20.0,2021-06-08 21:15:00.000
6,7,2021-06-09 01:30:00,0,0.6,0,0,22.2,145,-46,4.0,2021-06-08 21:30:00.000
7,8,2021-06-09 01:45:00,0,0.6,0,0,22.2,142,-50,5.4,2021-06-08 21:45:00.000
8,9,2021-06-09 02:00:00,0,0.6,0,0,22.1,140,-52,16.4,2021-06-08 22:00:00.000
9,10,2021-06-09 02:15:00,0,0.5,0,0,22.1,137,-55,16.6,2021-06-08 22:15:00.000
10,11,2021-06-09 02:30:00,0,0.5,0,0,22.1,133,-57,18.8,2021-06-08 22:30:00.000
11,12,2021-06-09 02:45:00,0,0.5,0,0,22.1,130,-59,15.4,2021-06-08 22:45:00.000
12,13,2021-06-09 03:00:00,0,0.4,0,0,22.0,127,-60,14.8,2021-06-08 23:00:00.000
13,14,2021-06-09 03:15:00,0,0.4,0,0,22.0,124,-62,15.7,2021-06-08 23:15:00.000
14,15,2021-06-09 03:30:00,0,0.3,0,0,22.0,120,-63,17.4,2021-06-08 23:30:00.000
15,16,2021-06-09 03:45:00,0,0.3,0,0,21.9,117,-64,19.5,2021-06-08 23:45:00.000
16,17,2021-06-09 04:00:00,0,0.3,0,0,21.9,114,-65,15.2,2021-06-09 00:00:00.000
17,18,2021-06-09 04:15:00,0,0.2,0,0,21.9,110,-65,17.5,2021-06-09 00:15:00.000
18,19,2021-06-09 04:30:00,0,0.1,0,0,21.8,107,-66,36.8,2021-06-09 00:30:00.000
19,20,2021-06-09 04:45:00,0,0.1,0,0,21.8,103,-66,42.4,2021-06-09 00:45:00.000
20,21,2021-06-09 05:00:00,0,0.1,0,0,21.8,100,-67,32.2,2021-06-09 01:00:00.000
21,22,2021-06-09 05:15:00,0,0.2,0,0,21.8,96,-67,19.6,2021-06-09 01:15:00.000
22,23,2021-06-09 05:30:00,0,0.2,0,0,21.8,93,-67,18.6,2021-06-09 01:30:00.000
23,24,2021-06-09 05:45:00,4,0.3,0,4,21.8,90,-67,17.1,2021-06-09 01:45:00.000
24,25,2021-06-09 06:00:00,30,0.3,47,26,21.9,86,-67,12.6,2021-06-09 02:00:00.000
25,26,2021-06-09 06:15:00,69,0.3,174,47,22.3,83,-67,10.1,2021-06-09 02:15:00.000
26,27,2021-06-09 06:30:00,103,0.3,125,80,22.7,79,-67,18.2,2021-06-09 02:30:00.000
27,28,2021-06-09 06:45:00,158,0.3,268,91,23.1,76,-67,12.4,2021-06-09 02:45:00.000
28,29,2021-06-09 07:00:00,230,0.3,530,68,23.5,72,-66,2.2,2021-06-09 03:00:00.000
29,30,2021-06-09 07:15:00,291,0.3,624,66,23.9,69,-66,0.0,2021-06-09 03:15:00.000
30,31,2021-06-09 07:30:00,346,0.3,663,71,24.4,65,-65,0.0,2021-06-09 03:30:00.000
31,32,2021-06-09 07:45:00,401,0.3,695,76,24.9,62,-64,0.0,2021-06-09 03:45:00.000
32,33,2021-06-09 08:00:00,454,0.3,722,80,25.4,59,-63,0.0,2021-06-09 04:00:00.000
33,34,2021-06-09 08:15:00,506,0.4,745,83,26.0,55,-62,0.0,2021-06-09 04:15:00.000
34,35,2021-06-09 08:30:00,555,0.5,764,86,26.7,52,-61,0.0,2021-06-09 04:30:00.000
35,36,2021-06-09 08:45:00,603,0.7,781,89,27.4,49,-60,0.0,2021-06-09 04:45:00.000
36,37,2021-06-09 09:00:00,647,0.8,795,92,28.0,46,-58,0.0,2021-06-09 05:00:00.000
37,38,2021-06-09 09:15:00,689,0.9,807,94,28.3,43,-56,0.0,2021-06-09 05:15:00.000
38,39,2021-06-09 09:30:00,727,1.0,817,97,28.7,39,-53,0.0,2021-06-09 05:30:00.000
39,40,2021-06-09 09:45:00,747,1.1,769,130,29.1,37,-50,1.9,2021-06-09 05:45:00.000
40,41,2021-06-09 10:00:00,787,1.2,809,114,29.4,34,-47,0.8,2021-06-09 06:00:00.000
41,42,2021-06-09 10:15:00,820,1.3,839,102,29.6,31,-43,0.0,2021-06-09 06:15:00.000
42,43,2021-06-09 10:30:00,843,1.3,841,105,29.9,29,-38,0.0,2021-06-09 06:30:00.000
43,44,2021-06-09 10:45:00,859,1.4,829,117,30.1,26,-32,0.3,2021-06-09 06:45:00.000
44,45,2021-06-09 11:00:00,875,1.4,835,117,30.2,25,-25,0.0,2021-06-09 07:00:00.000
45,46,2021-06-09 11:15:00,885,1.4,830,123,30.1,23,-17,0.0,2021-06-09 07:15:00.000
46,47,2021-06-09 11:30:00,890,1.3,826,127,29.9,22,-9,0.0,2021-06-09 07:30:00.000
47,48,2021-06-09 11:45:00,871,1.2,757,170,29.7,22,0,2.4,2021-06-09 07:45:00.000
48,49,2021-06-09 12:00:00,819,1.2,594,270,29.6,23,9,8.0,2021-06-09 08:00:00.000
49,50,2021-06-09 12:15:00,660,1.1,226,452,29.3,23,18,25.3,2021-06-09 08:15:00.000
50,51,2021-06-09 12:30:00,453,1.1,0,453,29.1,25,26,48.0,2021-06-09 08:30:00.000
51,52,2021-06-09 12:45:00,607,1.0,120,500,28.9,27,32,29.1,2021-06-09 08:45:00.000
52,53,2021-06-09 13:00:00,664,1.0,284,415,28.7,29,38,20.6,2021-06-09 09:00:00.000
53,54,2021-06-09 13:15:00,766,0.9,643,217,28.4,31,43,5.7,2021-06-09 09:15:00.000
54,55,2021-06-09 13:30:00,727,0.9,592,236,28.2,34,47,7.4,2021-06-09 09:30:00.000
55,56,2021-06-09 13:45:00,507,0.9,185,357,28.0,37,51,33.0,2021-06-09 09:45:00.000
56,57,2021-06-09 14:00:00,389,0.8,0,389,27.8,40,54,45.8,2021-06-09 10:00:00.000
57,58,2021-06-09 14:15:00,346,0.8,0,346,27.7,43,56,49.3,2021-06-09 10:15:00.000
58,59,2021-06-09 14:30:00,396,0.7,30,375,27.6,46,58,37.8,2021-06-09 10:30:00.000
59,60,2021-06-09 14:45:00,316,0.7,5,313,27.5,49,60,46.6,2021-06-09 10:45:00.000
60,61,2021-06-09 15:00:00,236,0.6,4,234,27.4,52,61,57.2,2021-06-09 11:00:00.000
61,62,2021-06-09 15:15:00,168,0.6,0,168,27.3,56,62,66.2,2021-06-09 11:15:00.000
62,63,2021-06-09 15:30:00,166,0.5,0,166,27.3,59,64,62.8,2021-06-09 11:30:00.000
63,64,2021-06-09 15:45:00,140,0.5,0,140,27.2,62,64,63.9,2021-06-09 11:45:00.000
64,65,2021-06-09 16:00:00,207,0.5,0,207,27.1,66,65,38.6,2021-06-09 12:00:00.000
65,66,2021-06-09 16:15:00,194,0.5,34,181,26.9,69,66,31.7,2021-06-09 12:15:00.000
66,67,2021-06-09 16:30:00,172,0.4,120,137,26.7,73,66,23.8,2021-06-09 12:30:00.000
67,68,2021-06-09 16:45:00,113,0.5,40,103,26.5,76,67,36.4,2021-06-09 12:45:00.000
68,69,2021-06-09 17:00:00,65,0.5,0,65,26.2,80,67,45.4,2021-06-09 13:00:00.000
69,70,2021-06-09 17:15:00,59,0.5,71,52,25.6,83,67,16.6,2021-06-09 13:15:00.000
70,71,2021-06-09 17:30:00,23,0.6,39,20,25.0,86,67,28.0,2021-06-09 13:30:00.000
71,72,2021-06-09 17:45:00,2,0.6,0,2,24.4,90,67,32.9,2021-06-09 13:45:00.000
72,73,2021-06-09 18:00:00,0,0.6,0,0,23.9,93,67,24.8,2021-06-09 14:00:00.000
73,74,2021-06-09 18:15:00,0,0.7,0,0,23.7,97,67,22.4,2021-06-09 14:15:00.000
74,75,2021-06-09 18:30:00,0,0.7,0,0,23.6,100,67,21.0,2021-06-09 14:30:00.000
75,76,2021-06-09 18:45:00,0,0.7,0,0,23.5,104,66,22.4,2021-06-09 14:45:00.000
76,77,2021-06-09 19:00:00,0,0.8,0,0,23.4,107,66,21.0,2021-06-09 15:00:00.000
77,78,2021-06-09 19:15:00,0,0.8,0,0,23.3,111,65,21.0,2021-06-09 15:15:00.000
78,79,2021-06-09 19:30:00,0,0.8,0,0,23.3,114,65,22.6,2021-06-09 15:30:00.000
79,80,2021-06-09 19:45:00,0,0.8,0,0,23.2,117,64,23.9,2021-06-09 15:45:00.000
80,81,2021-06-09 20:00:00,0,0.8,0,0,23.1,121,63,17.2,2021-06-09 16:00:00.000
81,82,2021-06-09 20:15:00,0,0.8,0,0,23.1,124,62,15.5,2021-06-09 16:15:00.000
82,83,2021-06-09 20:30:00,0,0.8,0,0,23.0,127,60,16.6,2021-06-09 16:30:00.000
83,84,2021-06-09 20:45:00,0,0.8,0,0,23.0,130,59,22.1,2021-06-09 16:45:00.000
84,85,2021-06-09 21:00:00,0,0.7,0,0,22.9,134,57,16.8,2021-06-09 17:00:00.000
85,86,2021-06-09 21:15:00,0,0.7,0,0,22.9,137,55,16.6,2021-06-09 17:15:00.000
86,87,2021-06-09 21:30:00,0,0.7,0,0,22.8,140,52,15.6,2021-06-09 17:30:00.000
87,88,2021-06-09 21:45:00,0,0.6,0,0,22.8,143,49,14.0,2021-06-09 17:45:00.000
88,89,2021-06-09 22:00:00,0,0.6,0,0,22.7,145,46,14.8,2021-06-09 18:00:00.000
89,90,2021-06-09 22:15:00,0,0.6,0,0,22.7,148,41,13.7,2021-06-09 18:15:00.000
90,91,2021-06-09 22:30:00,0,0.6,0,0,22.7,150,36,2.6,2021-06-09 18:30:00.000
91,92,2021-06-09 22:45:00,0,0.6,0,0,22.6,152,31,17.4,2021-06-09 18:45:00.000
92,93,2021-06-09 23:00:00,0,0.6,0,0,22.6,154,24,21.6,2021-06-09 19:00:00.000
93,94,2021-06-09 23:15:00,0,0.5,0,0,22.6,155,16,15.7,2021-06-09 19:15:00.000
94,95,2021-06-09 23:30:00,0,0.5,0,0,22.5,156,8,14.2,2021-06-09 19:30:00.000
95,96,2021-06-09 23:45:00,0,0.4,0,0,22.5,157,0,14.0,2021-06-09 19:45:00.000
