,BLOCK_ID,DATA_DATETIME,GHI,WIND_SPEED,DNI,DHI,TEMPERATURE,ZENITH,AZIMUTH,CLOUD_OPACITY,ENTRY_TIME
0,1,2020-09-11 00:00:00,0,0.7,0,0,23.0,173,-37,97.0,2020-09-10 20:00:00.000
1,2,2020-09-11 00:15:00,0,0.7,0,0,23.0,170,-55,97.0,2020-09-10 20:15:00.000
2,3,2020-09-11 00:30:00,0,0.7,0,0,22.9,167,-64,97.0,2020-09-10 20:30:00.000
3,4,2020-09-11 00:45:00,0,0.8,0,0,22.9,163,-70,95.1,2020-09-10 20:45:00.000
4,5,2020-09-11 01:00:00,0,0.8,0,0,22.8,160,-74,92.2,2020-09-10 21:00:00.000
5,6,2020-09-11 01:15:00,0,0.8,0,0,22.8,156,-76,93.7,2020-09-10 21:15:00.000
6,7,2020-09-11 01:30:00,0,0.7,0,0,22.8,153,-78,93.0,2020-09-10 21:30:00.000
7,8,2020-09-11 01:45:00,0,0.7,0,0,22.8,149,-79,91.5,2020-09-10 21:45:00.000
8,9,2020-09-11 02:00:00,0,0.7,0,0,22.8,145,-80,89.6,2020-09-10 22:00:00.000
9,10,2020-09-11 02:15:00,0,0.7,0,0,22.8,142,-81,88.4,2020-09-10 22:15:00.000
10,11,2020-09-11 02:30:00,0,0.7,0,0,22.8,138,-82,83.0,2020-09-10 22:30:00.000
11,12,2020-09-11 02:45:00,0,0.7,0,0,22.8,134,-82,72.1,2020-09-10 22:45:00.000
12,13,2020-09-11 03:00:00,0,0.8,0,0,22.7,130,-83,74.8,2020-09-10 23:00:00.000
13,14,2020-09-11 03:15:00,0,0.8,0,0,22.7,127,-83,75.9,2020-09-10 23:15:00.000
14,15,2020-09-11 03:30:00,0,0.8,0,0,22.7,123,-84,77.2,2020-09-10 23:30:00.000
15,16,2020-09-11 03:45:00,0,0.7,0,0,22.7,119,-84,62.6,2020-09-10 23:45:00.000
16,17,2020-09-11 04:00:00,0,0.7,0,0,22.6,115,-84,40.6,2020-09-11 00:00:00.000
17,18,2020-09-11 04:15:00,0,0.7,0,0,22.6,112,-84,27.3,2020-09-11 00:15:00.000
18,19,2020-09-11 04:30:00,0,0.7,0,0,22.6,108,-85,30.4,2020-09-11 00:30:00.000
19,20,2020-09-11 04:45:00,0,0.7,0,0,22.6,104,-85,31.9,2020-09-11 00:45:00.000
20,21,2020-09-11 05:00:00,0,0.7,0,0,22.5,101,-85,38.8,2020-09-11 01:00:00.000
21,22,2020-09-11 05:15:00,0,0.7,0,0,22.6,97,-85,41.8,2020-09-11 01:15:00.000
22,23,2020-09-11 05:30:00,0,0.6,0,0,22.6,93,-85,61.2,2020-09-11 01:30:00.000
23,24,2020-09-11 05:45:00,2,0.6,0,2,22.7,89,-85,66.3,2020-09-11 01:45:00.000
24,25,2020-09-11 06:00:00,21,0.5,0,21,22.8,86,-85,48.8,2020-09-11 02:00:00.000
25,26,2020-09-11 06:15:00,63,0.5,0,63,23.2,82,-85,29.1,2020-09-11 02:15:00.000
26,27,2020-09-11 06:30:00,110,0.5,55,98,23.6,78,-85,23.8,2020-09-11 02:30:00.000
27,28,2020-09-11 06:45:00,164,0.5,160,121,24.0,74,-85,19.1,2020-09-11 02:45:00.000
28,29,2020-09-11 07:00:00,222,0.4,250,139,24.5,71,-85,15.9,2020-09-11 03:00:00.000
29,30,2020-09-11 07:15:00,289,0.4,378,141,25.2,67,-85,11.0,2020-09-11 03:15:00.000
30,31,2020-09-11 07:30:00,347,0.4,423,155,25.8,63,-85,10.2,2020-09-11 03:30:00.000
31,32,2020-09-11 07:45:00,446,0.4,705,87,26.5,59,-85,0.0,2020-09-11 03:45:00.000
32,33,2020-09-11 08:00:00,506,0.6,731,93,27.1,56,-85,0.0,2020-09-11 04:00:00.000
33,34,2020-09-11 08:15:00,544,0.7,664,135,27.5,52,-84,3.2,2020-09-11 04:15:00.000
34,35,2020-09-11 08:30:00,580,0.9,604,177,28.0,48,-84,6.0,2020-09-11 04:30:00.000
35,36,2020-09-11 08:45:00,659,1.0,746,126,28.5,44,-84,1.4,2020-09-11 04:45:00.000
36,37,2020-09-11 09:00:00,717,1.2,800,110,28.9,41,-83,0.0,2020-09-11 05:00:00.000
37,38,2020-09-11 09:15:00,762,1.4,811,114,29.3,37,-83,0.0,2020-09-11 05:15:00.000
38,39,2020-09-11 09:30:00,803,1.5,820,117,29.6,33,-82,0.0,2020-09-11 05:30:00.000
39,40,2020-09-11 09:45:00,812,1.7,734,175,30.0,30,-81,3.3,2020-09-11 05:45:00.000
40,41,2020-09-11 10:00:00,742,1.8,422,364,30.3,26,-80,15.0,2020-09-11 06:00:00.000
41,42,2020-09-11 10:15:00,772,1.9,437,367,30.3,22,-79,14.5,2020-09-11 06:15:00.000
42,43,2020-09-11 10:30:00,797,2.0,450,370,30.3,18,-77,14.0,2020-09-11 06:30:00.000
43,44,2020-09-11 10:45:00,836,2.2,509,344,30.3,15,-73,11.5,2020-09-11 06:45:00.000
44,45,2020-09-11 11:00:00,857,2.3,527,340,30.2,11,-68,10.6,2020-09-11 07:00:00.000
45,46,2020-09-11 11:15:00,838,2.3,456,387,29.9,8,-58,13.3,2020-09-11 07:15:00.000
46,47,2020-09-11 11:30:00,856,2.4,487,372,29.7,5,-35,11.8,2020-09-11 07:30:00.000
47,48,2020-09-11 11:45:00,845,2.4,452,394,29.4,4,9,13.1,2020-09-11 07:45:00.000
48,49,2020-09-11 12:00:00,885,2.5,568,321,29.2,6,46,8.6,2020-09-11 08:00:00.000
49,50,2020-09-11 12:15:00,960,2.5,814,157,29.0,9,63,0.0,2020-09-11 08:15:00.000
50,51,2020-09-11 12:30:00,948,2.6,811,156,28.9,13,70,0.0,2020-09-11 08:30:00.000
51,52,2020-09-11 12:45:00,886,2.6,678,234,28.7,16,75,4.8,2020-09-11 08:45:00.000
52,53,2020-09-11 13:00:00,632,2.6,94,543,28.6,20,78,30.4,2020-09-11 09:00:00.000
53,54,2020-09-11 13:15:00,369,2.3,0,369,28.3,24,79,58.2,2020-09-11 09:15:00.000
54,55,2020-09-11 13:30:00,409,2.1,0,409,28.0,27,81,51.8,2020-09-11 09:30:00.000
55,56,2020-09-11 13:45:00,315,1.8,0,315,27.7,31,82,61.6,2020-09-11 09:45:00.000
56,57,2020-09-11 14:00:00,154,1.7,0,154,27.5,35,82,80.2,2020-09-11 10:00:00.000
57,58,2020-09-11 14:15:00,111,1.6,0,111,27.4,38,83,84.9,2020-09-11 10:15:00.000
58,59,2020-09-11 14:30:00,90,1.6,0,90,27.3,42,84,87.0,2020-09-11 10:30:00.000
59,60,2020-09-11 14:45:00,83,1.6,0,83,27.2,46,84,87.0,2020-09-11 10:45:00.000
60,61,2020-09-11 15:00:00,72,1.6,0,72,27.1,50,84,87.8,2020-09-11 11:00:00.000
61,62,2020-09-11 15:15:00,67,1.6,0,67,26.9,53,85,87.4,2020-09-11 11:15:00.000
62,63,2020-09-11 15:30:00,59,1.7,0,59,26.6,57,85,87.6,2020-09-11 11:30:00.000
63,64,2020-09-11 15:45:00,60,1.7,0,60,26.4,61,85,85.5,2020-09-11 11:45:00.000
64,65,2020-09-11 16:00:00,86,1.7,0,86,26.1,65,85,75.6,2020-09-11 12:00:00.000
65,66,2020-09-11 16:15:00,85,1.7,0,85,25.8,68,85,71.1,2020-09-11 12:15:00.000
66,67,2020-09-11 16:30:00,76,1.7,0,76,25.5,72,85,67.4,2020-09-11 12:30:00.000
67,68,2020-09-11 16:45:00,62,1.6,0,62,25.2,76,85,64.1,2020-09-11 12:45:00.000
68,69,2020-09-11 17:00:00,52,1.6,0,52,25.0,79,85,54.0,2020-09-11 13:00:00.000
69,70,2020-09-11 17:15:00,43,1.6,0,43,24.8,83,85,31.6,2020-09-11 13:15:00.000
70,71,2020-09-11 17:30:00,8,1.5,0,8,24.6,87,85,76.4,2020-09-11 13:30:00.000
71,72,2020-09-11 17:45:00,0,1.5,0,0,24.4,91,85,97.0,2020-09-11 13:45:00.000
72,73,2020-09-11 18:00:00,0,1.5,0,0,24.2,94,85,97.0,2020-09-11 14:00:00.000
73,74,2020-09-11 18:15:00,0,1.4,0,0,24.2,98,85,58.1,2020-09-11 14:15:00.000
74,75,2020-09-11 18:30:00,0,1.4,0,0,24.2,102,85,47.2,2020-09-11 14:30:00.000
75,76,2020-09-11 18:45:00,0,1.4,0,0,24.1,106,85,47.3,2020-09-11 14:45:00.000
76,77,2020-09-11 19:00:00,0,1.4,0,0,24.1,109,85,87.2,2020-09-11 15:00:00.000
77,78,2020-09-11 19:15:00,0,1.5,0,0,24.1,113,85,97.0,2020-09-11 15:15:00.000
78,79,2020-09-11 19:30:00,0,1.5,0,0,24.1,117,84,97.0,2020-09-11 15:30:00.000
79,80,2020-09-11 19:45:00,0,1.6,0,0,24.0,121,84,97.0,2020-09-11 15:45:00.000
80,81,2020-09-11 20:00:00,0,1.6,0,0,24.0,124,84,97.0,2020-09-11 16:00:00.000
81,82,2020-09-11 20:15:00,0,1.6,0,0,24.0,128,84,97.0,2020-09-11 16:15:00.000
82,83,2020-09-11 20:30:00,0,1.5,0,0,24.0,132,83,96.2,2020-09-11 16:30:00.000
83,84,2020-09-11 20:45:00,0,1.5,0,0,24.0,135,83,92.5,2020-09-11 16:45:00.000
84,85,2020-09-11 21:00:00,0,1.5,0,0,24.0,139,82,85.8,2020-09-11 17:00:00.000
85,86,2020-09-11 21:15:00,0,1.5,0,0,23.9,143,81,84.1,2020-09-11 17:15:00.000
86,87,2020-09-11 21:30:00,0,1.5,0,0,23.9,147,81,80.4,2020-09-11 17:30:00.000
87,88,2020-09-11 21:45:00,0,1.5,0,0,23.8,150,79,61.8,2020-09-11 17:45:00.000
88,89,2020-09-11 22:00:00,0,1.5,0,0,23.8,154,78,93.6,2020-09-11 18:00:00.000
89,90,2020-09-11 22:15:00,0,1.5,0,0,23.8,158,76,62.9,2020-09-11 18:15:00.000
90,91,2020-09-11 22:30:00,0,1.5,0,0,23.7,161,73,69.0,2020-09-11 18:30:00.000
91,92,2020-09-11 22:45:00,0,1.5,0,0,23.7,165,70,69.6,2020-09-11 18:45:00.000
92,93,2020-09-11 23:00:00,0,1.5,0,0,23.6,168,63,67.4,2020-09-11 19:00:00.000
93,94,2020-09-11 23:15:00,0,1.4,0,0,23.5,171,52,65.8,2020-09-11 19:15:00.000
94,95,2020-09-11 23:30:00,0,1.4,0,0,23.5,174,29,53.6,2020-09-11 19:30:00.000
95,96,2020-09-11 23:45:00,0,1.4,0,0,23.4,175,-7,40.9,2020-09-11 19:45:00.000
