,BLOCK_ID,DATA_DATETIME,GHI,WIND_SPEED,DNI,DHI,TEMPERATURE,ZENITH,AZIMUTH,CLOUD_OPACITY,ENTRY_TIME
0,1,2019-02-09 00:00:00,0,4.4,0,0,26.5,165,-180,0.0,2019-02-08 20:00:00.000
1,2,2019-02-09 00:15:00,0,4.4,0,0,26.4,165,-166,0.0,2019-02-08 20:15:00.000
2,3,2019-02-09 00:30:00,0,4.3,0,0,26.4,163,-154,0.0,2019-02-08 20:30:00.000
3,4,2019-02-09 00:45:00,0,4.2,0,0,26.3,161,-143,0.0,2019-02-08 20:45:00.000
4,5,2019-02-09 01:00:00,0,4.2,0,0,26.3,159,-135,0.0,2019-02-08 21:00:00.000
5,6,2019-02-09 01:15:00,0,4.1,0,0,26.2,156,-129,0.0,2019-02-08 21:15:00.000
6,7,2019-02-09 01:30:00,0,4.1,0,0,26.2,153,-125,0.0,2019-02-08 21:30:00.000
7,8,2019-02-09 01:45:00,0,4.0,0,0,26.1,150,-121,0.0,2019-02-08 21:45:00.000
8,9,2019-02-09 02:00:00,0,4.0,0,0,26.1,147,-118,0.0,2019-02-08 22:00:00.000
9,10,2019-02-09 02:15:00,0,4.0,0,0,26.1,144,-115,0.0,2019-02-08 22:15:00.000
10,11,2019-02-09 02:30:00,0,4.0,0,0,26.1,140,-114,0.0,2019-02-08 22:30:00.000
11,12,2019-02-09 02:45:00,0,4.0,0,0,26.1,137,-112,0.0,2019-02-08 22:45:00.000
12,13,2019-02-09 03:00:00,0,4.0,0,0,26.1,133,-111,0.0,2019-02-08 23:00:00.000
13,14,2019-02-09 03:15:00,0,4.0,0,0,26.1,130,-110,0.0,2019-02-08 23:15:00.000
14,15,2019-02-09 03:30:00,0,4.1,0,0,26.0,126,-109,0.0,2019-02-08 23:30:00.000
15,16,2019-02-09 03:45:00,0,4.1,0,0,26.0,123,-108,0.0,2019-02-08 23:45:00.000
16,17,2019-02-09 04:00:00,0,4.1,0,0,26.0,119,-107,0.0,2019-02-09 00:00:00.000
17,18,2019-02-09 04:15:00,0,4.1,0,0,26.0,115,-107,0.0,2019-02-09 00:15:00.000
18,19,2019-02-09 04:30:00,0,4.1,0,0,26.0,112,-106,0.0,2019-02-09 00:30:00.000
19,20,2019-02-09 04:45:00,0,4.1,0,0,26.0,108,-106,0.0,2019-02-09 00:45:00.000
20,21,2019-02-09 05:00:00,0,4.2,0,0,26.0,105,-106,0.0,2019-02-09 01:00:00.000
21,22,2019-02-09 05:15:00,0,4.2,0,0,26.1,101,-105,0.0,2019-02-09 01:15:00.000
22,23,2019-02-09 05:30:00,0,4.2,0,0,26.2,97,-105,0.0,2019-02-09 01:30:00.000
23,24,2019-02-09 05:45:00,0,4.3,0,0,26.3,94,-105,0.0,2019-02-09 01:45:00.000
24,25,2019-02-09 06:00:00,2,4.3,3,2,26.3,90,-105,0.0,2019-02-09 02:00:00.000
25,26,2019-02-09 06:15:00,31,4.3,89,23,26.4,86,-105,4.6,2019-02-09 02:15:00.000
26,27,2019-02-09 06:30:00,57,4.3,13,55,26.5,83,-105,29.2,2019-02-09 02:30:00.000
27,28,2019-02-09 06:45:00,98,4.4,11,96,26.6,79,-106,28.7,2019-02-09 02:45:00.000
28,29,2019-02-09 07:00:00,142,4.4,34,134,26.7,76,-106,28.1,2019-02-09 03:00:00.000
29,30,2019-02-09 07:15:00,195,4.4,106,163,26.8,72,-106,25.1,2019-02-09 03:15:00.000
30,31,2019-02-09 07:30:00,243,4.5,129,195,26.8,68,-107,25.1,2019-02-09 03:30:00.000
31,32,2019-02-09 07:45:00,320,4.5,310,184,26.9,65,-107,18.0,2019-02-09 03:45:00.000
32,33,2019-02-09 08:00:00,409,4.5,522,160,27.0,61,-108,8.8,2019-02-09 04:00:00.000
33,34,2019-02-09 08:15:00,507,4.6,770,96,26.9,58,-109,0.7,2019-02-09 04:15:00.000
34,35,2019-02-09 08:30:00,570,4.7,817,92,26.9,54,-109,0.0,2019-02-09 04:30:00.000
35,36,2019-02-09 08:45:00,626,4.7,837,96,26.9,51,-110,0.0,2019-02-09 04:45:00.000
36,37,2019-02-09 09:00:00,680,4.8,854,100,26.8,47,-112,0.0,2019-02-09 05:00:00.000
37,38,2019-02-09 09:15:00,729,4.9,858,108,26.8,44,-113,0.3,2019-02-09 05:15:00.000
38,39,2019-02-09 09:30:00,777,4.9,874,110,26.7,40,-115,0.2,2019-02-09 05:30:00.000
39,40,2019-02-09 09:45:00,820,5.0,884,113,26.7,37,-117,0.2,2019-02-09 05:45:00.000
40,41,2019-02-09 10:00:00,831,5.1,787,176,26.7,34,-119,3.5,2019-02-09 06:00:00.000
41,42,2019-02-09 10:15:00,853,5.2,753,203,26.6,30,-123,4.9,2019-02-09 06:15:00.000
42,43,2019-02-09 10:30:00,928,5.2,915,115,26.6,27,-126,0.0,2019-02-09 06:30:00.000
43,44,2019-02-09 10:45:00,955,5.3,920,117,26.5,24,-131,0.0,2019-02-09 06:45:00.000
44,45,2019-02-09 11:00:00,977,5.3,925,117,26.5,22,-138,0.0,2019-02-09 07:00:00.000
45,46,2019-02-09 11:15:00,994,5.4,929,118,26.5,19,-146,0.0,2019-02-09 07:15:00.000
46,47,2019-02-09 11:30:00,1007,5.4,931,118,26.6,17,-155,0.0,2019-02-09 07:30:00.000
47,48,2019-02-09 11:45:00,1014,5.5,933,119,26.6,16,-167,0.0,2019-02-09 07:45:00.000
48,49,2019-02-09 12:00:00,1016,5.5,933,119,26.6,16,180,0.0,2019-02-09 08:00:00.000
49,50,2019-02-09 12:15:00,1014,5.6,932,119,26.7,16,167,0.0,2019-02-09 08:15:00.000
50,51,2019-02-09 12:30:00,1006,5.6,931,118,26.7,18,155,0.0,2019-02-09 08:30:00.000
51,52,2019-02-09 12:45:00,994,5.7,928,118,26.7,19,145,0.0,2019-02-09 08:45:00.000
52,53,2019-02-09 13:00:00,976,5.7,925,117,26.8,22,137,0.0,2019-02-09 09:00:00.000
53,54,2019-02-09 13:15:00,954,5.8,920,116,26.8,24,131,0.0,2019-02-09 09:15:00.000
54,55,2019-02-09 13:30:00,927,5.8,914,115,26.8,27,126,0.0,2019-02-09 09:30:00.000
55,56,2019-02-09 13:45:00,896,5.9,906,115,26.9,30,122,0.0,2019-02-09 09:45:00.000
56,57,2019-02-09 14:00:00,860,5.9,895,115,26.9,34,119,0.0,2019-02-09 10:00:00.000
57,58,2019-02-09 14:15:00,820,5.9,884,114,26.9,37,117,0.0,2019-02-09 10:15:00.000
58,59,2019-02-09 14:30:00,776,5.9,871,112,27.0,40,115,0.0,2019-02-09 10:30:00.000
59,60,2019-02-09 14:45:00,728,6.0,857,109,27.0,44,113,0.0,2019-02-09 10:45:00.000
60,61,2019-02-09 15:00:00,677,6.0,840,106,27.0,47,111,0.0,2019-02-09 11:00:00.000
61,62,2019-02-09 15:15:00,623,6.0,822,103,27.1,51,110,0.0,2019-02-09 11:15:00.000
62,63,2019-02-09 15:30:00,566,6.0,800,99,27.1,54,109,0.0,2019-02-09 11:30:00.000
63,64,2019-02-09 15:45:00,507,6.0,775,94,27.1,58,108,0.0,2019-02-09 11:45:00.000
64,65,2019-02-09 16:00:00,446,6.1,745,89,27.1,61,108,0.0,2019-02-09 12:00:00.000
65,66,2019-02-09 16:15:00,383,6.1,709,83,27.2,65,107,0.0,2019-02-09 12:15:00.000
66,67,2019-02-09 16:30:00,320,6.1,665,77,27.2,69,107,0.0,2019-02-09 12:30:00.000
67,68,2019-02-09 16:45:00,257,6.1,611,69,27.2,72,106,0.0,2019-02-09 12:45:00.000
68,69,2019-02-09 17:00:00,178,6.1,353,89,27.2,76,106,8.8,2019-02-09 13:00:00.000
69,70,2019-02-09 17:15:00,126,6.1,343,63,27.2,79,106,5.3,2019-02-09 13:15:00.000
70,71,2019-02-09 17:30:00,78,6.1,333,37,27.2,83,105,0.0,2019-02-09 13:30:00.000
71,72,2019-02-09 17:45:00,31,6.1,130,20,27.1,87,105,0.0,2019-02-09 13:45:00.000
72,73,2019-02-09 18:00:00,3,6.1,6,2,27.1,90,105,0.0,2019-02-09 14:00:00.000
73,74,2019-02-09 18:15:00,0,6.0,0,0,27.1,94,105,0.0,2019-02-09 14:15:00.000
74,75,2019-02-09 18:30:00,0,6.0,0,0,27.0,97,105,0.0,2019-02-09 14:30:00.000
75,76,2019-02-09 18:45:00,0,6.0,0,0,27.0,101,105,0.0,2019-02-09 14:45:00.000
76,77,2019-02-09 19:00:00,0,6.0,0,0,26.9,105,105,0.0,2019-02-09 15:00:00.000
77,78,2019-02-09 19:15:00,0,6.0,0,0,26.9,108,106,0.0,2019-02-09 15:15:00.000
78,79,2019-02-09 19:30:00,0,6.0,0,0,26.9,112,106,0.0,2019-02-09 15:30:00.000
79,80,2019-02-09 19:45:00,0,5.9,0,0,26.8,116,106,0.0,2019-02-09 15:45:00.000
80,81,2019-02-09 20:00:00,0,5.9,0,0,26.8,119,107,0.0,2019-02-09 16:00:00.000
81,82,2019-02-09 20:15:00,0,5.9,0,0,26.8,123,108,0.0,2019-02-09 16:15:00.000
82,83,2019-02-09 20:30:00,0,5.8,0,0,26.9,126,108,0.0,2019-02-09 16:30:00.000
83,84,2019-02-09 20:45:00,0,5.8,0,0,26.9,130,109,0.0,2019-02-09 16:45:00.000
84,85,2019-02-09 21:00:00,0,5.8,0,0,26.9,133,110,0.0,2019-02-09 17:00:00.000
85,86,2019-02-09 21:15:00,0,5.7,0,0,27.0,137,112,0.0,2019-02-09 17:15:00.000
86,87,2019-02-09 21:30:00,0,5.7,0,0,27.0,140,113,0.0,2019-02-09 17:30:00.000
87,88,2019-02-09 21:45:00,0,5.7,0,0,27.0,144,115,0.0,2019-02-09 17:45:00.000
88,89,2019-02-09 22:00:00,0,5.6,0,0,27.1,147,118,0.0,2019-02-09 18:00:00.000
89,90,2019-02-09 22:15:00,0,5.6,0,0,27.1,150,120,0.0,2019-02-09 18:15:00.000
90,91,2019-02-09 22:30:00,0,5.5,0,0,27.1,154,124,0.0,2019-02-09 18:30:00.000
91,92,2019-02-09 22:45:00,0,5.5,0,0,27.2,157,129,0.0,2019-02-09 18:45:00.000
92,93,2019-02-09 23:00:00,0,5.5,0,0,27.2,159,135,0.0,2019-02-09 19:00:00.000
93,94,2019-02-09 23:15:00,0,5.4,0,0,27.2,162,143,0.0,2019-02-09 19:15:00.000
94,95,2019-02-09 23:30:00,0,5.4,0,0,27.1,164,153,0.0,2019-02-09 19:30:00.000
95,96,2019-02-09 23:45:00,0,5.4,0,0,27.1,165,166,0.0,2019-02-09 19:45:00.000
