,BLOCK_ID,DATA_DATETIME,GHI,WIND_SPEED,DNI,DHI,TEMPERATURE,ZENITH,AZIMUTH,CLOUD_OPACITY,ENTRY_TIME
0,1,2019-03-12 00:00:00,0,3.8,0,0,26.0,176,-166,52.0,2019-03-11 20:00:00.000
1,2,2019-03-12 00:15:00,0,3.8,0,0,26.0,174,-128,54.3,2019-03-11 20:15:00.000
2,3,2019-03-12 00:30:00,0,3.8,0,0,25.9,171,-113,52.0,2019-03-11 20:30:00.000
3,4,2019-03-12 00:45:00,0,3.8,0,0,25.9,167,-106,52.0,2019-03-11 20:45:00.000
4,5,2019-03-12 01:00:00,0,3.8,0,0,25.9,164,-103,52.0,2019-03-11 21:00:00.000
5,6,2019-03-12 01:15:00,0,3.8,0,0,25.9,160,-100,52.0,2019-03-11 21:15:00.000
6,7,2019-03-12 01:30:00,0,3.8,0,0,25.8,156,-99,52.0,2019-03-11 21:30:00.000
7,8,2019-03-12 01:45:00,0,3.9,0,0,25.8,153,-98,52.0,2019-03-11 21:45:00.000
8,9,2019-03-12 02:00:00,0,3.9,0,0,25.8,149,-97,42.0,2019-03-11 22:00:00.000
9,10,2019-03-12 02:15:00,0,3.9,0,0,25.8,145,-96,36.8,2019-03-11 22:15:00.000
10,11,2019-03-12 02:30:00,0,3.9,0,0,25.8,141,-96,30.9,2019-03-11 22:30:00.000
11,12,2019-03-12 02:45:00,0,4.0,0,0,25.8,138,-95,26.0,2019-03-11 22:45:00.000
12,13,2019-03-12 03:00:00,0,4.0,0,0,25.8,134,-95,36.8,2019-03-11 23:00:00.000
13,14,2019-03-12 03:15:00,0,4.0,0,0,25.8,130,-95,27.2,2019-03-11 23:15:00.000
14,15,2019-03-12 03:30:00,0,4.1,0,0,25.8,127,-95,37.0,2019-03-11 23:30:00.000
15,16,2019-03-12 03:45:00,0,4.1,0,0,25.8,123,-94,50.9,2019-03-11 23:45:00.000
16,17,2019-03-12 04:00:00,0,4.2,0,0,25.8,119,-94,39.0,2019-03-12 00:00:00.000
17,18,2019-03-12 04:15:00,0,4.2,0,0,25.8,115,-94,36.1,2019-03-12 00:15:00.000
18,19,2019-03-12 04:30:00,0,4.2,0,0,25.8,112,-94,30.6,2019-03-12 00:30:00.000
19,20,2019-03-12 04:45:00,0,4.3,0,0,25.8,108,-94,34.5,2019-03-12 00:45:00.000
20,21,2019-03-12 05:00:00,0,4.2,0,0,25.8,104,-94,6.9,2019-03-12 01:00:00.000
21,22,2019-03-12 05:15:00,0,4.1,0,0,25.8,100,-94,0.0,2019-03-12 01:15:00.000
22,23,2019-03-12 05:30:00,0,3.9,0,0,25.8,97,-94,0.0,2019-03-12 01:30:00.000
23,24,2019-03-12 05:45:00,0,3.7,0,0,25.8,93,-94,0.0,2019-03-12 01:45:00.000
24,25,2019-03-12 06:00:00,8,3.5,25,6,25.8,89,-94,0.0,2019-03-12 02:00:00.000
25,26,2019-03-12 06:15:00,39,3.3,86,31,25.8,85,-94,13.0,2019-03-12 02:15:00.000
26,27,2019-03-12 06:30:00,54,3.1,0,54,25.9,82,-94,44.4,2019-03-12 02:30:00.000
27,28,2019-03-12 06:45:00,118,2.9,56,105,25.9,78,-94,25.7,2019-03-12 02:45:00.000
28,29,2019-03-12 07:00:00,165,2.7,94,141,25.9,74,-94,25.0,2019-03-12 03:00:00.000
29,30,2019-03-12 07:15:00,188,2.5,0,188,25.9,70,-94,34.2,2019-03-12 03:15:00.000
30,31,2019-03-12 07:30:00,236,2.3,15,230,25.9,67,-95,33.0,2019-03-12 03:30:00.000
31,32,2019-03-12 07:45:00,382,2.2,521,143,25.9,63,-95,8.4,2019-03-12 03:45:00.000
32,33,2019-03-12 08:00:00,481,2.0,771,86,25.9,59,-95,0.0,2019-03-12 04:00:00.000
33,34,2019-03-12 08:15:00,524,2.0,704,127,25.9,55,-95,3.3,2019-03-12 04:15:00.000
34,35,2019-03-12 08:30:00,493,2.0,334,287,26.0,52,-96,18.2,2019-03-12 04:30:00.000
35,36,2019-03-12 08:45:00,552,2.1,386,294,26.0,48,-96,16.4,2019-03-12 04:45:00.000
36,37,2019-03-12 09:00:00,636,2.1,532,255,26.1,44,-96,11.0,2019-03-12 05:00:00.000
37,38,2019-03-12 09:15:00,696,2.2,592,246,26.1,41,-97,9.1,2019-03-12 05:15:00.000
38,39,2019-03-12 09:30:00,763,2.3,684,215,26.2,37,-98,6.2,2019-03-12 05:30:00.000
39,40,2019-03-12 09:45:00,825,2.4,766,182,26.2,33,-98,3.8,2019-03-12 05:45:00.000
40,41,2019-03-12 10:00:00,832,2.5,672,247,26.2,29,-99,7.2,2019-03-12 06:00:00.000
41,42,2019-03-12 10:15:00,865,2.6,676,256,26.3,26,-101,7.2,2019-03-12 06:15:00.000
42,43,2019-03-12 10:30:00,863,2.7,588,318,26.3,22,-102,10.3,2019-03-12 06:30:00.000
43,44,2019-03-12 10:45:00,692,2.9,149,552,26.4,18,-105,29.8,2019-03-12 06:45:00.000
44,45,2019-03-12 11:00:00,584,3.0,0,584,26.4,15,-108,41.9,2019-03-12 07:00:00.000
45,46,2019-03-12 11:15:00,697,3.1,84,615,26.4,11,-114,31.7,2019-03-12 07:15:00.000
46,47,2019-03-12 11:30:00,743,3.2,152,592,26.5,8,-125,27.9,2019-03-12 07:30:00.000
47,48,2019-03-12 11:45:00,750,3.3,157,593,26.5,5,-150,27.7,2019-03-12 07:45:00.000
48,49,2019-03-12 12:00:00,655,3.4,21,634,26.5,5,168,36.9,2019-03-12 08:00:00.000
49,50,2019-03-12 12:15:00,647,3.5,18,629,26.6,7,135,37.5,2019-03-12 08:15:00.000
50,51,2019-03-12 12:30:00,764,3.6,204,563,26.6,10,119,25.5,2019-03-12 08:30:00.000
51,52,2019-03-12 12:45:00,768,3.7,230,544,26.6,13,111,24.1,2019-03-12 08:45:00.000
52,53,2019-03-12 13:00:00,689,3.9,98,595,26.7,17,106,30.7,2019-03-12 09:00:00.000
53,54,2019-03-12 13:15:00,766,4.0,301,484,26.7,20,103,20.9,2019-03-12 09:15:00.000
54,55,2019-03-12 13:30:00,867,4.1,633,289,26.7,24,101,7.8,2019-03-12 09:30:00.000
55,56,2019-03-12 13:45:00,842,4.2,650,267,26.8,28,100,7.2,2019-03-12 09:45:00.000
56,57,2019-03-12 14:00:00,758,4.3,489,338,26.8,31,99,13.1,2019-03-12 10:00:00.000
57,58,2019-03-12 14:15:00,724,4.3,484,326,26.8,35,98,12.8,2019-03-12 10:15:00.000
58,59,2019-03-12 14:30:00,695,4.4,516,293,26.8,39,97,11.4,2019-03-12 10:30:00.000
59,60,2019-03-12 14:45:00,695,4.5,670,201,26.9,42,96,5.4,2019-03-12 10:45:00.000
60,61,2019-03-12 15:00:00,640,4.5,633,201,26.9,46,96,6.2,2019-03-12 11:00:00.000
61,62,2019-03-12 15:15:00,588,4.6,625,187,26.9,50,96,6.0,2019-03-12 11:15:00.000
62,63,2019-03-12 15:30:00,566,4.7,772,108,26.9,54,95,0.2,2019-03-12 11:30:00.000
63,64,2019-03-12 15:45:00,506,4.8,751,101,26.9,57,95,0.0,2019-03-12 11:45:00.000
64,65,2019-03-12 16:00:00,443,4.8,721,95,26.9,61,95,0.0,2019-03-12 12:00:00.000
65,66,2019-03-12 16:15:00,379,4.9,684,88,27.0,65,95,0.0,2019-03-12 12:15:00.000
66,67,2019-03-12 16:30:00,310,5.0,604,88,27.0,69,94,1.3,2019-03-12 12:30:00.000
67,68,2019-03-12 16:45:00,237,5.1,471,94,27.0,72,94,4.7,2019-03-12 12:45:00.000
68,69,2019-03-12 17:00:00,161,5.1,246,99,27.0,76,94,13.5,2019-03-12 13:00:00.000
69,70,2019-03-12 17:15:00,124,5.0,405,51,27.0,80,94,0.9,2019-03-12 13:15:00.000
70,71,2019-03-12 17:30:00,42,5.0,63,32,26.9,84,94,43.7,2019-03-12 13:30:00.000
71,72,2019-03-12 17:45:00,22,4.9,62,17,26.9,87,94,13.7,2019-03-12 13:45:00.000
72,73,2019-03-12 18:00:00,1,4.8,0,1,26.9,91,94,35.0,2019-03-12 14:00:00.000
73,74,2019-03-12 18:15:00,0,4.7,0,0,26.8,95,94,9.7,2019-03-12 14:15:00.000
74,75,2019-03-12 18:30:00,0,4.6,0,0,26.8,98,94,0.0,2019-03-12 14:30:00.000
75,76,2019-03-12 18:45:00,0,4.5,0,0,26.8,102,94,13.2,2019-03-12 14:45:00.000
76,77,2019-03-12 19:00:00,0,4.4,0,0,26.7,106,94,51.2,2019-03-12 15:00:00.000
77,78,2019-03-12 19:15:00,0,4.4,0,0,26.7,110,94,55.6,2019-03-12 15:15:00.000
78,79,2019-03-12 19:30:00,0,4.3,0,0,26.7,113,94,53.0,2019-03-12 15:30:00.000
79,80,2019-03-12 19:45:00,0,4.2,0,0,26.6,117,94,53.0,2019-03-12 15:45:00.000
80,81,2019-03-12 20:00:00,0,4.1,0,0,26.6,121,94,52.3,2019-03-12 16:00:00.000
81,82,2019-03-12 20:15:00,0,4.1,0,0,26.6,125,94,52.2,2019-03-12 16:15:00.000
82,83,2019-03-12 20:30:00,0,4.1,0,0,26.6,128,94,52.2,2019-03-12 16:30:00.000
83,84,2019-03-12 20:45:00,0,4.0,0,0,26.6,132,95,41.0,2019-03-12 16:45:00.000
84,85,2019-03-12 21:00:00,0,4.0,0,0,26.6,136,95,46.7,2019-03-12 17:00:00.000
85,86,2019-03-12 21:15:00,0,3.9,0,0,26.6,140,95,45.4,2019-03-12 17:15:00.000
86,87,2019-03-12 21:30:00,0,3.9,0,0,26.5,143,96,47.6,2019-03-12 17:30:00.000
87,88,2019-03-12 21:45:00,0,3.9,0,0,26.5,147,96,52.8,2019-03-12 17:45:00.000
88,89,2019-03-12 22:00:00,0,3.8,0,0,26.5,151,97,34.4,2019-03-12 18:00:00.000
89,90,2019-03-12 22:15:00,0,3.8,0,0,26.5,155,98,52.0,2019-03-12 18:15:00.000
90,91,2019-03-12 22:30:00,0,3.8,0,0,26.5,158,99,52.0,2019-03-12 18:30:00.000
91,92,2019-03-12 22:45:00,0,3.7,0,0,26.5,162,100,52.0,2019-03-12 18:45:00.000
92,93,2019-03-12 23:00:00,0,3.7,0,0,26.5,166,103,52.8,2019-03-12 19:00:00.000
93,94,2019-03-12 23:15:00,0,3.7,0,0,26.5,169,107,53.0,2019-03-12 19:15:00.000
94,95,2019-03-12 23:30:00,0,3.7,0,0,26.4,173,116,52.9,2019-03-12 19:30:00.000
95,96,2019-03-12 23:45:00,0,3.6,0,0,26.4,176,140,52.8,2019-03-12 19:45:00.000
