,BLOCK_ID,DATA_DATETIME,GHI,WIND_SPEED,DNI,DHI,TEMPERATURE,ZENITH,AZIMUTH,CLOUD_OPACITY,ENTRY_TIME
0,1,2021-07-02 00:00:00,0,0.6,0,0,22.6,156,-6,22.2,2021-07-01 20:00:00.000
1,2,2021-07-02 00:15:00,0,0.6,0,0,22.6,155,-14,24.9,2021-07-01 20:15:00.000
2,3,2021-07-02 00:30:00,0,0.6,0,0,22.5,154,-22,23.6,2021-07-01 20:30:00.000
3,4,2021-07-02 00:45:00,0,0.6,0,0,22.4,153,-29,47.9,2021-07-01 20:45:00.000
4,5,2021-07-02 01:00:00,0,0.6,0,0,22.4,151,-35,52.4,2021-07-01 21:00:00.000
5,6,2021-07-02 01:15:00,0,0.6,0,0,22.4,148,-40,45.2,2021-07-01 21:15:00.000
6,7,2021-07-02 01:30:00,0,0.7,0,0,22.4,146,-44,41.8,2021-07-01 21:30:00.000
7,8,2021-07-02 01:45:00,0,0.7,0,0,22.3,143,-48,51.1,2021-07-01 21:45:00.000
8,9,2021-07-02 02:00:00,0,0.7,0,0,22.3,140,-51,51.2,2021-07-01 22:00:00.000
9,10,2021-07-02 02:15:00,0,0.7,0,0,22.3,137,-54,31.2,2021-07-01 22:15:00.000
10,11,2021-07-02 02:30:00,0,0.7,0,0,22.3,134,-56,24.6,2021-07-01 22:30:00.000
11,12,2021-07-02 02:45:00,0,0.7,0,0,22.3,131,-58,40.3,2021-07-01 22:45:00.000
12,13,2021-07-02 03:00:00,0,0.7,0,0,22.3,128,-60,25.0,2021-07-01 23:00:00.000
13,14,2021-07-02 03:15:00,0,0.6,0,0,22.3,125,-61,22.3,2021-07-01 23:15:00.000
14,15,2021-07-02 03:30:00,0,0.6,0,0,22.3,121,-62,17.6,2021-07-01 23:30:00.000
15,16,2021-07-02 03:45:00,0,0.6,0,0,22.2,118,-63,27.4,2021-07-01 23:45:00.000
16,17,2021-07-02 04:00:00,0,0.6,0,0,22.2,115,-64,51.0,2021-07-02 00:00:00.000
17,18,2021-07-02 04:15:00,0,0.6,0,0,22.2,111,-65,52.3,2021-07-02 00:15:00.000
18,19,2021-07-02 04:30:00,0,0.6,0,0,22.2,108,-65,41.8,2021-07-02 00:30:00.000
19,20,2021-07-02 04:45:00,0,0.5,0,0,22.2,104,-66,21.5,2021-07-02 00:45:00.000
20,21,2021-07-02 05:00:00,0,0.5,0,0,22.2,101,-66,14.8,2021-07-02 01:00:00.000
21,22,2021-07-02 05:15:00,0,0.6,0,0,22.2,98,-67,15.5,2021-07-02 01:15:00.000
22,23,2021-07-02 05:30:00,0,0.6,0,0,22.2,94,-67,19.0,2021-07-02 01:30:00.000
23,24,2021-07-02 05:45:00,1,0.6,0,1,22.1,91,-67,45.7,2021-07-02 01:45:00.000
24,25,2021-07-02 06:00:00,17,0.7,0,17,22.2,87,-67,25.0,2021-07-02 02:00:00.000
25,26,2021-07-02 06:15:00,52,0.7,61,44,22.5,84,-67,15.3,2021-07-02 02:15:00.000
26,27,2021-07-02 06:30:00,101,0.7,272,55,22.9,80,-67,5.8,2021-07-02 02:30:00.000
27,28,2021-07-02 06:45:00,159,0.7,458,54,23.2,77,-66,0.0,2021-07-02 02:45:00.000
28,29,2021-07-02 07:00:00,213,0.6,524,63,23.6,73,-66,0.0,2021-07-02 03:00:00.000
29,30,2021-07-02 07:15:00,268,0.4,576,71,24.1,70,-65,0.0,2021-07-02 03:15:00.000
30,31,2021-07-02 07:30:00,323,0.2,618,78,24.5,67,-65,0.0,2021-07-02 03:30:00.000
31,32,2021-07-02 07:45:00,377,0.1,652,84,25.0,63,-64,0.0,2021-07-02 03:45:00.000
32,33,2021-07-02 08:00:00,430,0.2,680,89,25.5,60,-63,0.0,2021-07-02 04:00:00.000
33,34,2021-07-02 08:15:00,481,0.3,703,94,26.1,57,-62,0.0,2021-07-02 04:15:00.000
34,35,2021-07-02 08:30:00,531,0.5,723,99,26.7,53,-61,0.0,2021-07-02 04:30:00.000
35,36,2021-07-02 08:45:00,579,0.7,740,103,27.3,50,-60,0.0,2021-07-02 04:45:00.000
36,37,2021-07-02 09:00:00,624,0.9,755,107,27.8,47,-58,0.0,2021-07-02 05:00:00.000
37,38,2021-07-02 09:15:00,666,1.0,767,111,28.3,44,-56,0.0,2021-07-02 05:15:00.000
38,39,2021-07-02 09:30:00,704,1.1,777,115,28.7,41,-54,0.0,2021-07-02 05:30:00.000
39,40,2021-07-02 09:45:00,740,1.1,786,118,29.2,38,-51,0.0,2021-07-02 05:45:00.000
40,41,2021-07-02 10:00:00,772,1.2,793,121,29.6,35,-48,0.0,2021-07-02 06:00:00.000
41,42,2021-07-02 10:15:00,800,1.2,799,123,29.8,32,-44,0.0,2021-07-02 06:15:00.000
42,43,2021-07-02 10:30:00,824,1.1,802,126,29.9,30,-39,0.0,2021-07-02 06:30:00.000
43,44,2021-07-02 10:45:00,842,1.1,800,132,30.1,27,-33,0.0,2021-07-02 06:45:00.000
44,45,2021-07-02 11:00:00,802,1.0,615,247,30.1,26,-27,6.4,2021-07-02 07:00:00.000
45,46,2021-07-02 11:15:00,581,0.9,41,543,29.8,24,-20,33.0,2021-07-02 07:15:00.000
46,47,2021-07-02 11:30:00,487,0.8,8,480,29.5,23,-11,44.2,2021-07-02 07:30:00.000
47,48,2021-07-02 11:45:00,456,0.7,0,456,29.1,23,-3,47.9,2021-07-02 07:45:00.000
48,49,2021-07-02 12:00:00,655,0.6,237,436,28.8,23,6,25.2,2021-07-02 08:00:00.000
49,50,2021-07-02 12:15:00,858,0.5,743,175,28.4,23,15,1.4,2021-07-02 08:15:00.000
50,51,2021-07-02 12:30:00,812,0.5,624,245,28.0,25,23,5.6,2021-07-02 08:30:00.000
51,52,2021-07-02 12:45:00,798,0.4,621,241,27.6,26,30,5.7,2021-07-02 08:45:00.000
52,53,2021-07-02 13:00:00,617,0.4,169,467,27.3,28,36,25.6,2021-07-02 09:00:00.000
53,54,2021-07-02 13:15:00,441,0.4,68,382,27.2,31,41,45.5,2021-07-02 09:15:00.000
54,55,2021-07-02 13:30:00,112,0.3,0,112,27.1,33,45,85.6,2021-07-02 09:30:00.000
55,56,2021-07-02 13:45:00,110,0.3,0,110,27.0,36,49,85.3,2021-07-02 09:45:00.000
56,57,2021-07-02 14:00:00,71,0.2,0,71,26.9,39,52,90.2,2021-07-02 10:00:00.000
57,58,2021-07-02 14:15:00,67,0.2,0,67,26.8,42,55,90.2,2021-07-02 10:15:00.000
58,59,2021-07-02 14:30:00,24,0.1,0,24,26.6,45,57,96.2,2021-07-02 10:30:00.000
59,60,2021-07-02 14:45:00,20,0.0,0,20,26.5,48,59,96.6,2021-07-02 10:45:00.000
60,61,2021-07-02 15:00:00,40,0.1,0,40,26.3,51,60,92.7,2021-07-02 11:00:00.000
61,62,2021-07-02 15:15:00,98,0.2,0,98,26.1,55,62,80.5,2021-07-02 11:15:00.000
62,63,2021-07-02 15:30:00,118,0.2,0,118,25.9,58,63,73.9,2021-07-02 11:30:00.000
63,64,2021-07-02 15:45:00,130,0.3,0,130,25.7,61,64,67.4,2021-07-02 11:45:00.000
64,65,2021-07-02 16:00:00,126,0.4,0,126,25.5,65,65,63.6,2021-07-02 12:00:00.000
65,66,2021-07-02 16:15:00,66,0.5,0,66,25.3,68,65,77.4,2021-07-02 12:15:00.000
66,67,2021-07-02 16:30:00,55,0.7,0,55,25.1,72,66,76.8,2021-07-02 12:30:00.000
67,68,2021-07-02 16:45:00,49,0.9,0,49,24.9,75,66,72.5,2021-07-02 12:45:00.000
68,69,2021-07-02 17:00:00,53,1.0,0,53,24.6,78,66,59.6,2021-07-02 13:00:00.000
69,70,2021-07-02 17:15:00,38,1.1,0,38,24.4,82,67,54.6,2021-07-02 13:15:00.000
70,71,2021-07-02 17:30:00,18,1.1,0,18,24.1,85,67,55.2,2021-07-02 13:30:00.000
71,72,2021-07-02 17:45:00,1,1.2,0,1,23.8,89,67,88.1,2021-07-02 13:45:00.000
72,73,2021-07-02 18:00:00,0,1.3,0,0,23.5,92,67,85.8,2021-07-02 14:00:00.000
73,74,2021-07-02 18:15:00,0,1.2,0,0,23.4,96,67,87.3,2021-07-02 14:15:00.000
74,75,2021-07-02 18:30:00,0,1.2,0,0,23.2,99,66,91.2,2021-07-02 14:30:00.000
75,76,2021-07-02 18:45:00,0,1.2,0,0,23.1,103,66,76.9,2021-07-02 14:45:00.000
76,77,2021-07-02 19:00:00,0,1.2,0,0,23.0,106,66,82.8,2021-07-02 15:00:00.000
77,78,2021-07-02 19:15:00,0,1.2,0,0,23.0,109,65,90.2,2021-07-02 15:15:00.000
78,79,2021-07-02 19:30:00,0,1.2,0,0,22.9,113,64,93.0,2021-07-02 15:30:00.000
79,80,2021-07-02 19:45:00,0,1.2,0,0,22.9,116,64,97.0,2021-07-02 15:45:00.000
80,81,2021-07-02 20:00:00,0,1.3,0,0,22.9,119,63,97.0,2021-07-02 16:00:00.000
81,82,2021-07-02 20:15:00,0,1.3,0,0,22.8,123,62,95.4,2021-07-02 16:15:00.000
82,83,2021-07-02 20:30:00,0,1.3,0,0,22.8,126,60,95.6,2021-07-02 16:30:00.000
83,84,2021-07-02 20:45:00,0,1.3,0,0,22.7,129,59,96.0,2021-07-02 16:45:00.000
84,85,2021-07-02 21:00:00,0,1.3,0,0,22.7,133,57,96.8,2021-07-02 17:00:00.000
85,86,2021-07-02 21:15:00,0,1.2,0,0,22.6,136,55,96.0,2021-07-02 17:15:00.000
86,87,2021-07-02 21:30:00,0,1.2,0,0,22.6,139,53,96.8,2021-07-02 17:30:00.000
87,88,2021-07-02 21:45:00,0,1.1,0,0,22.5,142,50,97.0,2021-07-02 17:45:00.000
88,89,2021-07-02 22:00:00,0,1.0,0,0,22.5,144,46,97.0,2021-07-02 18:00:00.000
89,90,2021-07-02 22:15:00,0,1.0,0,0,22.5,147,42,96.3,2021-07-02 18:15:00.000
90,91,2021-07-02 22:30:00,0,1.1,0,0,22.4,149,38,97.0,2021-07-02 18:30:00.000
91,92,2021-07-02 22:45:00,0,1.1,0,0,22.4,152,32,97.0,2021-07-02 18:45:00.000
92,93,2021-07-02 23:00:00,0,1.1,0,0,22.4,153,26,96.2,2021-07-02 19:00:00.000
93,94,2021-07-02 23:15:00,0,1.0,0,0,22.4,155,19,96.7,2021-07-02 19:15:00.000
94,95,2021-07-02 23:30:00,0,0.9,0,0,22.3,156,11,96.7,2021-07-02 19:30:00.000
95,96,2021-07-02 23:45:00,0,0.7,0,0,22.3,156,2,97.0,2021-07-02 19:45:00.000
