,BLOCK_ID,DATA_DATETIME,GHI,WIND_SPEED,DNI,DHI,TEMPERATURE,ZENITH,AZIMUTH,CLOUD_OPACITY,ENTRY_TIME
0,1,2020-09-07 00:00:00,0,0.7,0,0,23.0,172,-29,30.0,2020-09-06 20:00:00.000
1,2,2020-09-07 00:15:00,0,0.6,0,0,23.0,169,-47,19.4,2020-09-06 20:15:00.000
2,3,2020-09-07 00:30:00,0,0.6,0,0,22.9,166,-58,18.8,2020-09-06 20:30:00.000
3,4,2020-09-07 00:45:00,0,0.6,0,0,22.9,163,-65,20.7,2020-09-06 20:45:00.000
4,5,2020-09-07 01:00:00,0,0.6,0,0,22.8,160,-69,4.0,2020-09-06 21:00:00.000
5,6,2020-09-07 01:15:00,0,0.6,0,0,22.8,156,-72,0.0,2020-09-06 21:15:00.000
6,7,2020-09-07 01:30:00,0,0.7,0,0,22.8,153,-75,12.0,2020-09-06 21:30:00.000
7,8,2020-09-07 01:45:00,0,0.7,0,0,22.8,149,-76,15.0,2020-09-06 21:45:00.000
8,9,2020-09-07 02:00:00,0,0.8,0,0,22.8,145,-78,15.8,2020-09-06 22:00:00.000
9,10,2020-09-07 02:15:00,0,0.7,0,0,22.8,142,-79,16.0,2020-09-06 22:15:00.000
10,11,2020-09-07 02:30:00,0,0.7,0,0,22.7,138,-80,15.2,2020-09-06 22:30:00.000
11,12,2020-09-07 02:45:00,0,0.6,0,0,22.7,134,-80,15.3,2020-09-06 22:45:00.000
12,13,2020-09-07 03:00:00,0,0.6,0,0,22.7,131,-81,16.0,2020-09-06 23:00:00.000
13,14,2020-09-07 03:15:00,0,0.5,0,0,22.7,127,-81,20.3,2020-09-06 23:15:00.000
14,15,2020-09-07 03:30:00,0,0.5,0,0,22.7,123,-82,19.4,2020-09-06 23:30:00.000
15,16,2020-09-07 03:45:00,0,0.5,0,0,22.6,119,-82,16.0,2020-09-06 23:45:00.000
16,17,2020-09-07 04:00:00,0,0.4,0,0,22.6,116,-83,16.0,2020-09-07 00:00:00.000
17,18,2020-09-07 04:15:00,0,0.4,0,0,22.6,112,-83,18.3,2020-09-07 00:15:00.000
18,19,2020-09-07 04:30:00,0,0.3,0,0,22.6,108,-83,16.6,2020-09-07 00:30:00.000
19,20,2020-09-07 04:45:00,0,0.3,0,0,22.5,105,-83,16.0,2020-09-07 00:45:00.000
20,21,2020-09-07 05:00:00,0,0.3,0,0,22.5,101,-83,15.2,2020-09-07 01:00:00.000
21,22,2020-09-07 05:15:00,0,0.3,0,0,22.6,97,-83,15.0,2020-09-07 01:15:00.000
22,23,2020-09-07 05:30:00,0,0.3,0,0,22.6,93,-84,11.6,2020-09-07 01:30:00.000
23,24,2020-09-07 05:45:00,4,0.3,0,4,22.6,90,-84,4.8,2020-09-07 01:45:00.000
24,25,2020-09-07 06:00:00,34,0.4,134,23,22.7,86,-84,3.2,2020-09-07 02:00:00.000
25,26,2020-09-07 06:15:00,80,0.4,301,39,23.1,82,-84,0.0,2020-09-07 02:15:00.000
26,27,2020-09-07 06:30:00,126,0.4,301,67,23.5,78,-84,5.6,2020-09-07 02:30:00.000
27,28,2020-09-07 06:45:00,192,0.4,488,64,23.9,75,-84,0.0,2020-09-07 02:45:00.000
28,29,2020-09-07 07:00:00,236,0.4,408,104,24.4,71,-83,6.4,2020-09-07 03:00:00.000
29,30,2020-09-07 07:15:00,277,0.3,339,147,24.9,67,-83,11.5,2020-09-07 03:15:00.000
30,31,2020-09-07 07:30:00,342,0.3,434,148,25.4,64,-83,8.6,2020-09-07 03:30:00.000
31,32,2020-09-07 07:45:00,379,0.3,365,195,26.0,60,-83,12.7,2020-09-07 03:45:00.000
32,33,2020-09-07 08:00:00,430,0.4,382,217,26.4,56,-83,12.8,2020-09-07 04:00:00.000
33,34,2020-09-07 08:15:00,516,0.3,559,173,26.6,52,-82,6.3,2020-09-07 04:15:00.000
34,35,2020-09-07 08:30:00,604,0.2,743,113,26.8,49,-82,0.0,2020-09-07 04:30:00.000
35,36,2020-09-07 08:45:00,655,0.3,759,118,27.0,45,-82,0.0,2020-09-07 04:45:00.000
36,37,2020-09-07 09:00:00,704,0.4,773,122,27.2,41,-81,0.0,2020-09-07 05:00:00.000
37,38,2020-09-07 09:15:00,749,0.5,785,127,27.3,38,-80,0.0,2020-09-07 05:15:00.000
38,39,2020-09-07 09:30:00,790,0.5,795,130,27.5,34,-79,0.0,2020-09-07 05:30:00.000
39,40,2020-09-07 09:45:00,800,0.6,712,186,27.6,30,-78,3.3,2020-09-07 05:45:00.000
40,41,2020-09-07 10:00:00,795,0.6,588,268,27.7,26,-77,7.8,2020-09-07 06:00:00.000
41,42,2020-09-07 10:15:00,870,0.7,750,180,27.8,23,-75,2.4,2020-09-07 06:15:00.000
42,43,2020-09-07 10:30:00,807,0.8,488,347,27.9,19,-72,12.0,2020-09-07 06:30:00.000
43,44,2020-09-07 10:45:00,648,0.8,95,558,28.0,16,-68,30.8,2020-09-07 06:45:00.000
44,45,2020-09-07 11:00:00,532,0.9,0,532,28.1,12,-62,44.2,2020-09-07 07:00:00.000
45,46,2020-09-07 11:15:00,559,0.9,17,543,28.0,9,-51,42.1,2020-09-07 07:15:00.000
46,47,2020-09-07 11:30:00,605,1.0,11,594,28.0,7,-30,37.8,2020-09-07 07:30:00.000
47,48,2020-09-07 11:45:00,471,1.0,0,471,28.0,6,3,51.7,2020-09-07 07:45:00.000
48,49,2020-09-07 12:00:00,445,1.0,0,445,28.0,7,35,54.2,2020-09-07 08:00:00.000
49,50,2020-09-07 12:15:00,434,1.1,0,434,28.0,10,54,55.0,2020-09-07 08:15:00.000
50,51,2020-09-07 12:30:00,158,1.1,0,158,27.9,13,63,83.4,2020-09-07 08:30:00.000
51,52,2020-09-07 12:45:00,175,1.1,0,175,27.9,16,69,81.3,2020-09-07 08:45:00.000
52,53,2020-09-07 13:00:00,73,1.1,0,73,27.9,20,73,92.0,2020-09-07 09:00:00.000
53,54,2020-09-07 13:15:00,87,1.2,0,87,27.7,23,76,90.2,2020-09-07 09:15:00.000
54,55,2020-09-07 13:30:00,81,1.2,0,81,27.5,27,77,90.6,2020-09-07 09:30:00.000
55,56,2020-09-07 13:45:00,25,1.3,0,25,27.3,31,79,97.0,2020-09-07 09:45:00.000
56,57,2020-09-07 14:00:00,30,1.3,0,30,27.1,34,80,96.2,2020-09-07 10:00:00.000
57,58,2020-09-07 14:15:00,22,1.3,0,22,26.9,38,81,97.0,2020-09-07 10:15:00.000
58,59,2020-09-07 14:30:00,21,1.2,0,21,26.6,42,81,97.0,2020-09-07 10:30:00.000
59,60,2020-09-07 14:45:00,29,1.1,0,29,26.4,46,82,95.5,2020-09-07 10:45:00.000
60,61,2020-09-07 15:00:00,24,1.0,0,24,26.2,49,82,96.0,2020-09-07 11:00:00.000
61,62,2020-09-07 15:15:00,64,1.0,0,64,26.0,53,83,88.4,2020-09-07 11:15:00.000
62,63,2020-09-07 15:30:00,41,0.9,0,41,25.8,57,83,91.6,2020-09-07 11:30:00.000
63,64,2020-09-07 15:45:00,19,0.9,0,19,25.6,60,83,95.5,2020-09-07 11:45:00.000
64,65,2020-09-07 16:00:00,35,0.9,0,35,25.5,64,83,90.4,2020-09-07 12:00:00.000
65,66,2020-09-07 16:15:00,25,0.9,0,25,25.2,68,84,92.1,2020-09-07 12:15:00.000
66,67,2020-09-07 16:30:00,15,0.9,0,15,25.0,72,84,93.8,2020-09-07 12:30:00.000
67,68,2020-09-07 16:45:00,20,0.9,0,20,24.8,75,84,89.4,2020-09-07 12:45:00.000
68,69,2020-09-07 17:00:00,17,0.9,0,17,24.6,79,84,86.4,2020-09-07 13:00:00.000
69,70,2020-09-07 17:15:00,17,0.8,0,17,24.4,83,84,74.0,2020-09-07 13:15:00.000
70,71,2020-09-07 17:30:00,10,0.8,0,10,24.2,87,84,69.0,2020-09-07 13:30:00.000
71,72,2020-09-07 17:45:00,0,0.7,0,0,24.1,90,84,86.7,2020-09-07 13:45:00.000
72,73,2020-09-07 18:00:00,0,0.7,0,0,23.9,94,84,87.7,2020-09-07 14:00:00.000
73,74,2020-09-07 18:15:00,0,0.7,0,0,23.9,98,84,92.9,2020-09-07 14:15:00.000
74,75,2020-09-07 18:30:00,0,0.7,0,0,23.9,101,84,96.6,2020-09-07 14:30:00.000
75,76,2020-09-07 18:45:00,0,0.7,0,0,23.9,105,83,90.3,2020-09-07 14:45:00.000
76,77,2020-09-07 19:00:00,0,0.7,0,0,23.8,109,83,53.4,2020-09-07 15:00:00.000
77,78,2020-09-07 19:15:00,0,0.7,0,0,23.8,113,83,23.0,2020-09-07 15:15:00.000
78,79,2020-09-07 19:30:00,0,0.7,0,0,23.8,116,83,21.4,2020-09-07 15:30:00.000
79,80,2020-09-07 19:45:00,0,0.7,0,0,23.8,120,82,0.0,2020-09-07 15:45:00.000
80,81,2020-09-07 20:00:00,0,0.7,0,0,23.8,124,82,0.0,2020-09-07 16:00:00.000
81,82,2020-09-07 20:15:00,0,0.7,0,0,23.8,128,82,23.9,2020-09-07 16:15:00.000
82,83,2020-09-07 20:30:00,0,0.8,0,0,23.7,131,81,15.8,2020-09-07 16:30:00.000
83,84,2020-09-07 20:45:00,0,0.9,0,0,23.7,135,81,12.6,2020-09-07 16:45:00.000
84,85,2020-09-07 21:00:00,0,1.0,0,0,23.6,139,80,0.0,2020-09-07 17:00:00.000
85,86,2020-09-07 21:15:00,0,1.1,0,0,23.6,142,79,21.4,2020-09-07 17:15:00.000
86,87,2020-09-07 21:30:00,0,1.2,0,0,23.5,146,78,17.4,2020-09-07 17:30:00.000
87,88,2020-09-07 21:45:00,0,1.3,0,0,23.4,150,77,30.6,2020-09-07 17:45:00.000
88,89,2020-09-07 22:00:00,0,1.3,0,0,23.3,153,75,42.2,2020-09-07 18:00:00.000
89,90,2020-09-07 22:15:00,0,1.3,0,0,23.3,157,73,55.1,2020-09-07 18:15:00.000
90,91,2020-09-07 22:30:00,0,1.3,0,0,23.2,160,69,58.4,2020-09-07 18:30:00.000
91,92,2020-09-07 22:45:00,0,1.2,0,0,23.1,164,65,33.5,2020-09-07 18:45:00.000
92,93,2020-09-07 23:00:00,0,1.2,0,0,23.1,167,58,16.4,2020-09-07 19:00:00.000
93,94,2020-09-07 23:15:00,0,1.1,0,0,23.0,170,46,11.2,2020-09-07 19:15:00.000
94,95,2020-09-07 23:30:00,0,1.1,0,0,23.0,172,26,16.8,2020-09-07 19:30:00.000
95,96,2020-09-07 23:45:00,0,1.1,0,0,22.9,173,-3,5.4,2020-09-07 19:45:00.000
