,BLOCK_ID,DATA_DATETIME,GHI,WIND_SPEED,DNI,DHI,TEMPERATURE,ZENITH,AZIMUTH,CLOUD_OPACITY,ENTRY_TIME
0,1,2019-03-30 00:00:00,0,0.9,0,0,26.6,176,-31,51.3,2019-03-29 20:00:00.000
1,2,2019-03-30 00:15:00,0,0.9,0,0,26.6,173,-58,51.2,2019-03-29 20:15:00.000
2,3,2019-03-30 00:30:00,0,1.0,0,0,26.5,170,-70,51.2,2019-03-29 20:30:00.000
3,4,2019-03-30 00:45:00,0,1.0,0,0,26.5,166,-75,51.2,2019-03-29 20:45:00.000
4,5,2019-03-30 01:00:00,0,1.0,0,0,26.5,162,-78,51.2,2019-03-29 21:00:00.000
5,6,2019-03-30 01:15:00,0,1.1,0,0,26.5,159,-80,51.2,2019-03-29 21:15:00.000
6,7,2019-03-30 01:30:00,0,1.1,0,0,26.5,155,-82,51.2,2019-03-29 21:30:00.000
7,8,2019-03-30 01:45:00,0,1.1,0,0,26.5,151,-83,51.2,2019-03-29 21:45:00.000
8,9,2019-03-30 02:00:00,0,1.1,0,0,26.5,148,-83,41.2,2019-03-29 22:00:00.000
9,10,2019-03-30 02:15:00,0,1.2,0,0,26.5,144,-84,37.0,2019-03-29 22:15:00.000
10,11,2019-03-30 02:30:00,0,1.2,0,0,26.5,140,-85,37.2,2019-03-29 22:30:00.000
11,12,2019-03-30 02:45:00,0,1.2,0,0,26.4,136,-85,36.9,2019-03-29 22:45:00.000
12,13,2019-03-30 03:00:00,0,1.2,0,0,26.4,133,-85,36.0,2019-03-29 23:00:00.000
13,14,2019-03-30 03:15:00,0,1.2,0,0,26.4,129,-86,36.0,2019-03-29 23:15:00.000
14,15,2019-03-30 03:30:00,0,1.3,0,0,26.4,125,-86,36.0,2019-03-29 23:30:00.000
15,16,2019-03-30 03:45:00,0,1.3,0,0,26.4,121,-86,36.3,2019-03-29 23:45:00.000
16,17,2019-03-30 04:00:00,0,1.3,0,0,26.4,118,-86,36.8,2019-03-30 00:00:00.000
17,18,2019-03-30 04:15:00,0,1.3,0,0,26.3,114,-86,36.8,2019-03-30 00:15:00.000
18,19,2019-03-30 04:30:00,0,1.4,0,0,26.3,110,-87,39.2,2019-03-30 00:30:00.000
19,20,2019-03-30 04:45:00,0,1.4,0,0,26.3,106,-87,33.5,2019-03-30 00:45:00.000
20,21,2019-03-30 05:00:00,0,1.4,0,0,26.3,103,-87,25.2,2019-03-30 01:00:00.000
21,22,2019-03-30 05:15:00,0,1.3,0,0,26.3,99,-87,39.0,2019-03-30 01:15:00.000
22,23,2019-03-30 05:30:00,0,1.1,0,0,26.4,95,-87,32.4,2019-03-30 01:30:00.000
23,24,2019-03-30 05:45:00,0,1.0,0,0,26.4,91,-87,30.6,2019-03-30 01:45:00.000
24,25,2019-03-30 06:00:00,12,0.9,0,12,26.4,88,-87,37.5,2019-03-30 02:00:00.000
25,26,2019-03-30 06:15:00,34,0.8,0,34,26.5,84,-87,41.4,2019-03-30 02:15:00.000
26,27,2019-03-30 06:30:00,56,0.7,0,56,26.5,80,-87,52.2,2019-03-30 02:30:00.000
27,28,2019-03-30 06:45:00,99,0.6,0,99,26.5,77,-87,44.2,2019-03-30 02:45:00.000
28,29,2019-03-30 07:00:00,158,0.5,0,158,26.6,73,-87,33.5,2019-03-30 03:00:00.000
29,30,2019-03-30 07:15:00,201,0.5,0,201,26.6,69,-87,33.2,2019-03-30 03:15:00.000
30,31,2019-03-30 07:30:00,219,0.4,0,219,26.6,65,-87,40.0,2019-03-30 03:30:00.000
31,32,2019-03-30 07:45:00,246,0.5,0,246,26.7,62,-87,42.7,2019-03-30 03:45:00.000
32,33,2019-03-30 08:00:00,298,0.5,0,298,26.7,58,-87,39.4,2019-03-30 04:00:00.000
33,34,2019-03-30 08:15:00,371,0.5,31,353,26.7,54,-87,32.7,2019-03-30 04:15:00.000
34,35,2019-03-30 08:30:00,448,0.5,144,355,26.7,50,-87,26.6,2019-03-30 04:30:00.000
35,36,2019-03-30 08:45:00,600,0.6,528,234,26.7,46,-86,10.0,2019-03-30 04:45:00.000
36,37,2019-03-30 09:00:00,659,0.6,582,233,26.7,43,-86,8.1,2019-03-30 05:00:00.000
37,38,2019-03-30 09:15:00,711,0.7,615,234,26.7,39,-86,7.2,2019-03-30 05:15:00.000
38,39,2019-03-30 09:30:00,683,0.8,396,360,26.7,35,-86,15.9,2019-03-30 05:30:00.000
39,40,2019-03-30 09:45:00,708,0.9,373,390,26.7,32,-85,17.1,2019-03-30 05:45:00.000
40,41,2019-03-30 10:00:00,741,0.9,382,403,26.7,28,-84,16.9,2019-03-30 06:00:00.000
41,42,2019-03-30 10:15:00,770,1.0,393,412,26.7,24,-84,16.6,2019-03-30 06:15:00.000
42,43,2019-03-30 10:30:00,785,1.1,371,437,26.7,20,-83,17.6,2019-03-30 06:30:00.000
43,44,2019-03-30 10:45:00,812,1.2,391,437,26.7,17,-81,16.8,2019-03-30 06:45:00.000
44,45,2019-03-30 11:00:00,832,1.3,402,440,26.7,13,-79,16.2,2019-03-30 07:00:00.000
45,46,2019-03-30 11:15:00,786,1.5,271,519,26.8,9,-74,21.8,2019-03-30 07:15:00.000
46,47,2019-03-30 11:30:00,901,1.6,530,373,26.8,6,-64,11.2,2019-03-30 07:30:00.000
47,48,2019-03-30 11:45:00,939,1.8,622,318,26.8,3,-27,7.8,2019-03-30 07:45:00.000
48,49,2019-03-30 12:00:00,914,1.9,556,360,26.8,4,40,10.2,2019-03-30 08:00:00.000
49,50,2019-03-30 12:15:00,907,2.1,550,361,26.9,7,67,10.4,2019-03-30 08:15:00.000
50,51,2019-03-30 12:30:00,899,2.3,551,356,26.9,10,75,10.2,2019-03-30 08:30:00.000
51,52,2019-03-30 12:45:00,716,2.4,153,566,26.9,14,79,27.4,2019-03-30 08:45:00.000
52,53,2019-03-30 13:00:00,505,2.6,4,501,26.9,17,81,47.7,2019-03-30 09:00:00.000
53,54,2019-03-30 13:15:00,390,2.8,0,390,27.0,21,83,58.6,2019-03-30 09:15:00.000
54,55,2019-03-30 13:30:00,255,2.9,0,255,27.0,25,84,72.0,2019-03-30 09:30:00.000
55,56,2019-03-30 13:45:00,430,3.1,26,408,27.0,29,85,50.8,2019-03-30 09:45:00.000
56,57,2019-03-30 14:00:00,718,3.2,433,353,27.0,32,85,14.4,2019-03-30 10:00:00.000
57,58,2019-03-30 14:15:00,514,3.4,15,502,27.1,36,85,35.6,2019-03-30 10:15:00.000
58,59,2019-03-30 14:30:00,478,3.5,0,478,27.1,40,86,36.4,2019-03-30 10:30:00.000
59,60,2019-03-30 14:45:00,464,3.6,32,442,27.1,44,86,33.7,2019-03-30 10:45:00.000
60,61,2019-03-30 15:00:00,364,3.8,21,349,27.1,47,86,44.0,2019-03-30 11:00:00.000
61,62,2019-03-30 15:15:00,294,3.9,0,294,27.1,51,86,50.3,2019-03-30 11:15:00.000
62,63,2019-03-30 15:30:00,248,4.0,0,248,27.1,55,87,53.7,2019-03-30 11:30:00.000
63,64,2019-03-30 15:45:00,271,4.2,0,271,27.1,59,87,42.6,2019-03-30 11:45:00.000
64,65,2019-03-30 16:00:00,331,4.3,246,218,27.1,62,87,19.3,2019-03-30 12:00:00.000
65,66,2019-03-30 16:15:00,273,4.4,160,206,27.2,66,87,22.0,2019-03-30 12:15:00.000
66,67,2019-03-30 16:30:00,157,4.6,1,156,27.2,70,87,45.3,2019-03-30 12:30:00.000
67,68,2019-03-30 16:45:00,139,4.7,0,139,27.2,74,87,37.3,2019-03-30 12:45:00.000
68,69,2019-03-30 17:00:00,91,4.8,0,91,27.2,77,87,43.1,2019-03-30 13:00:00.000
69,70,2019-03-30 17:15:00,44,4.8,0,44,27.2,81,87,56.1,2019-03-30 13:15:00.000
70,71,2019-03-30 17:30:00,18,4.7,0,18,27.2,85,87,66.8,2019-03-30 13:30:00.000
71,72,2019-03-30 17:45:00,7,4.7,0,7,27.1,89,87,44.4,2019-03-30 13:45:00.000
72,73,2019-03-30 18:00:00,0,4.7,0,0,27.1,92,87,55.0,2019-03-30 14:00:00.000
73,74,2019-03-30 18:15:00,0,4.7,0,0,27.1,96,87,57.2,2019-03-30 14:15:00.000
74,75,2019-03-30 18:30:00,0,4.6,0,0,27.1,100,87,77.9,2019-03-30 14:30:00.000
75,76,2019-03-30 18:45:00,0,4.6,0,0,27.1,103,87,71.6,2019-03-30 14:45:00.000
76,77,2019-03-30 19:00:00,0,4.6,0,0,27.1,107,86,52.0,2019-03-30 15:00:00.000
77,78,2019-03-30 19:15:00,0,4.6,0,0,27.0,111,86,19.0,2019-03-30 15:15:00.000
78,79,2019-03-30 19:30:00,0,4.5,0,0,27.0,115,86,44.6,2019-03-30 15:30:00.000
79,80,2019-03-30 19:45:00,0,4.5,0,0,27.0,118,86,51.8,2019-03-30 15:45:00.000
80,81,2019-03-30 20:00:00,0,4.5,0,0,27.0,122,86,52.2,2019-03-30 16:00:00.000
81,82,2019-03-30 20:15:00,0,4.6,0,0,27.0,126,85,37.0,2019-03-30 16:15:00.000
82,83,2019-03-30 20:30:00,0,4.6,0,0,27.0,130,85,39.1,2019-03-30 16:30:00.000
83,84,2019-03-30 20:45:00,0,4.6,0,0,27.1,133,85,36.2,2019-03-30 16:45:00.000
84,85,2019-03-30 21:00:00,0,4.7,0,0,27.1,137,84,36.2,2019-03-30 17:00:00.000
85,86,2019-03-30 21:15:00,0,4.7,0,0,27.1,141,84,36.2,2019-03-30 17:15:00.000
86,87,2019-03-30 21:30:00,0,4.8,0,0,27.1,145,83,36.4,2019-03-30 17:30:00.000
87,88,2019-03-30 21:45:00,0,4.8,0,0,27.1,148,83,36.8,2019-03-30 17:45:00.000
88,89,2019-03-30 22:00:00,0,4.8,0,0,27.1,152,82,37.0,2019-03-30 18:00:00.000
89,90,2019-03-30 22:15:00,0,4.9,0,0,27.2,156,80,0.0,2019-03-30 18:15:00.000
90,91,2019-03-30 22:30:00,0,4.9,0,0,27.2,159,79,0.0,2019-03-30 18:30:00.000
91,92,2019-03-30 22:45:00,0,5.0,0,0,27.2,163,76,0.0,2019-03-30 18:45:00.000
92,93,2019-03-30 23:00:00,0,5.0,0,0,27.2,167,73,0.0,2019-03-30 19:00:00.000
93,94,2019-03-30 23:15:00,0,4.9,0,0,27.2,170,66,0.0,2019-03-30 19:15:00.000
94,95,2019-03-30 23:30:00,0,4.9,0,0,27.1,173,52,0.0,2019-03-30 19:30:00.000
95,96,2019-03-30 23:45:00,0,4.8,0,0,27.1,176,19,11.1,2019-03-30 19:45:00.000
