,BLOCK_ID,DATA_DATETIME,GHI,WIND_SPEED,DNI,DHI,TEMPERATURE,ZENITH,AZIMUTH,CLOUD_OPACITY,ENTRY_TIME
0,1,2018-11-29 00:00:00,0,2.2,0,0,27.4,159,-163,0.0,2018-11-28 20:00:00.000
1,2,2018-11-29 00:15:00,0,2.2,0,0,27.4,157,-155,0.0,2018-11-28 20:15:00.000
2,3,2018-11-29 00:30:00,0,2.1,0,0,27.3,155,-147,0.0,2018-11-28 20:30:00.000
3,4,2018-11-29 00:45:00,0,2.1,0,0,27.3,153,-141,0.0,2018-11-28 20:45:00.000
4,5,2018-11-29 01:00:00,0,2.0,0,0,27.3,151,-136,0.0,2018-11-28 21:00:00.000
5,6,2018-11-29 01:15:00,0,2.0,0,0,27.2,148,-131,0.0,2018-11-28 21:15:00.000
6,7,2018-11-29 01:30:00,0,1.9,0,0,27.2,145,-128,0.0,2018-11-28 21:30:00.000
7,8,2018-11-29 01:45:00,0,1.9,0,0,27.1,142,-125,0.0,2018-11-28 21:45:00.000
8,9,2018-11-29 02:00:00,0,1.8,0,0,27.1,139,-122,0.0,2018-11-28 22:00:00.000
9,10,2018-11-29 02:15:00,0,1.8,0,0,27.1,136,-120,0.0,2018-11-28 22:15:00.000
10,11,2018-11-29 02:30:00,0,1.7,0,0,27.0,132,-119,0.0,2018-11-28 22:30:00.000
11,12,2018-11-29 02:45:00,0,1.7,0,0,27.0,129,-117,0.0,2018-11-28 22:45:00.000
12,13,2018-11-29 03:00:00,0,1.6,0,0,26.9,126,-116,0.0,2018-11-28 23:00:00.000
13,14,2018-11-29 03:15:00,0,1.6,0,0,26.9,122,-115,0.0,2018-11-28 23:15:00.000
14,15,2018-11-29 03:30:00,0,1.5,0,0,26.8,119,-114,0.0,2018-11-28 23:30:00.000
15,16,2018-11-29 03:45:00,0,1.5,0,0,26.8,115,-113,0.0,2018-11-28 23:45:00.000
16,17,2018-11-29 04:00:00,0,1.4,0,0,26.8,112,-113,0.0,2018-11-29 00:00:00.000
17,18,2018-11-29 04:15:00,0,1.4,0,0,26.7,109,-112,0.0,2018-11-29 00:15:00.000
18,19,2018-11-29 04:30:00,0,1.3,0,0,26.7,105,-112,0.0,2018-11-29 00:30:00.000
19,20,2018-11-29 04:45:00,0,1.3,0,0,26.6,102,-111,0.0,2018-11-29 00:45:00.000
20,21,2018-11-29 05:00:00,0,1.2,0,0,26.6,98,-111,0.0,2018-11-29 01:00:00.000
21,22,2018-11-29 05:15:00,0,1.2,0,0,26.7,95,-111,0.0,2018-11-29 01:15:00.000
22,23,2018-11-29 05:30:00,0,1.1,0,0,26.7,91,-111,0.0,2018-11-29 01:30:00.000
23,24,2018-11-29 05:45:00,21,1.0,84,13,26.8,88,-111,0.0,2018-11-29 01:45:00.000
24,25,2018-11-29 06:00:00,53,1.0,106,43,26.8,84,-111,12.7,2018-11-29 02:00:00.000
25,26,2018-11-29 06:15:00,92,0.9,105,74,26.9,81,-112,18.7,2018-11-29 02:15:00.000
26,27,2018-11-29 06:30:00,148,0.8,270,88,27.0,77,-112,12.0,2018-11-29 02:30:00.000
27,28,2018-11-29 06:45:00,136,0.8,0,136,27.0,74,-112,40.1,2018-11-29 02:45:00.000
28,29,2018-11-29 07:00:00,168,0.7,0,168,27.1,70,-113,41.1,2018-11-29 03:00:00.000
29,30,2018-11-29 07:15:00,226,0.6,5,224,27.1,67,-113,34.5,2018-11-29 03:15:00.000
30,31,2018-11-29 07:30:00,322,0.6,254,206,27.2,63,-114,20.7,2018-11-29 03:30:00.000
31,32,2018-11-29 07:45:00,327,0.5,107,271,27.3,60,-115,29.6,2018-11-29 03:45:00.000
32,33,2018-11-29 08:00:00,503,0.5,690,121,27.3,57,-116,3.1,2018-11-29 04:00:00.000
33,34,2018-11-29 08:15:00,525,0.6,560,190,27.3,53,-117,8.1,2018-11-29 04:15:00.000
34,35,2018-11-29 08:30:00,598,0.7,686,156,27.3,50,-119,4.2,2018-11-29 04:30:00.000
35,36,2018-11-29 08:45:00,664,0.9,787,125,27.3,47,-120,1.2,2018-11-29 04:45:00.000
36,37,2018-11-29 09:00:00,716,1.1,830,114,27.3,44,-122,0.2,2018-11-29 05:00:00.000
37,38,2018-11-29 09:15:00,745,1.2,787,146,27.3,40,-125,2.0,2018-11-29 05:15:00.000
38,39,2018-11-29 09:30:00,698,1.4,498,303,27.3,37,-128,12.5,2018-11-29 05:30:00.000
39,40,2018-11-29 09:45:00,813,1.6,787,164,27.3,34,-131,2.5,2018-11-29 05:45:00.000
40,41,2018-11-29 10:00:00,861,1.8,863,127,27.3,32,-135,0.3,2018-11-29 06:00:00.000
41,42,2018-11-29 10:15:00,854,2.0,750,198,27.3,29,-140,4.2,2018-11-29 06:15:00.000
42,43,2018-11-29 10:30:00,913,2.2,883,125,27.3,27,-145,0.0,2018-11-29 06:30:00.000
43,44,2018-11-29 10:45:00,929,2.4,882,129,27.3,25,-152,0.0,2018-11-29 06:45:00.000
44,45,2018-11-29 11:00:00,883,2.5,691,249,27.3,23,-160,6.1,2018-11-29 07:00:00.000
45,46,2018-11-29 11:15:00,948,2.6,876,138,27.3,22,-168,0.0,2018-11-29 07:15:00.000
46,47,2018-11-29 11:30:00,951,2.6,874,140,27.4,22,-177,0.0,2018-11-29 07:30:00.000
47,48,2018-11-29 11:45:00,950,2.7,873,140,27.4,22,173,0.0,2018-11-29 07:45:00.000
48,49,2018-11-29 12:00:00,912,2.7,766,206,27.4,23,164,3.4,2018-11-29 08:00:00.000
49,50,2018-11-29 12:15:00,771,2.8,387,418,27.5,24,156,17.5,2018-11-29 08:15:00.000
50,51,2018-11-29 12:30:00,782,2.8,439,385,27.5,26,149,15.0,2018-11-29 08:30:00.000
51,52,2018-11-29 12:45:00,708,2.9,285,457,27.5,28,143,21.3,2018-11-29 08:45:00.000
52,53,2018-11-29 13:00:00,650,2.9,188,487,27.6,30,137,25.8,2018-11-29 09:00:00.000
53,54,2018-11-29 13:15:00,535,2.9,42,499,27.6,33,133,36.9,2018-11-29 09:15:00.000
54,55,2018-11-29 13:30:00,473,3.0,0,473,27.6,36,129,41.8,2018-11-29 09:30:00.000
55,56,2018-11-29 13:45:00,373,3.0,0,373,27.7,39,126,51.9,2018-11-29 09:45:00.000
56,57,2018-11-29 14:00:00,340,3.1,0,340,27.7,42,124,53.6,2018-11-29 10:00:00.000
57,58,2018-11-29 14:15:00,170,3.1,0,170,27.7,45,122,75.2,2018-11-29 10:15:00.000
58,59,2018-11-29 14:30:00,148,3.1,0,148,27.7,48,120,76.9,2018-11-29 10:30:00.000
59,60,2018-11-29 14:45:00,185,3.1,0,185,27.7,51,118,68.6,2018-11-29 10:45:00.000
60,61,2018-11-29 15:00:00,172,3.1,0,172,27.6,55,117,67.8,2018-11-29 11:00:00.000
61,62,2018-11-29 15:15:00,202,3.2,0,202,27.6,58,116,57.8,2018-11-29 11:15:00.000
62,63,2018-11-29 15:30:00,217,3.2,0,217,27.6,62,115,48.6,2018-11-29 11:30:00.000
63,64,2018-11-29 15:45:00,207,3.2,0,207,27.6,65,114,43.3,2018-11-29 11:45:00.000
64,65,2018-11-29 16:00:00,200,3.2,0,200,27.6,68,113,34.7,2018-11-29 12:00:00.000
65,66,2018-11-29 16:15:00,150,3.3,0,150,27.6,72,113,39.0,2018-11-29 12:15:00.000
66,67,2018-11-29 16:30:00,125,3.3,0,125,27.6,75,112,33.5,2018-11-29 12:30:00.000
67,68,2018-11-29 16:45:00,97,3.3,0,97,27.6,79,112,26.7,2018-11-29 12:45:00.000
68,69,2018-11-29 17:00:00,71,3.3,123,55,27.5,82,112,10.5,2018-11-29 13:00:00.000
69,70,2018-11-29 17:15:00,32,3.2,6,31,27.4,86,111,12.1,2018-11-29 13:15:00.000
70,71,2018-11-29 17:30:00,5,3.2,5,5,27.3,89,111,0.8,2018-11-29 13:30:00.000
71,72,2018-11-29 17:45:00,0,3.1,0,0,27.2,93,111,0.0,2018-11-29 13:45:00.000
72,73,2018-11-29 18:00:00,0,3.0,0,0,27.0,96,111,0.0,2018-11-29 14:00:00.000
73,74,2018-11-29 18:15:00,0,3.0,0,0,26.9,100,111,0.0,2018-11-29 14:15:00.000
74,75,2018-11-29 18:30:00,0,2.9,0,0,26.8,103,112,0.0,2018-11-29 14:30:00.000
75,76,2018-11-29 18:45:00,0,2.8,0,0,26.7,107,112,0.0,2018-11-29 14:45:00.000
76,77,2018-11-29 19:00:00,0,2.8,0,0,26.6,110,112,0.0,2018-11-29 15:00:00.000
77,78,2018-11-29 19:15:00,0,2.7,0,0,26.4,114,113,0.0,2018-11-29 15:15:00.000
78,79,2018-11-29 19:30:00,0,2.6,0,0,26.3,117,114,0.0,2018-11-29 15:30:00.000
79,80,2018-11-29 19:45:00,0,2.6,0,0,26.2,120,114,0.0,2018-11-29 15:45:00.000
80,81,2018-11-29 20:00:00,0,2.5,0,0,26.1,124,115,0.0,2018-11-29 16:00:00.000
81,82,2018-11-29 20:15:00,0,2.5,0,0,26.2,127,117,0.0,2018-11-29 16:15:00.000
82,83,2018-11-29 20:30:00,0,2.5,0,0,26.2,131,118,0.0,2018-11-29 16:30:00.000
83,84,2018-11-29 20:45:00,0,2.4,0,0,26.3,134,120,0.0,2018-11-29 16:45:00.000
84,85,2018-11-29 21:00:00,0,2.4,0,0,26.4,137,121,0.0,2018-11-29 17:00:00.000
85,86,2018-11-29 21:15:00,0,2.4,0,0,26.4,140,124,0.0,2018-11-29 17:15:00.000
86,87,2018-11-29 21:30:00,0,2.3,0,0,26.5,143,126,0.0,2018-11-29 17:30:00.000
87,88,2018-11-29 21:45:00,0,2.3,0,0,26.6,146,130,0.0,2018-11-29 17:45:00.000
88,89,2018-11-29 22:00:00,0,2.3,0,0,26.6,149,134,0.0,2018-11-29 18:00:00.000
89,90,2018-11-29 22:15:00,0,2.2,0,0,26.7,152,138,0.0,2018-11-29 18:15:00.000
90,91,2018-11-29 22:30:00,0,2.2,0,0,26.8,154,144,0.0,2018-11-29 18:30:00.000
91,92,2018-11-29 22:45:00,0,2.2,0,0,26.8,156,151,0.0,2018-11-29 18:45:00.000
92,93,2018-11-29 23:00:00,0,2.2,0,0,26.9,158,159,0.0,2018-11-29 19:00:00.000
93,94,2018-11-29 23:15:00,0,2.1,0,0,26.8,159,168,0.0,2018-11-29 19:15:00.000
94,95,2018-11-29 23:30:00,0,2.1,0,0,26.8,159,177,0.0,2018-11-29 19:30:00.000
95,96,2018-11-29 23:45:00,0,2.1,0,0,26.8,159,-173,0.0,2018-11-29 19:45:00.000
