,BLOCK_ID,DATA_DATETIME,GHI,WIND_SPEED,DNI,DHI,TEMPERATURE,ZENITH,AZIMUTH,CLOUD_OPACITY,ENTRY_TIME
0,1,2021-02-04 00:00:00,0,1.6,0,0,22.8,164,-179,68.6,2021-02-03 20:00:00.000
1,2,2021-02-04 00:15:00,0,1.6,0,0,22.8,163,-167,64.4,2021-02-03 20:15:00.000
2,3,2021-02-04 00:30:00,0,1.6,0,0,22.7,162,-155,63.0,2021-02-03 20:30:00.000
3,4,2021-02-04 00:45:00,0,1.6,0,0,22.7,160,-146,69.2,2021-02-03 20:45:00.000
4,5,2021-02-04 01:00:00,0,1.7,0,0,22.7,158,-138,61.8,2021-02-03 21:00:00.000
5,6,2021-02-04 01:15:00,0,1.7,0,0,22.7,155,-132,44.8,2021-02-03 21:15:00.000
6,7,2021-02-04 01:30:00,0,1.8,0,0,22.7,152,-127,33.4,2021-02-03 21:30:00.000
7,8,2021-02-04 01:45:00,0,1.8,0,0,22.7,149,-123,32.9,2021-02-03 21:45:00.000
8,9,2021-02-04 02:00:00,0,1.9,0,0,22.6,146,-120,35.0,2021-02-03 22:00:00.000
9,10,2021-02-04 02:15:00,0,1.9,0,0,22.6,143,-118,41.8,2021-02-03 22:15:00.000
10,11,2021-02-04 02:30:00,0,1.9,0,0,22.6,139,-116,46.0,2021-02-03 22:30:00.000
11,12,2021-02-04 02:45:00,0,1.9,0,0,22.6,136,-114,36.5,2021-02-03 22:45:00.000
12,13,2021-02-04 03:00:00,0,1.9,0,0,22.6,133,-113,39.6,2021-02-03 23:00:00.000
13,14,2021-02-04 03:15:00,0,1.9,0,0,22.6,129,-111,45.3,2021-02-03 23:15:00.000
14,15,2021-02-04 03:30:00,0,1.9,0,0,22.6,126,-110,57.0,2021-02-03 23:30:00.000
15,16,2021-02-04 03:45:00,0,1.9,0,0,22.6,122,-110,59.6,2021-02-03 23:45:00.000
16,17,2021-02-04 04:00:00,0,1.9,0,0,22.6,119,-109,43.8,2021-02-04 00:00:00.000
17,18,2021-02-04 04:15:00,0,1.9,0,0,22.6,115,-108,49.9,2021-02-04 00:15:00.000
18,19,2021-02-04 04:30:00,0,1.8,0,0,22.6,111,-108,33.0,2021-02-04 00:30:00.000
19,20,2021-02-04 04:45:00,0,1.8,0,0,22.6,108,-107,24.3,2021-02-04 00:45:00.000
20,21,2021-02-04 05:00:00,0,1.7,0,0,22.6,104,-107,27.4,2021-02-04 01:00:00.000
21,22,2021-02-04 05:15:00,0,1.7,0,0,22.6,101,-107,26.5,2021-02-04 01:15:00.000
22,23,2021-02-04 05:30:00,0,1.6,0,0,22.6,97,-107,20.6,2021-02-04 01:30:00.000
23,24,2021-02-04 05:45:00,0,1.5,0,0,22.6,94,-107,22.0,2021-02-04 01:45:00.000
24,25,2021-02-04 06:00:00,2,1.5,0,2,22.6,90,-107,17.4,2021-02-04 02:00:00.000
25,26,2021-02-04 06:15:00,31,1.5,45,26,22.8,86,-107,16.2,2021-02-04 02:15:00.000
26,27,2021-02-04 06:30:00,84,1.5,378,34,23.1,83,-107,2.4,2021-02-04 02:30:00.000
27,28,2021-02-04 06:45:00,141,1.6,527,42,23.3,79,-107,0.0,2021-02-04 02:45:00.000
28,29,2021-02-04 07:00:00,202,1.6,608,51,23.6,76,-108,0.0,2021-02-04 03:00:00.000
29,30,2021-02-04 07:15:00,264,1.7,669,58,24.1,72,-108,0.0,2021-02-04 03:15:00.000
30,31,2021-02-04 07:30:00,327,1.7,717,65,24.6,69,-108,0.0,2021-02-04 03:30:00.000
31,32,2021-02-04 07:45:00,390,1.7,756,70,25.1,65,-109,0.0,2021-02-04 03:45:00.000
32,33,2021-02-04 08:00:00,452,1.7,787,75,25.6,61,-110,0.0,2021-02-04 04:00:00.000
33,34,2021-02-04 08:15:00,507,1.6,786,90,26.0,58,-110,0.9,2021-02-04 04:15:00.000
34,35,2021-02-04 08:30:00,512,1.6,544,197,26.4,54,-111,10.2,2021-02-04 04:30:00.000
35,36,2021-02-04 08:45:00,530,1.6,420,265,26.8,51,-112,15.5,2021-02-04 04:45:00.000
36,37,2021-02-04 09:00:00,577,1.5,436,282,27.1,47,-114,15.2,2021-02-04 05:00:00.000
37,38,2021-02-04 09:15:00,630,1.5,481,284,27.5,44,-115,13.8,2021-02-04 05:15:00.000
38,39,2021-02-04 09:30:00,698,1.5,585,255,27.8,41,-117,10.2,2021-02-04 05:30:00.000
39,40,2021-02-04 09:45:00,673,1.4,389,365,28.2,37,-119,17.9,2021-02-04 05:45:00.000
40,41,2021-02-04 10:00:00,695,1.4,362,395,28.5,34,-122,19.2,2021-02-04 06:00:00.000
41,42,2021-02-04 10:15:00,767,1.4,493,346,28.7,31,-125,14.2,2021-02-04 06:15:00.000
42,43,2021-02-04 10:30:00,746,1.4,363,425,28.8,28,-129,19.4,2021-02-04 06:30:00.000
43,44,2021-02-04 10:45:00,761,1.4,350,444,29.0,25,-134,20.0,2021-02-04 06:45:00.000
44,45,2021-02-04 11:00:00,809,1.4,432,411,29.0,23,-141,16.8,2021-02-04 07:00:00.000
45,46,2021-02-04 11:15:00,860,1.3,531,362,28.9,21,-148,13.1,2021-02-04 07:15:00.000
46,47,2021-02-04 11:30:00,867,1.2,523,372,28.6,19,-158,13.4,2021-02-04 07:30:00.000
47,48,2021-02-04 11:45:00,930,1.1,686,276,28.4,18,-169,7.7,2021-02-04 07:45:00.000
48,49,2021-02-04 12:00:00,931,1.0,682,280,28.3,17,179,7.8,2021-02-04 08:00:00.000
49,50,2021-02-04 12:15:00,939,1.0,714,259,28.2,18,168,6.7,2021-02-04 08:15:00.000
50,51,2021-02-04 12:30:00,923,1.0,684,275,28.1,19,157,7.6,2021-02-04 08:30:00.000
51,52,2021-02-04 12:45:00,786,1.0,343,466,28.0,21,148,20.2,2021-02-04 08:45:00.000
52,53,2021-02-04 13:00:00,743,1.0,272,492,27.9,23,140,23.2,2021-02-04 09:00:00.000
53,54,2021-02-04 13:15:00,709,1.1,227,504,27.8,25,134,25.0,2021-02-04 09:15:00.000
54,55,2021-02-04 13:30:00,630,1.3,100,542,27.8,28,129,31.4,2021-02-04 09:30:00.000
55,56,2021-02-04 13:45:00,570,1.4,23,551,27.7,31,125,35.7,2021-02-04 09:45:00.000
56,57,2021-02-04 14:00:00,605,1.5,138,491,27.7,34,122,28.9,2021-02-04 10:00:00.000
57,58,2021-02-04 14:15:00,549,1.5,73,492,27.7,38,119,32.3,2021-02-04 10:15:00.000
58,59,2021-02-04 14:30:00,636,1.5,399,337,27.7,41,117,17.0,2021-02-04 10:30:00.000
59,60,2021-02-04 14:45:00,720,1.5,851,112,27.7,44,115,0.0,2021-02-04 10:45:00.000
60,61,2021-02-04 15:00:00,669,1.5,833,109,27.6,48,113,0.0,2021-02-04 11:00:00.000
61,62,2021-02-04 15:15:00,589,1.4,688,158,27.5,51,112,4.2,2021-02-04 11:15:00.000
62,63,2021-02-04 15:30:00,418,1.4,183,310,27.4,55,111,25.4,2021-02-04 11:30:00.000
63,64,2021-02-04 15:45:00,218,1.3,0,218,27.4,58,110,56.8,2021-02-04 11:45:00.000
64,65,2021-02-04 16:00:00,89,1.3,0,89,27.2,62,109,79.8,2021-02-04 12:00:00.000
65,66,2021-02-04 16:15:00,64,1.2,0,64,27.1,65,109,83.1,2021-02-04 12:15:00.000
66,67,2021-02-04 16:30:00,67,1.2,0,67,26.9,69,108,78.4,2021-02-04 12:30:00.000
67,68,2021-02-04 16:45:00,80,1.2,0,80,26.8,72,108,67.2,2021-02-04 12:45:00.000
68,69,2021-02-04 17:00:00,71,1.2,0,71,26.5,76,107,62.6,2021-02-04 13:00:00.000
69,70,2021-02-04 17:15:00,70,1.1,0,70,26.0,80,107,44.5,2021-02-04 13:15:00.000
70,71,2021-02-04 17:30:00,50,1.1,0,50,25.5,83,107,31.6,2021-02-04 13:30:00.000
71,72,2021-02-04 17:45:00,13,1.1,0,13,25.0,87,107,54.1,2021-02-04 13:45:00.000
72,73,2021-02-04 18:00:00,1,1.0,0,1,24.6,90,107,59.8,2021-02-04 14:00:00.000
73,74,2021-02-04 18:15:00,0,1.1,0,0,24.4,94,107,64.9,2021-02-04 14:15:00.000
74,75,2021-02-04 18:30:00,0,1.1,0,0,24.1,98,107,71.6,2021-02-04 14:30:00.000
75,76,2021-02-04 18:45:00,0,1.1,0,0,23.9,101,107,86.7,2021-02-04 14:45:00.000
76,77,2021-02-04 19:00:00,0,1.1,0,0,23.7,105,107,93.3,2021-02-04 15:00:00.000
77,78,2021-02-04 19:15:00,0,1.2,0,0,23.6,108,107,94.7,2021-02-04 15:15:00.000
78,79,2021-02-04 19:30:00,0,1.2,0,0,23.6,112,108,92.4,2021-02-04 15:30:00.000
79,80,2021-02-04 19:45:00,0,1.3,0,0,23.5,115,108,74.4,2021-02-04 15:45:00.000
80,81,2021-02-04 20:00:00,0,1.3,0,0,23.4,119,109,56.8,2021-02-04 16:00:00.000
81,82,2021-02-04 20:15:00,0,1.4,0,0,23.3,123,109,58.3,2021-02-04 16:15:00.000
82,83,2021-02-04 20:30:00,0,1.4,0,0,23.3,126,110,58.2,2021-02-04 16:30:00.000
83,84,2021-02-04 20:45:00,0,1.4,0,0,23.2,130,111,67.6,2021-02-04 16:45:00.000
84,85,2021-02-04 21:00:00,0,1.4,0,0,23.1,133,112,91.4,2021-02-04 17:00:00.000
85,86,2021-02-04 21:15:00,0,1.4,0,0,23.1,137,114,66.6,2021-02-04 17:15:00.000
86,87,2021-02-04 21:30:00,0,1.4,0,0,23.0,140,116,54.6,2021-02-04 17:30:00.000
87,88,2021-02-04 21:45:00,0,1.4,0,0,22.9,143,118,55.1,2021-02-04 17:45:00.000
88,89,2021-02-04 22:00:00,0,1.3,0,0,22.9,147,120,64.0,2021-02-04 18:00:00.000
89,90,2021-02-04 22:15:00,0,1.3,0,0,22.9,150,123,62.1,2021-02-04 18:15:00.000
90,91,2021-02-04 22:30:00,0,1.2,0,0,22.8,153,127,51.2,2021-02-04 18:30:00.000
91,92,2021-02-04 22:45:00,0,1.1,0,0,22.8,156,132,41.6,2021-02-04 18:45:00.000
92,93,2021-02-04 23:00:00,0,1.0,0,0,22.8,158,138,29.8,2021-02-04 19:00:00.000
93,94,2021-02-04 23:15:00,0,1.0,0,0,22.7,161,146,30.6,2021-02-04 19:15:00.000
94,95,2021-02-04 23:30:00,0,0.9,0,0,22.7,162,156,33.6,2021-02-04 19:30:00.000
95,96,2021-02-04 23:45:00,0,0.9,0,0,22.7,164,168,36.9,2021-02-04 19:45:00.000
