,BLOCK_ID,DATA_DATETIME,GHI,WIND_SPEED,DNI,DHI,TEMPERATURE,ZENITH,AZIMUTH,CLOUD_OPACITY,ENTRY_TIME
0,1,2020-04-29 00:00:00,0,1.3,0,0,23.6,165,-16,81.0,2020-04-28 20:00:00.000
1,2,2020-04-29 00:15:00,0,1.2,0,0,23.5,163,-28,81.0,2020-04-28 20:15:00.000
2,3,2020-04-29 00:30:00,0,1.1,0,0,23.5,161,-38,81.0,2020-04-28 20:30:00.000
3,4,2020-04-29 00:45:00,0,1.0,0,0,23.4,159,-45,81.0,2020-04-28 20:45:00.000
4,5,2020-04-29 01:00:00,0,1.0,0,0,23.4,156,-51,81.0,2020-04-28 21:00:00.000
5,6,2020-04-29 01:15:00,0,1.0,0,0,23.4,153,-56,81.0,2020-04-28 21:15:00.000
6,7,2020-04-29 01:30:00,0,1.0,0,0,23.4,150,-60,81.0,2020-04-28 21:30:00.000
7,8,2020-04-29 01:45:00,0,1.0,0,0,23.4,146,-63,81.0,2020-04-28 21:45:00.000
8,9,2020-04-29 02:00:00,0,1.0,0,0,23.4,143,-65,81.0,2020-04-28 22:00:00.000
9,10,2020-04-29 02:15:00,0,1.0,0,0,23.3,140,-67,81.0,2020-04-28 22:15:00.000
10,11,2020-04-29 02:30:00,0,0.9,0,0,23.3,136,-69,81.0,2020-04-28 22:30:00.000
11,12,2020-04-29 02:45:00,0,0.8,0,0,23.3,133,-70,81.0,2020-04-28 22:45:00.000
12,13,2020-04-29 03:00:00,0,0.7,0,0,23.2,129,-71,81.8,2020-04-28 23:00:00.000
13,14,2020-04-29 03:15:00,0,0.7,0,0,23.2,126,-72,81.7,2020-04-28 23:15:00.000
14,15,2020-04-29 03:30:00,0,0.6,0,0,23.2,122,-73,81.0,2020-04-28 23:30:00.000
15,16,2020-04-29 03:45:00,0,0.6,0,0,23.2,118,-74,78.0,2020-04-28 23:45:00.000
16,17,2020-04-29 04:00:00,0,0.5,0,0,23.2,115,-74,71.0,2020-04-29 00:00:00.000
17,18,2020-04-29 04:15:00,0,0.5,0,0,23.2,111,-75,80.0,2020-04-29 00:15:00.000
18,19,2020-04-29 04:30:00,0,0.5,0,0,23.2,108,-75,80.0,2020-04-29 00:30:00.000
19,20,2020-04-29 04:45:00,0,0.5,0,0,23.1,104,-75,81.0,2020-04-29 00:45:00.000
20,21,2020-04-29 05:00:00,0,0.5,0,0,23.1,100,-75,65.0,2020-04-29 01:00:00.000
21,22,2020-04-29 05:15:00,0,0.5,0,0,23.1,97,-76,57.7,2020-04-29 01:15:00.000
22,23,2020-04-29 05:30:00,0,0.6,0,0,23.1,93,-76,68.6,2020-04-29 01:30:00.000
23,24,2020-04-29 05:45:00,1,0.6,0,1,23.0,89,-76,78.7,2020-04-29 01:45:00.000
24,25,2020-04-29 06:00:00,18,0.6,0,18,23.1,86,-76,56.4,2020-04-29 02:00:00.000
25,26,2020-04-29 06:15:00,65,0.6,76,56,23.3,82,-76,21.8,2020-04-29 02:15:00.000
26,27,2020-04-29 06:30:00,95,0.6,0,95,23.5,78,-76,32.0,2020-04-29 02:30:00.000
27,28,2020-04-29 06:45:00,112,0.6,0,112,23.8,75,-75,41.8,2020-04-29 02:45:00.000
28,29,2020-04-29 07:00:00,106,0.6,0,106,24.1,71,-75,58.6,2020-04-29 03:00:00.000
29,30,2020-04-29 07:15:00,150,0.6,0,150,24.6,68,-75,52.5,2020-04-29 03:15:00.000
30,31,2020-04-29 07:30:00,204,0.5,0,204,25.1,64,-74,45.8,2020-04-29 03:30:00.000
31,32,2020-04-29 07:45:00,250,0.4,0,250,25.7,60,-74,42.3,2020-04-29 03:45:00.000
32,33,2020-04-29 08:00:00,288,0.4,0,288,26.2,57,-73,41.4,2020-04-29 04:00:00.000
33,34,2020-04-29 08:15:00,291,0.3,0,291,26.6,53,-73,46.7,2020-04-29 04:15:00.000
34,35,2020-04-29 08:30:00,324,0.3,0,324,27.1,50,-72,46.0,2020-04-29 04:30:00.000
35,36,2020-04-29 08:45:00,353,0.2,0,353,27.5,46,-71,45.8,2020-04-29 04:45:00.000
36,37,2020-04-29 09:00:00,420,0.2,0,420,27.9,42,-69,39.8,2020-04-29 05:00:00.000
37,38,2020-04-29 09:15:00,535,0.3,139,425,28.4,39,-68,28.0,2020-04-29 05:15:00.000
38,39,2020-04-29 09:30:00,631,0.4,311,378,28.8,36,-66,19.4,2020-04-29 05:30:00.000
39,40,2020-04-29 09:45:00,674,0.5,362,369,29.2,32,-64,17.6,2020-04-29 05:45:00.000
40,41,2020-04-29 10:00:00,596,0.6,110,500,29.6,29,-61,30.0,2020-04-29 06:00:00.000
41,42,2020-04-29 10:15:00,539,0.7,0,539,29.6,26,-57,38.8,2020-04-29 06:15:00.000
42,43,2020-04-29 10:30:00,501,0.9,0,501,29.6,23,-52,44.6,2020-04-29 06:30:00.000
43,44,2020-04-29 10:45:00,538,1.0,0,538,29.6,20,-46,41.9,2020-04-29 06:45:00.000
44,45,2020-04-29 11:00:00,602,1.1,26,577,29.6,17,-37,36.0,2020-04-29 07:00:00.000
45,46,2020-04-29 11:15:00,690,1.1,163,533,29.3,15,-26,27.5,2020-04-29 07:15:00.000
46,47,2020-04-29 11:30:00,767,1.1,318,458,29.1,14,-13,20.0,2020-04-29 07:30:00.000
47,48,2020-04-29 11:45:00,770,1.1,324,455,28.8,14,2,19.8,2020-04-29 07:45:00.000
48,49,2020-04-29 12:00:00,865,1.1,587,297,28.6,14,17,9.6,2020-04-29 08:00:00.000
49,50,2020-04-29 12:15:00,785,1.0,382,417,28.4,16,30,17.3,2020-04-29 08:15:00.000
50,51,2020-04-29 12:30:00,759,0.9,341,434,28.2,18,40,19.0,2020-04-29 08:30:00.000
51,52,2020-04-29 12:45:00,788,0.8,453,363,28.1,21,48,14.3,2020-04-29 08:45:00.000
52,53,2020-04-29 13:00:00,643,0.7,144,511,28.0,23,53,28.4,2020-04-29 09:00:00.000
53,54,2020-04-29 13:15:00,563,0.6,31,535,28.0,27,58,35.5,2020-04-29 09:15:00.000
54,55,2020-04-29 13:30:00,520,0.5,0,520,28.0,30,61,38.2,2020-04-29 09:30:00.000
55,56,2020-04-29 13:45:00,506,0.4,14,495,28.0,33,64,37.2,2020-04-29 09:45:00.000
56,57,2020-04-29 14:00:00,459,0.3,10,451,28.0,37,66,40.2,2020-04-29 10:00:00.000
57,58,2020-04-29 14:15:00,482,0.2,96,408,27.8,40,68,33.6,2020-04-29 10:15:00.000
58,59,2020-04-29 14:30:00,335,0.1,0,335,27.7,44,70,50.6,2020-04-29 10:30:00.000
59,60,2020-04-29 14:45:00,394,0.1,17,383,27.5,47,71,37.2,2020-04-29 10:45:00.000
60,61,2020-04-29 15:00:00,395,0.1,37,371,27.4,51,72,31.7,2020-04-29 11:00:00.000
61,62,2020-04-29 15:15:00,298,0.1,0,298,27.2,54,73,43.3,2020-04-29 11:15:00.000
62,63,2020-04-29 15:30:00,255,0.2,0,255,27.1,58,73,45.6,2020-04-29 11:30:00.000
63,64,2020-04-29 15:45:00,182,0.3,0,182,26.9,61,74,56.0,2020-04-29 11:45:00.000
64,65,2020-04-29 16:00:00,106,0.3,0,106,26.7,65,74,70.2,2020-04-29 12:00:00.000
65,66,2020-04-29 16:15:00,118,0.4,0,118,26.4,69,75,59.6,2020-04-29 12:15:00.000
66,67,2020-04-29 16:30:00,109,0.4,0,109,26.1,72,75,53.2,2020-04-29 12:30:00.000
67,68,2020-04-29 16:45:00,95,0.5,0,95,25.8,76,75,46.1,2020-04-29 12:45:00.000
68,69,2020-04-29 17:00:00,57,0.5,0,57,25.5,79,76,52.6,2020-04-29 13:00:00.000
69,70,2020-04-29 17:15:00,26,0.6,0,26,25.2,83,76,60.8,2020-04-29 13:15:00.000
70,71,2020-04-29 17:30:00,12,0.7,0,12,24.9,87,76,56.6,2020-04-29 13:30:00.000
71,72,2020-04-29 17:45:00,0,0.7,0,0,24.6,90,76,70.0,2020-04-29 13:45:00.000
72,73,2020-04-29 18:00:00,0,0.8,0,0,24.3,94,76,88.4,2020-04-29 14:00:00.000
73,74,2020-04-29 18:15:00,0,0.8,0,0,24.2,98,75,97.0,2020-04-29 14:15:00.000
74,75,2020-04-29 18:30:00,0,0.8,0,0,24.1,101,75,84.2,2020-04-29 14:30:00.000
75,76,2020-04-29 18:45:00,0,0.8,0,0,24.0,105,75,72.6,2020-04-29 14:45:00.000
76,77,2020-04-29 19:00:00,0,0.8,0,0,23.9,108,75,53.0,2020-04-29 15:00:00.000
77,78,2020-04-29 19:15:00,0,0.7,0,0,24.0,112,74,53.0,2020-04-29 15:15:00.000
78,79,2020-04-29 19:30:00,0,0.5,0,0,24.0,116,74,53.0,2020-04-29 15:30:00.000
79,80,2020-04-29 19:45:00,0,0.4,0,0,24.0,119,73,53.0,2020-04-29 15:45:00.000
80,81,2020-04-29 20:00:00,0,0.4,0,0,24.0,123,72,53.0,2020-04-29 16:00:00.000
81,82,2020-04-29 20:15:00,0,0.4,0,0,24.0,126,72,54.0,2020-04-29 16:15:00.000
82,83,2020-04-29 20:30:00,0,0.5,0,0,23.9,130,71,54.0,2020-04-29 16:30:00.000
83,84,2020-04-29 20:45:00,0,0.6,0,0,23.9,134,69,54.0,2020-04-29 16:45:00.000
84,85,2020-04-29 21:00:00,0,0.7,0,0,23.9,137,68,54.0,2020-04-29 17:00:00.000
85,86,2020-04-29 21:15:00,0,0.8,0,0,23.8,140,66,53.2,2020-04-29 17:15:00.000
86,87,2020-04-29 21:30:00,0,0.8,0,0,23.8,144,64,53.0,2020-04-29 17:30:00.000
87,88,2020-04-29 21:45:00,0,0.9,0,0,23.7,147,62,53.0,2020-04-29 17:45:00.000
88,89,2020-04-29 22:00:00,0,1.0,0,0,23.7,150,58,53.0,2020-04-29 18:00:00.000
89,90,2020-04-29 22:15:00,0,0.9,0,0,23.6,154,54,53.0,2020-04-29 18:15:00.000
90,91,2020-04-29 22:30:00,0,0.9,0,0,23.6,157,49,53.0,2020-04-29 18:30:00.000
91,92,2020-04-29 22:45:00,0,0.9,0,0,23.6,159,43,40.6,2020-04-29 18:45:00.000
92,93,2020-04-29 23:00:00,0,0.9,0,0,23.5,162,35,43.4,2020-04-29 19:00:00.000
93,94,2020-04-29 23:15:00,0,0.8,0,0,23.5,163,24,48.1,2020-04-29 19:15:00.000
94,95,2020-04-29 23:30:00,0,0.8,0,0,23.5,165,12,53.0,2020-04-29 19:30:00.000
95,96,2020-04-29 23:45:00,0,0.8,0,0,23.5,165,-2,57.9,2020-04-29 19:45:00.000
