,BLOCK_ID,DATA_DATETIME,GHI,WIND_SPEED,DNI,DHI,TEMPERATURE,ZENITH,AZIMUTH,CLOUD_OPACITY,ENTRY_TIME
0,1,2019-07-24 00:00:00,0,3.2,0,0,23.3,159,-5,81.0,2019-07-23 20:00:00.000
1,2,2019-07-24 00:15:00,0,3.2,0,0,23.3,158,-15,81.0,2019-07-23 20:15:00.000
2,3,2019-07-24 00:30:00,0,3.1,0,0,23.3,157,-23,81.0,2019-07-23 20:30:00.000
3,4,2019-07-24 00:45:00,0,3.1,0,0,23.3,155,-31,76.9,2019-07-23 20:45:00.000
4,5,2019-07-24 01:00:00,0,3.1,0,0,23.2,153,-37,81.0,2019-07-23 21:00:00.000
5,6,2019-07-24 01:15:00,0,3.0,0,0,23.2,151,-43,81.0,2019-07-23 21:15:00.000
6,7,2019-07-24 01:30:00,0,2.9,0,0,23.2,148,-47,81.0,2019-07-23 21:30:00.000
7,8,2019-07-24 01:45:00,0,2.8,0,0,23.2,145,-51,81.0,2019-07-23 21:45:00.000
8,9,2019-07-24 02:00:00,0,2.8,0,0,23.2,142,-54,64.4,2019-07-23 22:00:00.000
9,10,2019-07-24 02:15:00,0,2.8,0,0,23.2,139,-57,59.0,2019-07-23 22:15:00.000
10,11,2019-07-24 02:30:00,0,2.8,0,0,23.2,136,-59,59.0,2019-07-23 22:30:00.000
11,12,2019-07-24 02:45:00,0,2.9,0,0,23.2,133,-61,59.0,2019-07-23 22:45:00.000
12,13,2019-07-24 03:00:00,0,2.9,0,0,23.2,129,-63,59.0,2019-07-23 23:00:00.000
13,14,2019-07-24 03:15:00,0,2.8,0,0,23.2,126,-64,59.0,2019-07-23 23:15:00.000
14,15,2019-07-24 03:30:00,0,2.8,0,0,23.1,123,-65,59.0,2019-07-23 23:30:00.000
15,16,2019-07-24 03:45:00,0,2.8,0,0,23.1,119,-66,57.5,2019-07-23 23:45:00.000
16,17,2019-07-24 04:00:00,0,2.7,0,0,23.0,116,-67,53.9,2019-07-24 00:00:00.000
17,18,2019-07-24 04:15:00,0,2.7,0,0,23.0,112,-68,53.9,2019-07-24 00:15:00.000
18,19,2019-07-24 04:30:00,0,2.7,0,0,23.0,109,-68,53.9,2019-07-24 00:30:00.000
19,20,2019-07-24 04:45:00,0,2.7,0,0,23.0,105,-69,53.6,2019-07-24 00:45:00.000
20,21,2019-07-24 05:00:00,0,2.7,0,0,23.0,102,-69,65.1,2019-07-24 01:00:00.000
21,22,2019-07-24 05:15:00,0,2.6,0,0,23.0,98,-69,65.8,2019-07-24 01:15:00.000
22,23,2019-07-24 05:30:00,0,2.5,0,0,23.0,95,-70,67.3,2019-07-24 01:30:00.000
23,24,2019-07-24 05:45:00,0,2.5,0,0,23.0,91,-70,63.3,2019-07-24 01:45:00.000
24,25,2019-07-24 06:00:00,5,2.4,0,5,23.0,88,-70,65.2,2019-07-24 02:00:00.000
25,26,2019-07-24 06:15:00,29,2.3,0,29,23.1,84,-70,41.2,2019-07-24 02:15:00.000
26,27,2019-07-24 06:30:00,68,2.2,0,68,23.2,81,-70,29.8,2019-07-24 02:30:00.000
27,28,2019-07-24 06:45:00,127,2.2,166,91,23.4,77,-69,13.6,2019-07-24 02:45:00.000
28,29,2019-07-24 07:00:00,169,2.1,172,121,23.6,74,-69,16.2,2019-07-24 03:00:00.000
29,30,2019-07-24 07:15:00,239,2.2,381,111,23.9,70,-69,7.0,2019-07-24 03:15:00.000
30,31,2019-07-24 07:30:00,267,2.2,264,164,24.2,67,-68,14.7,2019-07-24 03:30:00.000
31,32,2019-07-24 07:45:00,322,2.3,329,176,24.5,63,-68,12.7,2019-07-24 03:45:00.000
32,33,2019-07-24 08:00:00,276,2.4,53,251,24.7,60,-67,34.7,2019-07-24 04:00:00.000
33,34,2019-07-24 08:15:00,279,2.4,61,244,24.9,57,-66,42.2,2019-07-24 04:15:00.000
34,35,2019-07-24 08:30:00,380,2.4,89,327,25.1,53,-65,28.3,2019-07-24 04:30:00.000
35,36,2019-07-24 08:45:00,367,2.4,42,339,25.2,50,-64,36.8,2019-07-24 04:45:00.000
36,37,2019-07-24 09:00:00,494,2.4,231,334,25.3,46,-62,21.2,2019-07-24 05:00:00.000
37,38,2019-07-24 09:15:00,536,2.4,261,344,25.2,43,-60,20.1,2019-07-24 05:15:00.000
38,39,2019-07-24 09:30:00,635,2.3,481,266,25.0,40,-58,10.6,2019-07-24 05:30:00.000
39,40,2019-07-24 09:45:00,626,2.3,365,334,24.9,37,-56,16.2,2019-07-24 05:45:00.000
40,41,2019-07-24 10:00:00,435,2.2,28,412,24.8,34,-53,44.2,2019-07-24 06:00:00.000
41,42,2019-07-24 10:15:00,394,2.2,18,378,24.7,31,-49,51.6,2019-07-24 06:15:00.000
42,43,2019-07-24 10:30:00,566,2.2,56,517,24.7,28,-44,32.3,2019-07-24 06:30:00.000
43,44,2019-07-24 10:45:00,585,2.2,63,528,24.7,26,-39,31.8,2019-07-24 06:45:00.000
44,45,2019-07-24 11:00:00,520,2.2,15,506,24.8,23,-32,40.5,2019-07-24 07:00:00.000
45,46,2019-07-24 11:15:00,443,2.2,0,443,25.0,22,-24,50.0,2019-07-24 07:15:00.000
46,47,2019-07-24 11:30:00,366,2.3,0,366,25.3,20,-15,59.0,2019-07-24 07:30:00.000
47,48,2019-07-24 11:45:00,549,2.3,15,535,25.6,20,-5,38.8,2019-07-24 07:45:00.000
48,49,2019-07-24 12:00:00,577,2.4,10,568,25.8,20,6,35.7,2019-07-24 08:00:00.000
49,50,2019-07-24 12:15:00,597,2.4,81,521,26.0,20,16,33.1,2019-07-24 08:15:00.000
50,51,2019-07-24 12:30:00,621,2.4,123,506,26.2,22,25,29.7,2019-07-24 08:30:00.000
51,52,2019-07-24 12:45:00,570,2.5,29,543,26.4,23,33,34.6,2019-07-24 08:45:00.000
52,53,2019-07-24 13:00:00,505,2.5,0,505,26.7,26,39,40.7,2019-07-24 09:00:00.000
53,54,2019-07-24 13:15:00,644,2.5,219,452,27.0,28,45,22.4,2019-07-24 09:15:00.000
54,55,2019-07-24 13:30:00,767,2.5,641,218,27.3,31,49,4.7,2019-07-24 09:30:00.000
55,56,2019-07-24 13:45:00,746,2.5,653,202,27.6,34,53,3.9,2019-07-24 09:45:00.000
56,57,2019-07-24 14:00:00,599,2.5,274,380,27.7,37,56,19.3,2019-07-24 10:00:00.000
57,58,2019-07-24 14:15:00,374,2.5,0,374,27.4,40,58,47.1,2019-07-24 10:15:00.000
58,59,2019-07-24 14:30:00,364,2.4,0,364,27.1,43,61,45.0,2019-07-24 10:30:00.000
59,60,2019-07-24 14:45:00,398,2.4,75,348,26.7,47,62,35.7,2019-07-24 10:45:00.000
60,61,2019-07-24 15:00:00,448,2.3,191,325,26.4,50,64,22.0,2019-07-24 11:00:00.000
61,62,2019-07-24 15:15:00,321,2.2,17,311,26.1,53,65,38.7,2019-07-24 11:15:00.000
62,63,2019-07-24 15:30:00,413,2.2,370,212,25.9,57,66,12.5,2019-07-24 11:30:00.000
63,64,2019-07-24 15:45:00,354,2.1,273,218,25.7,60,67,15.7,2019-07-24 11:45:00.000
64,65,2019-07-24 16:00:00,258,2.0,59,230,25.4,64,68,29.5,2019-07-24 12:00:00.000
65,66,2019-07-24 16:15:00,239,1.8,111,196,25.1,67,68,22.7,2019-07-24 12:15:00.000
66,67,2019-07-24 16:30:00,178,1.6,21,171,24.8,71,69,29.7,2019-07-24 12:30:00.000
67,68,2019-07-24 16:45:00,127,1.4,0,127,24.4,74,69,35.3,2019-07-24 12:45:00.000
68,69,2019-07-24 17:00:00,103,1.3,0,103,24.1,78,69,27.3,2019-07-24 13:00:00.000
69,70,2019-07-24 17:15:00,61,1.3,0,61,24.0,81,70,33.2,2019-07-24 13:15:00.000
70,71,2019-07-24 17:30:00,34,1.3,0,34,23.9,85,70,27.1,2019-07-24 13:30:00.000
71,72,2019-07-24 17:45:00,10,1.4,0,10,23.8,88,70,28.4,2019-07-24 13:45:00.000
72,73,2019-07-24 18:00:00,0,1.4,0,0,23.8,92,70,37.4,2019-07-24 14:00:00.000
73,74,2019-07-24 18:15:00,0,1.4,0,0,23.7,95,70,41.5,2019-07-24 14:15:00.000
74,75,2019-07-24 18:30:00,0,1.4,0,0,23.6,99,69,52.0,2019-07-24 14:30:00.000
75,76,2019-07-24 18:45:00,0,1.4,0,0,23.6,102,69,43.9,2019-07-24 14:45:00.000
76,77,2019-07-24 19:00:00,0,1.3,0,0,23.5,106,69,37.7,2019-07-24 15:00:00.000
77,78,2019-07-24 19:15:00,0,1.1,0,0,23.3,109,68,52.0,2019-07-24 15:15:00.000
78,79,2019-07-24 19:30:00,0,1.0,0,0,23.2,113,68,52.7,2019-07-24 15:30:00.000
79,80,2019-07-24 19:45:00,0,0.8,0,0,23.1,116,67,53.0,2019-07-24 15:45:00.000
80,81,2019-07-24 20:00:00,0,0.7,0,0,22.9,120,66,45.2,2019-07-24 16:00:00.000
81,82,2019-07-24 20:15:00,0,0.8,0,0,22.8,123,65,41.2,2019-07-24 16:15:00.000
82,83,2019-07-24 20:30:00,0,0.8,0,0,22.7,126,64,36.2,2019-07-24 16:30:00.000
83,84,2019-07-24 20:45:00,0,0.8,0,0,22.6,130,63,36.4,2019-07-24 16:45:00.000
84,85,2019-07-24 21:00:00,0,0.8,0,0,22.5,133,61,36.7,2019-07-24 17:00:00.000
85,86,2019-07-24 21:15:00,0,0.8,0,0,22.5,136,59,36.7,2019-07-24 17:15:00.000
86,87,2019-07-24 21:30:00,0,0.8,0,0,22.4,139,57,35.4,2019-07-24 17:30:00.000
87,88,2019-07-24 21:45:00,0,0.7,0,0,22.4,143,54,30.9,2019-07-24 17:45:00.000
88,89,2019-07-24 22:00:00,0,0.7,0,0,22.3,146,51,24.6,2019-07-24 18:00:00.000
89,90,2019-07-24 22:15:00,0,0.8,0,0,22.3,148,47,46.1,2019-07-24 18:15:00.000
90,91,2019-07-24 22:30:00,0,0.8,0,0,22.3,151,43,23.7,2019-07-24 18:30:00.000
91,92,2019-07-24 22:45:00,0,0.8,0,0,22.3,154,37,31.2,2019-07-24 18:45:00.000
92,93,2019-07-24 23:00:00,0,0.8,0,0,22.3,156,31,61.7,2019-07-24 19:00:00.000
93,94,2019-07-24 23:15:00,0,0.8,0,0,22.2,157,23,68.2,2019-07-24 19:15:00.000
94,95,2019-07-24 23:30:00,0,0.8,0,0,22.2,159,14,68.2,2019-07-24 19:30:00.000
95,96,2019-07-24 23:45:00,0,0.8,0,0,22.2,159,5,68.4,2019-07-24 19:45:00.000
