,BLOCK_ID,DATA_DATETIME,GHI,WIND_SPEED,DNI,DHI,TEMPERATURE,ZENITH,AZIMUTH,CLOUD_OPACITY,ENTRY_TIME
0,1,2020-11-27 00:00:00,0,1.0,0,0,23.7,159,-163,48.6,2020-11-26 20:00:00.000
1,2,2020-11-27 00:15:00,0,1.0,0,0,23.6,157,-154,41.7,2020-11-26 20:15:00.000
2,3,2020-11-27 00:30:00,0,1.0,0,0,23.5,155,-147,43.4,2020-11-26 20:30:00.000
3,4,2020-11-27 00:45:00,0,1.0,0,0,23.5,153,-141,42.2,2020-11-26 20:45:00.000
4,5,2020-11-27 01:00:00,0,1.0,0,0,23.4,151,-135,44.2,2020-11-26 21:00:00.000
5,6,2020-11-27 01:15:00,0,1.0,0,0,23.4,148,-131,38.5,2020-11-26 21:15:00.000
6,7,2020-11-27 01:30:00,0,1.0,0,0,23.4,145,-128,35.8,2020-11-26 21:30:00.000
7,8,2020-11-27 01:45:00,0,0.9,0,0,23.4,142,-125,45.6,2020-11-26 21:45:00.000
8,9,2020-11-27 02:00:00,0,0.9,0,0,23.4,139,-122,55.8,2020-11-26 22:00:00.000
9,10,2020-11-27 02:15:00,0,1.0,0,0,23.4,136,-120,65.6,2020-11-26 22:15:00.000
10,11,2020-11-27 02:30:00,0,1.0,0,0,23.3,132,-118,65.4,2020-11-26 22:30:00.000
11,12,2020-11-27 02:45:00,0,1.0,0,0,23.3,129,-117,67.0,2020-11-26 22:45:00.000
12,13,2020-11-27 03:00:00,0,1.0,0,0,23.2,126,-116,62.2,2020-11-26 23:00:00.000
13,14,2020-11-27 03:15:00,0,1.0,0,0,23.2,122,-115,59.7,2020-11-26 23:15:00.000
14,15,2020-11-27 03:30:00,0,1.0,0,0,23.1,119,-114,47.2,2020-11-26 23:30:00.000
15,16,2020-11-27 03:45:00,0,1.0,0,0,23.1,115,-113,53.3,2020-11-26 23:45:00.000
16,17,2020-11-27 04:00:00,0,1.0,0,0,23.1,112,-112,54.8,2020-11-27 00:00:00.000
17,18,2020-11-27 04:15:00,0,0.9,0,0,23.0,109,-112,69.4,2020-11-27 00:15:00.000
18,19,2020-11-27 04:30:00,0,0.9,0,0,23.0,105,-112,58.4,2020-11-27 00:30:00.000
19,20,2020-11-27 04:45:00,0,0.8,0,0,23.0,102,-111,58.7,2020-11-27 00:45:00.000
20,21,2020-11-27 05:00:00,0,0.8,0,0,22.9,98,-111,85.4,2020-11-27 01:00:00.000
21,22,2020-11-27 05:15:00,0,0.8,0,0,23.0,95,-111,53.5,2020-11-27 01:15:00.000
22,23,2020-11-27 05:30:00,0,0.8,0,0,23.0,91,-111,92.2,2020-11-27 01:30:00.000
23,24,2020-11-27 05:45:00,4,0.8,0,4,23.1,88,-111,88.0,2020-11-27 01:45:00.000
24,25,2020-11-27 06:00:00,48,0.8,44,43,23.2,84,-111,28.6,2020-11-27 02:00:00.000
25,26,2020-11-27 06:15:00,91,0.8,91,76,23.6,81,-111,20.4,2020-11-27 02:15:00.000
26,27,2020-11-27 06:30:00,84,0.8,27,79,23.9,77,-112,49.4,2020-11-27 02:30:00.000
27,28,2020-11-27 06:45:00,158,0.8,10,155,24.3,74,-112,31.0,2020-11-27 02:45:00.000
28,29,2020-11-27 07:00:00,214,0.8,102,178,24.7,70,-113,26.2,2020-11-27 03:00:00.000
29,30,2020-11-27 07:15:00,216,0.7,28,205,25.4,67,-113,37.6,2020-11-27 03:15:00.000
30,31,2020-11-27 07:30:00,301,0.6,200,210,26.1,63,-114,26.6,2020-11-27 03:30:00.000
31,32,2020-11-27 07:45:00,447,0.5,643,122,26.8,60,-115,4.2,2020-11-27 03:45:00.000
32,33,2020-11-27 08:00:00,491,0.5,625,147,27.4,56,-116,5.6,2020-11-27 04:00:00.000
33,34,2020-11-27 08:15:00,526,0.5,563,187,28.0,53,-117,8.6,2020-11-27 04:15:00.000
34,35,2020-11-27 08:30:00,577,0.6,595,194,28.6,50,-119,7.8,2020-11-27 04:30:00.000
35,36,2020-11-27 08:45:00,576,0.7,426,283,29.1,47,-120,14.7,2020-11-27 04:45:00.000
36,37,2020-11-27 09:00:00,660,0.8,602,222,29.7,43,-122,8.4,2020-11-27 05:00:00.000
37,38,2020-11-27 09:15:00,762,0.7,859,107,30.1,40,-125,0.0,2020-11-27 05:15:00.000
38,39,2020-11-27 09:30:00,801,0.7,868,109,30.6,37,-127,0.0,2020-11-27 05:30:00.000
39,40,2020-11-27 09:45:00,835,0.7,876,112,31.1,34,-131,0.0,2020-11-27 05:45:00.000
40,41,2020-11-27 10:00:00,866,0.7,882,114,31.4,32,-135,0.0,2020-11-27 06:00:00.000
41,42,2020-11-27 10:15:00,861,0.7,777,181,31.6,29,-140,3.5,2020-11-27 06:15:00.000
42,43,2020-11-27 10:30:00,914,0.7,891,118,31.6,27,-145,0.0,2020-11-27 06:30:00.000
43,44,2020-11-27 10:45:00,877,0.8,713,230,31.7,25,-152,5.7,2020-11-27 06:45:00.000
44,45,2020-11-27 11:00:00,891,0.8,718,230,31.8,23,-160,5.6,2020-11-27 07:00:00.000
45,46,2020-11-27 11:15:00,881,0.8,667,263,31.7,22,-168,7.4,2020-11-27 07:15:00.000
46,47,2020-11-27 11:30:00,357,0.8,101,263,31.7,22,-178,62.6,2020-11-27 07:30:00.000
47,48,2020-11-27 11:45:00,411,0.7,0,411,31.6,22,173,56.9,2020-11-27 07:45:00.000
48,49,2020-11-27 12:00:00,756,0.7,383,402,31.5,23,164,20.2,2020-11-27 08:00:00.000
49,50,2020-11-27 12:15:00,514,0.7,25,491,31.2,24,156,45.2,2020-11-27 08:15:00.000
50,51,2020-11-27 12:30:00,227,0.7,0,227,30.8,26,148,75.4,2020-11-27 08:30:00.000
51,52,2020-11-27 12:45:00,234,0.6,0,234,30.5,28,142,74.0,2020-11-27 08:45:00.000
52,53,2020-11-27 13:00:00,325,0.6,0,325,30.2,30,137,63.0,2020-11-27 09:00:00.000
53,54,2020-11-27 13:15:00,288,0.5,0,288,29.9,33,133,66.2,2020-11-27 09:15:00.000
54,55,2020-11-27 13:30:00,67,0.5,0,67,29.7,36,129,91.8,2020-11-27 09:30:00.000
55,56,2020-11-27 13:45:00,116,0.6,0,116,29.4,39,126,85.0,2020-11-27 09:45:00.000
56,57,2020-11-27 14:00:00,122,0.7,0,122,29.2,42,123,83.6,2020-11-27 10:00:00.000
57,58,2020-11-27 14:15:00,115,0.7,0,115,28.9,45,121,83.4,2020-11-27 10:15:00.000
58,59,2020-11-27 14:30:00,137,0.7,0,137,28.5,48,119,78.8,2020-11-27 10:30:00.000
59,60,2020-11-27 14:45:00,103,0.7,0,103,28.2,51,118,82.8,2020-11-27 10:45:00.000
60,61,2020-11-27 15:00:00,109,0.7,0,109,27.9,55,117,80.0,2020-11-27 11:00:00.000
61,62,2020-11-27 15:15:00,130,0.8,0,130,27.7,58,115,73.3,2020-11-27 11:15:00.000
62,63,2020-11-27 15:30:00,174,0.9,0,174,27.5,62,114,59.8,2020-11-27 11:30:00.000
63,64,2020-11-27 15:45:00,230,0.9,38,215,27.3,65,114,38.3,2020-11-27 11:45:00.000
64,65,2020-11-27 16:00:00,234,1.0,105,196,27.1,68,113,25.8,2020-11-27 12:00:00.000
65,66,2020-11-27 16:15:00,178,1.0,30,169,26.8,72,112,30.3,2020-11-27 12:15:00.000
66,67,2020-11-27 16:30:00,141,1.1,20,135,26.5,75,112,28.8,2020-11-27 12:30:00.000
67,68,2020-11-27 16:45:00,75,1.1,0,75,26.2,79,112,47.8,2020-11-27 12:45:00.000
68,69,2020-11-27 17:00:00,42,1.1,0,42,25.9,82,111,50.0,2020-11-27 13:00:00.000
69,70,2020-11-27 17:15:00,23,1.2,0,23,25.6,86,111,46.5,2020-11-27 13:15:00.000
70,71,2020-11-27 17:30:00,2,1.2,0,2,25.3,89,111,68.6,2020-11-27 13:30:00.000
71,72,2020-11-27 17:45:00,0,1.3,0,0,25.0,93,111,53.7,2020-11-27 13:45:00.000
72,73,2020-11-27 18:00:00,0,1.3,0,0,24.8,96,111,54.0,2020-11-27 14:00:00.000
73,74,2020-11-27 18:15:00,0,1.4,0,0,24.6,100,111,52.1,2020-11-27 14:15:00.000
74,75,2020-11-27 18:30:00,0,1.4,0,0,24.5,103,112,52.4,2020-11-27 14:30:00.000
75,76,2020-11-27 18:45:00,0,1.4,0,0,24.4,107,112,56.4,2020-11-27 14:45:00.000
76,77,2020-11-27 19:00:00,0,1.5,0,0,24.3,110,112,53.2,2020-11-27 15:00:00.000
77,78,2020-11-27 19:15:00,0,1.5,0,0,24.3,114,113,63.9,2020-11-27 15:15:00.000
78,79,2020-11-27 19:30:00,0,1.5,0,0,24.2,117,114,60.4,2020-11-27 15:30:00.000
79,80,2020-11-27 19:45:00,0,1.5,0,0,24.2,121,114,54.2,2020-11-27 15:45:00.000
80,81,2020-11-27 20:00:00,0,1.5,0,0,24.1,124,115,50.0,2020-11-27 16:00:00.000
81,82,2020-11-27 20:15:00,0,1.5,0,0,24.1,127,116,31.9,2020-11-27 16:15:00.000
82,83,2020-11-27 20:30:00,0,1.5,0,0,24.1,131,118,35.6,2020-11-27 16:30:00.000
83,84,2020-11-27 20:45:00,0,1.5,0,0,24.0,134,119,38.4,2020-11-27 16:45:00.000
84,85,2020-11-27 21:00:00,0,1.5,0,0,24.0,137,121,38.6,2020-11-27 17:00:00.000
85,86,2020-11-27 21:15:00,0,1.5,0,0,24.0,140,124,37.2,2020-11-27 17:15:00.000
86,87,2020-11-27 21:30:00,0,1.5,0,0,24.0,143,126,43.2,2020-11-27 17:30:00.000
87,88,2020-11-27 21:45:00,0,1.5,0,0,24.0,146,129,39.2,2020-11-27 17:45:00.000
88,89,2020-11-27 22:00:00,0,1.5,0,0,24.0,149,133,43.0,2020-11-27 18:00:00.000
89,90,2020-11-27 22:15:00,0,1.5,0,0,24.0,152,138,28.0,2020-11-27 18:15:00.000
90,91,2020-11-27 22:30:00,0,1.4,0,0,23.9,154,144,28.0,2020-11-27 18:30:00.000
91,92,2020-11-27 22:45:00,0,1.4,0,0,23.9,156,151,38.4,2020-11-27 18:45:00.000
92,93,2020-11-27 23:00:00,0,1.3,0,0,23.9,158,159,25.6,2020-11-27 19:00:00.000
93,94,2020-11-27 23:15:00,0,1.3,0,0,23.8,159,168,27.8,2020-11-27 19:15:00.000
94,95,2020-11-27 23:30:00,0,1.3,0,0,23.8,159,177,37.6,2020-11-27 19:30:00.000
95,96,2020-11-27 23:45:00,0,1.3,0,0,23.8,159,-173,37.8,2020-11-27 19:45:00.000
