,BLOCK_ID,DATA_DATETIME,GHI,WIND_SPEED,DNI,DHI,TEMPERATURE,ZENITH,AZIMUTH,CLOUD_OPACITY,ENTRY_TIME
0,1,2018-10-05 00:00:00,0,5.3,0,0,27.4,173,-118,37.0,2018-10-04 20:00:00.000
1,2,2018-10-05 00:15:00,0,5.3,0,0,27.3,169,-108,37.0,2018-10-04 20:15:00.000
2,3,2018-10-05 00:30:00,0,5.3,0,0,27.2,166,-104,36.9,2018-10-04 20:30:00.000
3,4,2018-10-05 00:45:00,0,5.3,0,0,27.2,162,-101,36.8,2018-10-04 20:45:00.000
4,5,2018-10-05 01:00:00,0,5.3,0,0,27.1,158,-99,36.8,2018-10-04 21:00:00.000
5,6,2018-10-05 01:15:00,0,5.3,0,0,27.1,155,-98,36.8,2018-10-04 21:15:00.000
6,7,2018-10-05 01:30:00,0,5.4,0,0,27.0,151,-97,36.8,2018-10-04 21:30:00.000
7,8,2018-10-05 01:45:00,0,5.4,0,0,26.9,147,-96,36.8,2018-10-04 21:45:00.000
8,9,2018-10-05 02:00:00,0,5.4,0,0,26.9,143,-96,37.0,2018-10-04 22:00:00.000
9,10,2018-10-05 02:15:00,0,5.4,0,0,26.9,140,-95,37.0,2018-10-04 22:15:00.000
10,11,2018-10-05 02:30:00,0,5.4,0,0,26.9,136,-95,37.0,2018-10-04 22:30:00.000
11,12,2018-10-05 02:45:00,0,5.4,0,0,26.8,132,-95,37.0,2018-10-04 22:45:00.000
12,13,2018-10-05 03:00:00,0,5.4,0,0,26.8,129,-95,37.0,2018-10-04 23:00:00.000
13,14,2018-10-05 03:15:00,0,5.4,0,0,26.8,125,-94,29.0,2018-10-04 23:15:00.000
14,15,2018-10-05 03:30:00,0,5.4,0,0,26.8,121,-94,36.8,2018-10-04 23:30:00.000
15,16,2018-10-05 03:45:00,0,5.4,0,0,26.8,117,-94,37.0,2018-10-04 23:45:00.000
16,17,2018-10-05 04:00:00,0,5.4,0,0,26.7,114,-94,37.0,2018-10-05 00:00:00.000
17,18,2018-10-05 04:15:00,0,5.4,0,0,26.7,110,-94,37.0,2018-10-05 00:15:00.000
18,19,2018-10-05 04:30:00,0,5.4,0,0,26.7,106,-94,37.0,2018-10-05 00:30:00.000
19,20,2018-10-05 04:45:00,0,5.4,0,0,26.7,102,-94,38.1,2018-10-05 00:45:00.000
20,21,2018-10-05 05:00:00,0,5.4,0,0,26.7,99,-94,50.5,2018-10-05 01:00:00.000
21,22,2018-10-05 05:15:00,0,5.4,0,0,26.8,95,-94,53.3,2018-10-05 01:15:00.000
22,23,2018-10-05 05:30:00,0,5.4,0,0,26.9,91,-94,42.8,2018-10-05 01:30:00.000
23,24,2018-10-05 05:45:00,14,5.3,0,14,27.0,87,-94,35.4,2018-10-05 01:45:00.000
24,25,2018-10-05 06:00:00,59,5.3,164,39,27.1,84,-94,8.9,2018-10-05 02:00:00.000
25,26,2018-10-05 06:15:00,103,5.2,189,69,27.2,80,-94,11.1,2018-10-05 02:15:00.000
26,27,2018-10-05 06:30:00,151,5.2,224,97,27.4,76,-94,12.9,2018-10-05 02:30:00.000
27,28,2018-10-05 06:45:00,204,5.2,270,122,27.5,72,-94,13.1,2018-10-05 02:45:00.000
28,29,2018-10-05 07:00:00,271,5.1,399,126,27.6,69,-95,8.7,2018-10-05 03:00:00.000
29,30,2018-10-05 07:15:00,323,5.1,399,153,27.7,65,-95,10.3,2018-10-05 03:15:00.000
30,31,2018-10-05 07:30:00,385,5.1,467,160,27.8,61,-95,8.5,2018-10-05 03:30:00.000
31,32,2018-10-05 07:45:00,481,5.0,714,97,27.9,57,-95,0.0,2018-10-05 03:45:00.000
32,33,2018-10-05 08:00:00,541,5.0,741,102,28.0,54,-95,0.0,2018-10-05 04:00:00.000
33,34,2018-10-05 08:15:00,598,4.9,763,106,28.0,50,-96,0.0,2018-10-05 04:15:00.000
34,35,2018-10-05 08:30:00,651,4.9,782,110,28.0,46,-96,0.0,2018-10-05 04:30:00.000
35,36,2018-10-05 08:45:00,702,4.8,798,113,28.0,42,-97,0.0,2018-10-05 04:45:00.000
36,37,2018-10-05 09:00:00,750,4.8,812,116,28.1,39,-97,0.0,2018-10-05 05:00:00.000
37,38,2018-10-05 09:15:00,763,4.7,710,181,28.1,35,-98,3.8,2018-10-05 05:15:00.000
38,39,2018-10-05 09:30:00,786,4.7,665,218,28.1,31,-99,5.7,2018-10-05 05:30:00.000
39,40,2018-10-05 09:45:00,772,4.6,521,310,28.1,28,-100,11.2,2018-10-05 05:45:00.000
40,41,2018-10-05 10:00:00,828,4.6,607,273,28.1,24,-102,8.2,2018-10-05 06:00:00.000
41,42,2018-10-05 10:15:00,819,4.5,524,328,28.1,20,-104,11.8,2018-10-05 06:15:00.000
42,43,2018-10-05 10:30:00,751,4.5,294,470,28.2,17,-107,21.0,2018-10-05 06:30:00.000
43,44,2018-10-05 10:45:00,599,4.4,34,567,28.2,13,-111,38.1,2018-10-05 06:45:00.000
44,45,2018-10-05 11:00:00,669,4.4,120,550,28.2,10,-119,31.8,2018-10-05 07:00:00.000
45,46,2018-10-05 11:15:00,811,4.3,367,447,28.2,7,-136,17.9,2018-10-05 07:15:00.000
46,47,2018-10-05 11:30:00,830,4.2,402,430,28.2,5,-169,16.2,2018-10-05 07:30:00.000
47,48,2018-10-05 11:45:00,812,4.2,383,431,28.2,6,151,17.9,2018-10-05 07:45:00.000
48,49,2018-10-05 12:00:00,943,4.1,717,233,28.3,8,126,4.1,2018-10-05 08:00:00.000
49,50,2018-10-05 12:15:00,952,4.1,776,191,28.3,11,115,2.0,2018-10-05 08:15:00.000
50,51,2018-10-05 12:30:00,943,4.0,792,177,28.3,15,109,1.4,2018-10-05 08:30:00.000
51,52,2018-10-05 12:45:00,935,3.9,827,150,28.3,18,105,0.0,2018-10-05 08:45:00.000
52,53,2018-10-05 13:00:00,910,3.9,821,149,28.3,22,103,0.0,2018-10-05 09:00:00.000
53,54,2018-10-05 13:15:00,880,3.8,814,147,28.3,26,101,0.0,2018-10-05 09:15:00.000
54,55,2018-10-05 13:30:00,846,3.8,802,147,28.4,29,100,0.0,2018-10-05 09:30:00.000
55,56,2018-10-05 13:45:00,805,3.7,779,152,28.4,33,99,0.0,2018-10-05 09:45:00.000
56,57,2018-10-05 14:00:00,761,3.7,754,157,28.4,37,98,0.0,2018-10-05 10:00:00.000
57,58,2018-10-05 14:15:00,678,3.7,599,220,28.4,41,97,5.1,2018-10-05 10:15:00.000
58,59,2018-10-05 14:30:00,602,3.7,467,269,28.4,44,97,8.9,2018-10-05 10:30:00.000
59,60,2018-10-05 14:45:00,469,3.7,301,265,28.4,48,96,23.6,2018-10-05 10:45:00.000
60,61,2018-10-05 15:00:00,306,3.7,0,306,28.4,52,96,44.6,2018-10-05 11:00:00.000
61,62,2018-10-05 15:15:00,292,3.7,95,240,28.4,55,95,40.6,2018-10-05 11:15:00.000
62,63,2018-10-05 15:30:00,333,3.7,98,281,28.4,59,95,24.2,2018-10-05 11:30:00.000
63,64,2018-10-05 15:45:00,298,3.7,130,240,28.4,63,95,20.8,2018-10-05 11:45:00.000
64,65,2018-10-05 16:00:00,263,3.7,175,193,28.4,67,95,16.7,2018-10-05 12:00:00.000
65,66,2018-10-05 16:15:00,209,3.8,128,166,28.4,70,95,17.8,2018-10-05 12:15:00.000
66,67,2018-10-05 16:30:00,160,3.8,104,132,28.4,74,95,17.0,2018-10-05 12:30:00.000
67,68,2018-10-05 16:45:00,112,3.9,59,99,28.4,78,94,17.3,2018-10-05 12:45:00.000
68,69,2018-10-05 17:00:00,58,3.9,0,58,28.4,82,94,30.3,2018-10-05 13:00:00.000
69,70,2018-10-05 17:15:00,28,3.9,12,27,28.3,85,94,22.9,2018-10-05 13:15:00.000
70,71,2018-10-05 17:30:00,6,3.9,9,5,28.2,89,94,0.0,2018-10-05 13:30:00.000
71,72,2018-10-05 17:45:00,0,3.9,0,0,28.1,93,94,0.0,2018-10-05 13:45:00.000
72,73,2018-10-05 18:00:00,0,3.9,0,0,28.0,97,94,0.0,2018-10-05 14:00:00.000
73,74,2018-10-05 18:15:00,0,3.9,0,0,27.9,100,94,0.0,2018-10-05 14:15:00.000
74,75,2018-10-05 18:30:00,0,3.9,0,0,27.8,104,94,0.0,2018-10-05 14:30:00.000
75,76,2018-10-05 18:45:00,0,3.9,0,0,27.7,108,94,0.0,2018-10-05 14:45:00.000
76,77,2018-10-05 19:00:00,0,3.9,0,0,27.6,112,94,0.0,2018-10-05 15:00:00.000
77,78,2018-10-05 19:15:00,0,3.9,0,0,27.6,115,94,0.0,2018-10-05 15:15:00.000
78,79,2018-10-05 19:30:00,0,3.9,0,0,27.5,119,94,0.0,2018-10-05 15:30:00.000
79,80,2018-10-05 19:45:00,0,3.9,0,0,27.4,123,95,0.0,2018-10-05 15:45:00.000
80,81,2018-10-05 20:00:00,0,3.9,0,0,27.3,126,95,0.0,2018-10-05 16:00:00.000
81,82,2018-10-05 20:15:00,0,3.9,0,0,27.3,130,95,0.0,2018-10-05 16:15:00.000
82,83,2018-10-05 20:30:00,0,3.9,0,0,27.3,134,95,0.0,2018-10-05 16:30:00.000
83,84,2018-10-05 20:45:00,0,3.9,0,0,27.3,138,96,0.0,2018-10-05 16:45:00.000
84,85,2018-10-05 21:00:00,0,3.9,0,0,27.3,141,96,0.0,2018-10-05 17:00:00.000
85,86,2018-10-05 21:15:00,0,3.9,0,0,27.3,145,97,0.0,2018-10-05 17:15:00.000
86,87,2018-10-05 21:30:00,0,3.9,0,0,27.4,149,97,0.0,2018-10-05 17:30:00.000
87,88,2018-10-05 21:45:00,0,3.9,0,0,27.4,153,98,0.0,2018-10-05 17:45:00.000
88,89,2018-10-05 22:00:00,0,3.9,0,0,27.4,156,99,0.0,2018-10-05 18:00:00.000
89,90,2018-10-05 22:15:00,0,3.9,0,0,27.4,160,101,0.0,2018-10-05 18:15:00.000
90,91,2018-10-05 22:30:00,0,3.9,0,0,27.4,164,103,0.0,2018-10-05 18:30:00.000
91,92,2018-10-05 22:45:00,0,3.9,0,0,27.4,167,107,0.0,2018-10-05 18:45:00.000
92,93,2018-10-05 23:00:00,0,3.9,0,0,27.4,171,114,0.0,2018-10-05 19:00:00.000
93,94,2018-10-05 23:15:00,0,3.9,0,0,27.4,174,129,0.0,2018-10-05 19:15:00.000
94,95,2018-10-05 23:30:00,0,3.9,0,0,27.3,176,166,0.0,2018-10-05 19:30:00.000
95,96,2018-10-05 23:45:00,0,3.9,0,0,27.3,175,-145,0.0,2018-10-05 19:45:00.000
