,BLOCK_ID,DATA_DATETIME,GHI,WIND_SPEED,DNI,DHI,TEMPERATURE,ZENITH,AZIMUTH,CLOUD_OPACITY,ENTRY_TIME
0,1,2019-11-21 00:00:00,0,0.9,0,0,23.2,160,-160,0.0,2019-11-20 20:00:00.000
1,2,2019-11-21 00:15:00,0,0.9,0,0,23.2,158,-151,0.0,2019-11-20 20:15:00.000
2,3,2019-11-21 00:30:00,0,0.8,0,0,23.2,156,-144,0.0,2019-11-20 20:30:00.000
3,4,2019-11-21 00:45:00,0,0.8,0,0,23.2,154,-137,0.0,2019-11-20 20:45:00.000
4,5,2019-11-21 01:00:00,0,0.8,0,0,23.1,151,-132,0.0,2019-11-20 21:00:00.000
5,6,2019-11-21 01:15:00,0,0.8,0,0,23.1,148,-128,0.0,2019-11-20 21:15:00.000
6,7,2019-11-21 01:30:00,0,0.7,0,0,23.1,145,-125,0.0,2019-11-20 21:30:00.000
7,8,2019-11-21 01:45:00,0,0.7,0,0,23.1,142,-122,0.0,2019-11-20 21:45:00.000
8,9,2019-11-21 02:00:00,0,0.7,0,0,23.1,139,-120,0.0,2019-11-20 22:00:00.000
9,10,2019-11-21 02:15:00,0,0.7,0,0,23.1,136,-118,0.0,2019-11-20 22:15:00.000
10,11,2019-11-21 02:30:00,0,0.8,0,0,23.1,132,-116,0.0,2019-11-20 22:30:00.000
11,12,2019-11-21 02:45:00,0,0.8,0,0,23.1,129,-115,0.0,2019-11-20 22:45:00.000
12,13,2019-11-21 03:00:00,0,0.9,0,0,23.0,126,-114,0.0,2019-11-20 23:00:00.000
13,14,2019-11-21 03:15:00,0,0.9,0,0,23.0,122,-113,0.0,2019-11-20 23:15:00.000
14,15,2019-11-21 03:30:00,0,0.9,0,0,23.0,119,-112,0.0,2019-11-20 23:30:00.000
15,16,2019-11-21 03:45:00,0,0.9,0,0,23.0,115,-111,0.0,2019-11-20 23:45:00.000
16,17,2019-11-21 04:00:00,0,1.0,0,0,22.9,112,-111,0.0,2019-11-21 00:00:00.000
17,18,2019-11-21 04:15:00,0,0.9,0,0,22.9,108,-110,0.0,2019-11-21 00:15:00.000
18,19,2019-11-21 04:30:00,0,0.9,0,0,22.9,105,-110,0.0,2019-11-21 00:30:00.000
19,20,2019-11-21 04:45:00,0,0.9,0,0,22.9,101,-110,0.0,2019-11-21 00:45:00.000
20,21,2019-11-21 05:00:00,0,0.8,0,0,22.9,98,-110,0.0,2019-11-21 01:00:00.000
21,22,2019-11-21 05:15:00,0,0.8,0,0,23.0,94,-110,0.0,2019-11-21 01:15:00.000
22,23,2019-11-21 05:30:00,0,0.8,0,0,23.1,91,-110,0.0,2019-11-21 01:30:00.000
23,24,2019-11-21 05:45:00,24,0.7,73,18,23.2,87,-110,0.0,2019-11-21 01:45:00.000
24,25,2019-11-21 06:00:00,65,0.7,240,37,23.4,84,-110,0.0,2019-11-21 02:00:00.000
25,26,2019-11-21 06:15:00,115,0.7,356,53,23.9,80,-110,0.0,2019-11-21 02:15:00.000
26,27,2019-11-21 06:30:00,171,0.7,447,66,24.4,76,-110,0.0,2019-11-21 02:30:00.000
27,28,2019-11-21 06:45:00,230,0.6,520,78,25.0,73,-111,0.0,2019-11-21 02:45:00.000
28,29,2019-11-21 07:00:00,291,0.6,578,87,25.5,69,-111,0.0,2019-11-21 03:00:00.000
29,30,2019-11-21 07:15:00,351,0.6,626,96,26.3,66,-112,0.0,2019-11-21 03:15:00.000
30,31,2019-11-21 07:30:00,411,0.6,666,103,27.0,62,-112,0.0,2019-11-21 03:30:00.000
31,32,2019-11-21 07:45:00,470,0.6,700,109,27.7,59,-113,0.0,2019-11-21 03:45:00.000
32,33,2019-11-21 08:00:00,526,0.6,728,115,28.4,56,-114,0.0,2019-11-21 04:00:00.000
33,34,2019-11-21 08:15:00,580,0.5,753,120,29.0,52,-116,0.0,2019-11-21 04:15:00.000
34,35,2019-11-21 08:30:00,632,0.4,773,124,29.7,49,-117,0.0,2019-11-21 04:30:00.000
35,36,2019-11-21 08:45:00,681,0.3,791,128,30.3,46,-119,0.0,2019-11-21 04:45:00.000
36,37,2019-11-21 09:00:00,727,0.2,806,132,30.8,42,-121,0.0,2019-11-21 05:00:00.000
37,38,2019-11-21 09:15:00,769,0.2,818,135,31.1,39,-123,0.0,2019-11-21 05:15:00.000
38,39,2019-11-21 09:30:00,808,0.4,829,138,31.3,36,-126,0.0,2019-11-21 05:30:00.000
39,40,2019-11-21 09:45:00,842,0.5,838,140,31.6,33,-129,0.0,2019-11-21 05:45:00.000
40,41,2019-11-21 10:00:00,873,0.7,846,142,31.6,30,-133,0.0,2019-11-21 06:00:00.000
41,42,2019-11-21 10:15:00,895,0.8,840,151,31.2,28,-138,0.4,2019-11-21 06:15:00.000
42,43,2019-11-21 10:30:00,902,0.8,793,185,30.8,25,-144,2.0,2019-11-21 06:30:00.000
43,44,2019-11-21 10:45:00,931,0.9,836,163,30.3,23,-151,0.5,2019-11-21 06:45:00.000
44,45,2019-11-21 11:00:00,933,1.0,802,187,30.0,22,-159,1.5,2019-11-21 07:00:00.000
45,46,2019-11-21 11:15:00,894,1.0,662,275,30.2,21,-169,6.1,2019-11-21 07:15:00.000
46,47,2019-11-21 11:30:00,806,1.0,396,434,30.3,20,-179,15.6,2019-11-21 07:30:00.000
47,48,2019-11-21 11:45:00,803,1.1,407,422,30.4,20,171,15.7,2019-11-21 07:45:00.000
48,49,2019-11-21 12:00:00,844,1.1,533,347,30.5,21,162,10.8,2019-11-21 08:00:00.000
49,50,2019-11-21 12:15:00,773,1.1,352,448,30.5,23,153,17.4,2019-11-21 08:15:00.000
50,51,2019-11-21 12:30:00,870,1.1,681,252,30.4,25,146,5.3,2019-11-21 08:30:00.000
51,52,2019-11-21 12:45:00,890,1.2,797,180,30.4,27,139,1.0,2019-11-21 08:45:00.000
52,53,2019-11-21 13:00:00,874,1.2,822,159,30.3,30,134,0.0,2019-11-21 09:00:00.000
53,54,2019-11-21 13:15:00,706,1.2,370,392,30.1,32,130,16.5,2019-11-21 09:15:00.000
54,55,2019-11-21 13:30:00,583,1.2,112,492,30.0,35,127,28.1,2019-11-21 09:30:00.000
55,56,2019-11-21 13:45:00,590,1.3,191,440,29.9,38,124,23.9,2019-11-21 09:45:00.000
56,57,2019-11-21 14:00:00,617,1.3,363,346,29.7,42,121,15.9,2019-11-21 10:00:00.000
57,58,2019-11-21 14:15:00,586,1.2,389,312,29.6,45,119,14.9,2019-11-21 10:15:00.000
58,59,2019-11-21 14:30:00,611,1.2,629,191,29.4,48,117,4.7,2019-11-21 10:30:00.000
59,60,2019-11-21 14:45:00,537,1.2,502,226,29.2,51,116,8.9,2019-11-21 10:45:00.000
60,61,2019-11-21 15:00:00,494,1.2,509,201,29.0,55,115,8.0,2019-11-21 11:00:00.000
61,62,2019-11-21 15:15:00,407,1.1,316,241,28.7,58,114,15.3,2019-11-21 11:15:00.000
62,63,2019-11-21 15:30:00,336,1.1,193,244,28.5,62,113,20.6,2019-11-21 11:30:00.000
63,64,2019-11-21 15:45:00,251,1.1,16,245,28.3,65,112,30.9,2019-11-21 11:45:00.000
64,65,2019-11-21 16:00:00,170,1.0,0,170,28.0,69,111,44.3,2019-11-21 12:00:00.000
65,66,2019-11-21 16:15:00,126,1.0,0,126,27.8,72,111,47.9,2019-11-21 12:15:00.000
66,67,2019-11-21 16:30:00,105,1.0,0,105,27.5,76,110,43.0,2019-11-21 12:30:00.000
67,68,2019-11-21 16:45:00,68,1.0,0,68,27.2,79,110,47.3,2019-11-21 12:45:00.000
68,69,2019-11-21 17:00:00,41,1.0,0,41,26.9,83,110,45.5,2019-11-21 13:00:00.000
69,70,2019-11-21 17:15:00,26,1.0,10,25,26.5,86,110,16.2,2019-11-21 13:15:00.000
70,71,2019-11-21 17:30:00,3,1.0,7,3,26.0,90,110,0.0,2019-11-21 13:30:00.000
71,72,2019-11-21 17:45:00,0,0.9,0,0,25.5,93,110,0.0,2019-11-21 13:45:00.000
72,73,2019-11-21 18:00:00,0,0.9,0,0,25.1,97,110,0.0,2019-11-21 14:00:00.000
73,74,2019-11-21 18:15:00,0,0.9,0,0,25.0,100,110,0.0,2019-11-21 14:15:00.000
74,75,2019-11-21 18:30:00,0,0.8,0,0,24.8,104,110,0.0,2019-11-21 14:30:00.000
75,76,2019-11-21 18:45:00,0,0.8,0,0,24.7,107,110,0.0,2019-11-21 14:45:00.000
76,77,2019-11-21 19:00:00,0,0.8,0,0,24.6,111,111,0.0,2019-11-21 15:00:00.000
77,78,2019-11-21 19:15:00,0,0.8,0,0,24.5,114,111,0.0,2019-11-21 15:15:00.000
78,79,2019-11-21 19:30:00,0,0.9,0,0,24.4,118,112,0.0,2019-11-21 15:30:00.000
79,80,2019-11-21 19:45:00,0,1.0,0,0,24.4,121,113,0.0,2019-11-21 15:45:00.000
80,81,2019-11-21 20:00:00,0,1.0,0,0,24.3,125,114,0.0,2019-11-21 16:00:00.000
81,82,2019-11-21 20:15:00,0,1.0,0,0,24.2,128,115,0.0,2019-11-21 16:15:00.000
82,83,2019-11-21 20:30:00,0,0.9,0,0,24.1,132,116,0.0,2019-11-21 16:30:00.000
83,84,2019-11-21 20:45:00,0,0.8,0,0,24.0,135,118,0.0,2019-11-21 16:45:00.000
84,85,2019-11-21 21:00:00,0,0.7,0,0,23.9,138,120,0.0,2019-11-21 17:00:00.000
85,86,2019-11-21 21:15:00,0,0.7,0,0,23.9,141,122,0.0,2019-11-21 17:15:00.000
86,87,2019-11-21 21:30:00,0,0.7,0,0,23.8,145,124,0.0,2019-11-21 17:30:00.000
87,88,2019-11-21 21:45:00,0,0.7,0,0,23.7,148,128,0.0,2019-11-21 17:45:00.000
88,89,2019-11-21 22:00:00,0,0.7,0,0,23.7,151,132,0.0,2019-11-21 18:00:00.000
89,90,2019-11-21 22:15:00,0,0.7,0,0,23.6,153,137,0.0,2019-11-21 18:15:00.000
90,91,2019-11-21 22:30:00,0,0.7,0,0,23.5,156,143,0.0,2019-11-21 18:30:00.000
91,92,2019-11-21 22:45:00,0,0.7,0,0,23.5,158,150,0.0,2019-11-21 18:45:00.000
92,93,2019-11-21 23:00:00,0,0.7,0,0,23.4,159,158,0.0,2019-11-21 19:00:00.000
93,94,2019-11-21 23:15:00,0,0.7,0,0,23.4,160,168,0.0,2019-11-21 19:15:00.000
94,95,2019-11-21 23:30:00,0,0.7,0,0,23.3,161,179,0.0,2019-11-21 19:30:00.000
95,96,2019-11-21 23:45:00,0,0.7,0,0,23.3,161,-171,0.0,2019-11-21 19:45:00.000
