,BLOCK_ID,DATA_DATETIME,GHI,WIND_SPEED,DNI,DHI,TEMPERATURE,ZENITH,AZIMUTH,CLOUD_OPACITY,ENTRY_TIME
0,1,2020-10-07 00:00:00,0,1.5,0,0,23.7,172,-124,88.6,2020-10-06 20:00:00.000
1,2,2020-10-07 00:15:00,0,1.4,0,0,23.5,169,-113,95.6,2020-10-06 20:15:00.000
2,3,2020-10-07 00:30:00,0,1.4,0,0,23.4,165,-108,97.0,2020-10-06 20:30:00.000
3,4,2020-10-07 00:45:00,0,1.4,0,0,23.3,162,-104,97.0,2020-10-06 20:45:00.000
4,5,2020-10-07 01:00:00,0,1.4,0,0,23.2,158,-102,97.0,2020-10-06 21:00:00.000
5,6,2020-10-07 01:15:00,0,1.4,0,0,23.1,154,-100,97.0,2020-10-06 21:15:00.000
6,7,2020-10-07 01:30:00,0,1.4,0,0,23.1,151,-99,97.0,2020-10-06 21:30:00.000
7,8,2020-10-07 01:45:00,0,1.4,0,0,23.0,147,-98,97.0,2020-10-06 21:45:00.000
8,9,2020-10-07 02:00:00,0,1.4,0,0,22.9,143,-98,97.0,2020-10-06 22:00:00.000
9,10,2020-10-07 02:15:00,0,1.4,0,0,22.8,139,-97,97.0,2020-10-06 22:15:00.000
10,11,2020-10-07 02:30:00,0,1.4,0,0,22.8,136,-97,97.0,2020-10-06 22:30:00.000
11,12,2020-10-07 02:45:00,0,1.3,0,0,22.7,132,-96,97.0,2020-10-06 22:45:00.000
12,13,2020-10-07 03:00:00,0,1.3,0,0,22.6,128,-96,97.0,2020-10-06 23:00:00.000
13,14,2020-10-07 03:15:00,0,1.2,0,0,22.6,124,-96,97.0,2020-10-06 23:15:00.000
14,15,2020-10-07 03:30:00,0,1.1,0,0,22.5,121,-96,97.0,2020-10-06 23:30:00.000
15,16,2020-10-07 03:45:00,0,1.0,0,0,22.5,117,-95,97.0,2020-10-06 23:45:00.000
16,17,2020-10-07 04:00:00,0,0.9,0,0,22.5,113,-95,97.0,2020-10-07 00:00:00.000
17,18,2020-10-07 04:15:00,0,0.9,0,0,22.5,110,-95,95.1,2020-10-07 00:15:00.000
18,19,2020-10-07 04:30:00,0,0.9,0,0,22.4,106,-95,89.8,2020-10-07 00:30:00.000
19,20,2020-10-07 04:45:00,0,0.8,0,0,22.4,102,-95,77.9,2020-10-07 00:45:00.000
20,21,2020-10-07 05:00:00,0,0.8,0,0,22.4,98,-95,95.6,2020-10-07 01:00:00.000
21,22,2020-10-07 05:15:00,0,0.9,0,0,22.4,95,-95,90.5,2020-10-07 01:15:00.000
22,23,2020-10-07 05:30:00,0,0.9,0,0,22.4,91,-95,91.0,2020-10-07 01:30:00.000
23,24,2020-10-07 05:45:00,7,0.9,0,7,22.4,87,-95,77.9,2020-10-07 01:45:00.000
24,25,2020-10-07 06:00:00,44,0.9,0,44,22.5,83,-95,32.0,2020-10-07 02:00:00.000
25,26,2020-10-07 06:15:00,72,0.9,0,72,22.6,80,-95,37.1,2020-10-07 02:15:00.000
26,27,2020-10-07 06:30:00,101,1.0,0,101,22.7,76,-95,40.6,2020-10-07 02:30:00.000
27,28,2020-10-07 06:45:00,116,1.0,0,116,22.8,72,-96,49.8,2020-10-07 02:45:00.000
28,29,2020-10-07 07:00:00,142,0.9,0,142,22.9,68,-96,51.6,2020-10-07 03:00:00.000
29,30,2020-10-07 07:15:00,216,0.7,30,202,23.3,65,-96,39.7,2020-10-07 03:15:00.000
30,31,2020-10-07 07:30:00,319,0.5,136,253,23.7,61,-96,23.4,2020-10-07 03:30:00.000
31,32,2020-10-07 07:45:00,370,0.3,202,263,24.2,57,-97,21.8,2020-10-07 03:45:00.000
32,33,2020-10-07 08:00:00,349,0.4,0,349,24.5,54,-97,34.8,2020-10-07 04:00:00.000
33,34,2020-10-07 08:15:00,513,0.5,387,262,24.6,50,-97,13.3,2020-10-07 04:15:00.000
34,35,2020-10-07 08:30:00,594,0.7,530,226,24.6,46,-98,7.8,2020-10-07 04:30:00.000
35,36,2020-10-07 08:45:00,638,0.9,537,242,24.7,42,-98,8.0,2020-10-07 04:45:00.000
36,37,2020-10-07 09:00:00,633,1.0,390,330,24.8,39,-99,14.4,2020-10-07 05:00:00.000
37,38,2020-10-07 09:15:00,603,1.0,208,433,25.0,35,-100,23.0,2020-10-07 05:15:00.000
38,39,2020-10-07 09:30:00,534,0.9,42,499,25.2,31,-101,35.0,2020-10-07 05:30:00.000
39,40,2020-10-07 09:45:00,358,0.9,6,352,25.3,28,-103,58.5,2020-10-07 05:45:00.000
40,41,2020-10-07 10:00:00,708,0.8,282,449,25.6,24,-104,20.4,2020-10-07 06:00:00.000
41,42,2020-10-07 10:15:00,811,0.8,485,356,26.2,20,-107,11.4,2020-10-07 06:15:00.000
42,43,2020-10-07 10:30:00,866,0.7,589,302,26.8,17,-111,7.6,2020-10-07 06:30:00.000
43,44,2020-10-07 10:45:00,788,0.7,342,455,27.3,13,-116,17.5,2020-10-07 06:45:00.000
44,45,2020-10-07 11:00:00,700,0.6,133,569,27.9,10,-126,27.6,2020-10-07 07:00:00.000
45,46,2020-10-07 11:15:00,590,0.6,0,590,28.5,7,-143,39.5,2020-10-07 07:15:00.000
46,47,2020-10-07 11:30:00,634,0.7,6,628,29.1,6,-173,35.2,2020-10-07 07:30:00.000
47,48,2020-10-07 11:45:00,749,0.7,231,519,29.7,7,154,23.4,2020-10-07 07:45:00.000
48,49,2020-10-07 12:00:00,630,0.8,8,622,30.1,9,132,35.2,2020-10-07 08:00:00.000
49,50,2020-10-07 12:15:00,738,0.8,219,523,30.3,12,120,23.3,2020-10-07 08:15:00.000
50,51,2020-10-07 12:30:00,697,0.8,160,543,30.5,15,113,26.4,2020-10-07 08:30:00.000
51,52,2020-10-07 12:45:00,522,0.8,0,522,30.7,19,108,43.8,2020-10-07 08:45:00.000
52,53,2020-10-07 13:00:00,415,0.7,0,415,30.7,22,105,54.0,2020-10-07 09:00:00.000
53,54,2020-10-07 13:15:00,69,0.3,0,69,30.4,26,103,92.1,2020-10-07 09:15:00.000
54,55,2020-10-07 13:30:00,25,0.2,0,25,30.1,30,102,97.0,2020-10-07 09:30:00.000
55,56,2020-10-07 13:45:00,26,0.6,0,26,29.8,33,101,96.7,2020-10-07 09:45:00.000
56,57,2020-10-07 14:00:00,30,0.9,0,30,29.4,37,100,96.0,2020-10-07 10:00:00.000
57,58,2020-10-07 14:15:00,21,0.7,0,21,28.9,41,99,97.0,2020-10-07 10:15:00.000
58,59,2020-10-07 14:30:00,20,0.5,0,20,28.4,45,98,97.0,2020-10-07 10:30:00.000
59,60,2020-10-07 14:45:00,18,0.3,0,18,27.9,48,98,97.0,2020-10-07 10:45:00.000
60,61,2020-10-07 15:00:00,48,0.3,0,48,27.5,52,97,91.4,2020-10-07 11:00:00.000
61,62,2020-10-07 15:15:00,239,0.4,0,239,27.3,56,97,52.5,2020-10-07 11:15:00.000
62,63,2020-10-07 15:30:00,269,0.5,0,269,27.1,59,97,39.2,2020-10-07 11:30:00.000
63,64,2020-10-07 15:45:00,216,0.6,0,216,27.0,63,96,44.0,2020-10-07 11:45:00.000
64,65,2020-10-07 16:00:00,153,0.7,0,153,26.8,67,96,52.6,2020-10-07 12:00:00.000
65,66,2020-10-07 16:15:00,106,0.7,0,106,26.4,71,96,58.6,2020-10-07 12:15:00.000
66,67,2020-10-07 16:30:00,71,0.8,0,71,26.1,74,96,65.2,2020-10-07 12:30:00.000
67,68,2020-10-07 16:45:00,67,0.8,0,67,25.8,78,96,53.7,2020-10-07 12:45:00.000
68,69,2020-10-07 17:00:00,29,0.9,0,29,25.4,82,95,65.2,2020-10-07 13:00:00.000
69,70,2020-10-07 17:15:00,14,0.9,0,14,25.2,86,95,61.3,2020-10-07 13:15:00.000
70,71,2020-10-07 17:30:00,2,0.9,0,2,24.9,89,95,56.0,2020-10-07 13:30:00.000
71,72,2020-10-07 17:45:00,0,0.9,0,0,24.6,93,95,74.6,2020-10-07 13:45:00.000
72,73,2020-10-07 18:00:00,0,1.0,0,0,24.3,97,95,86.6,2020-10-07 14:00:00.000
73,74,2020-10-07 18:15:00,0,1.0,0,0,24.2,101,95,76.9,2020-10-07 14:15:00.000
74,75,2020-10-07 18:30:00,0,1.0,0,0,24.1,104,95,56.0,2020-10-07 14:30:00.000
75,76,2020-10-07 18:45:00,0,1.0,0,0,23.9,108,95,47.7,2020-10-07 14:45:00.000
76,77,2020-10-07 19:00:00,0,1.1,0,0,23.8,112,96,46.2,2020-10-07 15:00:00.000
77,78,2020-10-07 19:15:00,0,1.0,0,0,23.8,115,96,58.9,2020-10-07 15:15:00.000
78,79,2020-10-07 19:30:00,0,0.9,0,0,23.7,119,96,93.0,2020-10-07 15:30:00.000
79,80,2020-10-07 19:45:00,0,0.9,0,0,23.7,123,96,43.4,2020-10-07 15:45:00.000
80,81,2020-10-07 20:00:00,0,0.8,0,0,23.6,127,96,36.2,2020-10-07 16:00:00.000
81,82,2020-10-07 20:15:00,0,0.8,0,0,23.6,130,97,46.9,2020-10-07 16:15:00.000
82,83,2020-10-07 20:30:00,0,0.8,0,0,23.6,134,97,41.2,2020-10-07 16:30:00.000
83,84,2020-10-07 20:45:00,0,0.8,0,0,23.6,138,97,42.7,2020-10-07 16:45:00.000
84,85,2020-10-07 21:00:00,0,0.8,0,0,23.6,142,98,45.2,2020-10-07 17:00:00.000
85,86,2020-10-07 21:15:00,0,0.8,0,0,23.6,145,99,60.0,2020-10-07 17:15:00.000
86,87,2020-10-07 21:30:00,0,0.8,0,0,23.6,149,99,74.8,2020-10-07 17:30:00.000
87,88,2020-10-07 21:45:00,0,0.8,0,0,23.5,153,101,78.1,2020-10-07 17:45:00.000
88,89,2020-10-07 22:00:00,0,0.8,0,0,23.5,156,102,55.6,2020-10-07 18:00:00.000
89,90,2020-10-07 22:15:00,0,0.8,0,0,23.4,160,104,56.1,2020-10-07 18:15:00.000
90,91,2020-10-07 22:30:00,0,0.7,0,0,23.4,164,107,56.0,2020-10-07 18:30:00.000
91,92,2020-10-07 22:45:00,0,0.7,0,0,23.3,167,112,54.4,2020-10-07 18:45:00.000
92,93,2020-10-07 23:00:00,0,0.7,0,0,23.3,170,121,49.4,2020-10-07 19:00:00.000
93,94,2020-10-07 23:15:00,0,0.6,0,0,23.3,173,138,60.6,2020-10-07 19:15:00.000
94,95,2020-10-07 23:30:00,0,0.5,0,0,23.3,175,172,77.8,2020-10-07 19:30:00.000
95,96,2020-10-07 23:45:00,0,0.5,0,0,23.2,174,-149,53.8,2020-10-07 19:45:00.000
