,BLOCK_ID,DATA_DATETIME,GHI,WIND_SPEED,DNI,DHI,TEMPERATURE,ZENITH,AZIMUTH,CLOUD_OPACITY,ENTRY_TIME
0,1,2019-11-13 00:00:00,0,0.5,0,0,23.4,162,-157,0.0,2019-11-12 20:00:00.000
1,2,2019-11-13 00:15:00,0,0.5,0,0,23.4,160,-147,0.0,2019-11-12 20:15:00.000
2,3,2019-11-13 00:30:00,0,0.5,0,0,23.4,158,-140,0.0,2019-11-12 20:30:00.000
3,4,2019-11-13 00:45:00,0,0.5,0,0,23.3,155,-133,0.0,2019-11-12 20:45:00.000
4,5,2019-11-13 01:00:00,0,0.5,0,0,23.3,152,-128,0.0,2019-11-12 21:00:00.000
5,6,2019-11-13 01:15:00,0,0.5,0,0,23.2,149,-125,0.0,2019-11-12 21:15:00.000
6,7,2019-11-13 01:30:00,0,0.5,0,0,23.2,146,-121,0.0,2019-11-12 21:30:00.000
7,8,2019-11-13 01:45:00,0,0.4,0,0,23.2,143,-119,0.0,2019-11-12 21:45:00.000
8,9,2019-11-13 02:00:00,0,0.4,0,0,23.2,139,-117,0.0,2019-11-12 22:00:00.000
9,10,2019-11-13 02:15:00,0,0.4,0,0,23.1,136,-115,0.0,2019-11-12 22:15:00.000
10,11,2019-11-13 02:30:00,0,0.4,0,0,23.1,133,-113,0.0,2019-11-12 22:30:00.000
11,12,2019-11-13 02:45:00,0,0.5,0,0,23.1,129,-112,0.0,2019-11-12 22:45:00.000
12,13,2019-11-13 03:00:00,0,0.5,0,0,23.0,126,-111,0.0,2019-11-12 23:00:00.000
13,14,2019-11-13 03:15:00,0,0.5,0,0,23.0,122,-110,0.0,2019-11-12 23:15:00.000
14,15,2019-11-13 03:30:00,0,0.5,0,0,23.0,119,-110,0.0,2019-11-12 23:30:00.000
15,16,2019-11-13 03:45:00,0,0.5,0,0,23.0,115,-109,0.0,2019-11-12 23:45:00.000
16,17,2019-11-13 04:00:00,0,0.5,0,0,23.0,112,-109,0.0,2019-11-13 00:00:00.000
17,18,2019-11-13 04:15:00,0,0.4,0,0,22.9,108,-108,0.0,2019-11-13 00:15:00.000
18,19,2019-11-13 04:30:00,0,0.4,0,0,22.9,104,-108,0.0,2019-11-13 00:30:00.000
19,20,2019-11-13 04:45:00,0,0.4,0,0,22.9,101,-108,0.0,2019-11-13 00:45:00.000
20,21,2019-11-13 05:00:00,0,0.3,0,0,22.9,97,-108,0.0,2019-11-13 01:00:00.000
21,22,2019-11-13 05:15:00,0,0.3,0,0,23.0,94,-107,0.0,2019-11-13 01:15:00.000
22,23,2019-11-13 05:30:00,1,0.2,1,1,23.1,90,-107,0.0,2019-11-13 01:30:00.000
23,24,2019-11-13 05:45:00,29,0.2,106,20,23.2,87,-108,0.0,2019-11-13 01:45:00.000
24,25,2019-11-13 06:00:00,68,0.1,201,44,23.4,83,-108,4.7,2019-11-13 02:00:00.000
25,26,2019-11-13 06:15:00,119,0.0,310,61,23.9,79,-108,4.2,2019-11-13 02:15:00.000
26,27,2019-11-13 06:30:00,181,0.0,471,66,24.4,76,-108,0.0,2019-11-13 02:30:00.000
27,28,2019-11-13 06:45:00,240,0.1,537,77,24.9,72,-109,0.0,2019-11-13 02:45:00.000
28,29,2019-11-13 07:00:00,301,0.2,590,87,25.5,69,-109,0.0,2019-11-13 03:00:00.000
29,30,2019-11-13 07:15:00,361,0.3,633,96,26.3,65,-110,0.0,2019-11-13 03:15:00.000
30,31,2019-11-13 07:30:00,420,0.4,668,104,27.1,62,-110,0.0,2019-11-13 03:30:00.000
31,32,2019-11-13 07:45:00,479,0.5,698,111,27.9,58,-111,0.0,2019-11-13 03:45:00.000
32,33,2019-11-13 08:00:00,535,0.7,723,118,28.6,55,-112,0.0,2019-11-13 04:00:00.000
33,34,2019-11-13 08:15:00,589,0.8,745,123,29.0,51,-113,0.0,2019-11-13 04:15:00.000
34,35,2019-11-13 08:30:00,640,1.0,763,129,29.5,48,-115,0.0,2019-11-13 04:30:00.000
35,36,2019-11-13 08:45:00,689,1.2,779,133,29.9,45,-116,0.0,2019-11-13 04:45:00.000
36,37,2019-11-13 09:00:00,734,1.3,793,138,30.3,41,-118,0.0,2019-11-13 05:00:00.000
37,38,2019-11-13 09:15:00,776,1.5,805,141,30.6,38,-120,0.0,2019-11-13 05:15:00.000
38,39,2019-11-13 09:30:00,814,1.6,815,145,30.8,35,-123,0.0,2019-11-13 05:30:00.000
39,40,2019-11-13 09:45:00,806,1.7,679,229,31.1,32,-126,4.9,2019-11-13 05:45:00.000
40,41,2019-11-13 10:00:00,673,1.8,226,476,31.3,29,-130,23.3,2019-11-13 06:00:00.000
41,42,2019-11-13 10:15:00,712,1.9,266,472,31.4,26,-135,21.3,2019-11-13 06:15:00.000
42,43,2019-11-13 10:30:00,537,2.0,61,482,31.5,23,-142,41.9,2019-11-13 06:30:00.000
43,44,2019-11-13 10:45:00,346,2.1,0,346,31.7,21,-149,63.2,2019-11-13 06:45:00.000
44,45,2019-11-13 11:00:00,281,2.2,0,281,31.7,20,-158,70.5,2019-11-13 07:00:00.000
45,46,2019-11-13 11:15:00,87,2.1,0,87,31.5,19,-169,90.9,2019-11-13 07:15:00.000
46,47,2019-11-13 11:30:00,74,2.1,0,74,31.3,18,-180,92.3,2019-11-13 07:30:00.000
47,48,2019-11-13 11:45:00,406,2.0,0,406,31.1,19,169,57.6,2019-11-13 07:45:00.000
48,49,2019-11-13 12:00:00,251,2.0,0,251,30.9,20,158,73.6,2019-11-13 08:00:00.000
49,50,2019-11-13 12:15:00,102,1.9,0,102,30.8,21,149,89.1,2019-11-13 08:15:00.000
50,51,2019-11-13 12:30:00,62,1.8,0,62,30.6,23,142,93.3,2019-11-13 08:30:00.000
51,52,2019-11-13 12:45:00,154,1.7,0,154,30.5,26,136,82.9,2019-11-13 08:45:00.000
52,53,2019-11-13 13:00:00,420,1.6,0,420,30.4,29,131,51.9,2019-11-13 09:00:00.000
53,54,2019-11-13 13:15:00,596,1.6,94,516,30.3,32,126,29.4,2019-11-13 09:15:00.000
54,55,2019-11-13 13:30:00,606,1.6,160,474,30.2,35,123,25.3,2019-11-13 09:30:00.000
55,56,2019-11-13 13:45:00,628,1.6,307,384,30.1,38,120,18.7,2019-11-13 09:45:00.000
56,57,2019-11-13 14:00:00,366,1.6,3,364,30.0,41,118,49.9,2019-11-13 10:00:00.000
57,58,2019-11-13 14:15:00,282,1.5,0,282,29.9,44,116,58.8,2019-11-13 10:15:00.000
58,59,2019-11-13 14:30:00,103,1.4,0,103,29.8,48,115,83.8,2019-11-13 10:30:00.000
59,60,2019-11-13 14:45:00,62,1.3,0,62,29.7,51,113,89.4,2019-11-13 10:45:00.000
60,61,2019-11-13 15:00:00,33,1.2,0,33,29.6,55,112,93.8,2019-11-13 11:00:00.000
61,62,2019-11-13 15:15:00,46,1.1,0,46,29.5,58,111,90.3,2019-11-13 11:15:00.000
62,63,2019-11-13 15:30:00,74,1.0,0,74,29.3,62,110,81.8,2019-11-13 11:30:00.000
63,64,2019-11-13 15:45:00,73,0.9,0,73,29.2,65,110,79.4,2019-11-13 11:45:00.000
64,65,2019-11-13 16:00:00,78,0.8,0,78,29.0,69,109,73.5,2019-11-13 12:00:00.000
65,66,2019-11-13 16:15:00,72,0.8,0,72,28.6,72,109,69.0,2019-11-13 12:15:00.000
66,67,2019-11-13 16:30:00,73,0.7,0,73,28.1,76,108,58.1,2019-11-13 12:30:00.000
67,68,2019-11-13 16:45:00,43,0.6,0,43,27.7,79,108,63.3,2019-11-13 12:45:00.000
68,69,2019-11-13 17:00:00,33,0.6,0,33,27.2,83,108,52.5,2019-11-13 13:00:00.000
69,70,2019-11-13 17:15:00,16,0.6,0,16,26.8,87,108,42.0,2019-11-13 13:15:00.000
70,71,2019-11-13 17:30:00,1,0.6,0,1,26.3,90,108,27.7,2019-11-13 13:30:00.000
71,72,2019-11-13 17:45:00,0,0.6,0,0,25.8,94,108,25.4,2019-11-13 13:45:00.000
72,73,2019-11-13 18:00:00,0,0.6,0,0,25.4,97,108,7.5,2019-11-13 14:00:00.000
73,74,2019-11-13 18:15:00,0,0.6,0,0,25.2,101,108,0.0,2019-11-13 14:15:00.000
74,75,2019-11-13 18:30:00,0,0.6,0,0,25.1,104,108,0.0,2019-11-13 14:30:00.000
75,76,2019-11-13 18:45:00,0,0.5,0,0,24.9,108,108,9.3,2019-11-13 14:45:00.000
76,77,2019-11-13 19:00:00,0,0.5,0,0,24.8,112,109,6.2,2019-11-13 15:00:00.000
77,78,2019-11-13 19:15:00,0,0.4,0,0,24.7,115,109,30.8,2019-11-13 15:15:00.000
78,79,2019-11-13 19:30:00,0,0.4,0,0,24.7,119,110,30.8,2019-11-13 15:30:00.000
79,80,2019-11-13 19:45:00,0,0.3,0,0,24.6,122,111,23.0,2019-11-13 15:45:00.000
80,81,2019-11-13 20:00:00,0,0.3,0,0,24.5,126,111,0.9,2019-11-13 16:00:00.000
81,82,2019-11-13 20:15:00,0,0.3,0,0,24.4,129,112,0.0,2019-11-13 16:15:00.000
82,83,2019-11-13 20:30:00,0,0.3,0,0,24.3,133,114,0.0,2019-11-13 16:30:00.000
83,84,2019-11-13 20:45:00,0,0.2,0,0,24.3,136,115,0.0,2019-11-13 16:45:00.000
84,85,2019-11-13 21:00:00,0,0.2,0,0,24.2,139,117,0.0,2019-11-13 17:00:00.000
85,86,2019-11-13 21:15:00,0,0.2,0,0,24.1,143,119,0.0,2019-11-13 17:15:00.000
86,87,2019-11-13 21:30:00,0,0.2,0,0,24.1,146,122,0.0,2019-11-13 17:30:00.000
87,88,2019-11-13 21:45:00,0,0.2,0,0,24.0,149,125,0.0,2019-11-13 17:45:00.000
88,89,2019-11-13 22:00:00,0,0.2,0,0,23.9,152,129,0.0,2019-11-13 18:00:00.000
89,90,2019-11-13 22:15:00,0,0.2,0,0,23.8,155,134,0.0,2019-11-13 18:15:00.000
90,91,2019-11-13 22:30:00,0,0.2,0,0,23.8,157,140,0.0,2019-11-13 18:30:00.000
91,92,2019-11-13 22:45:00,0,0.2,0,0,23.7,160,148,0.0,2019-11-13 18:45:00.000
92,93,2019-11-13 23:00:00,0,0.3,0,0,23.6,161,157,0.0,2019-11-13 19:00:00.000
93,94,2019-11-13 23:15:00,0,0.3,0,0,23.6,163,168,0.0,2019-11-13 19:15:00.000
94,95,2019-11-13 23:30:00,0,0.3,0,0,23.5,163,180,0.0,2019-11-13 19:30:00.000
95,96,2019-11-13 23:45:00,0,0.4,0,0,23.4,163,-168,0.0,2019-11-13 19:45:00.000
