,BLOCK_ID,DATA_DATETIME,GHI,WIND_SPEED,DNI,DHI,TEMPERATURE,ZENITH,AZIMUTH,CLOUD_OPACITY,ENTRY_TIME
0,1,2020-07-28 00:00:00,0,1.3,0,0,23.0,160,-5,18.8,2020-07-27 20:00:00.000
1,2,2020-07-28 00:15:00,0,1.3,0,0,22.9,159,-15,15.0,2020-07-27 20:15:00.000
2,3,2020-07-28 00:30:00,0,1.3,0,0,22.9,158,-25,15.0,2020-07-27 20:30:00.000
3,4,2020-07-28 00:45:00,0,1.3,0,0,22.9,156,-32,27.4,2020-07-27 20:45:00.000
4,5,2020-07-28 01:00:00,0,1.3,0,0,22.8,154,-39,27.4,2020-07-27 21:00:00.000
5,6,2020-07-28 01:15:00,0,1.3,0,0,22.8,152,-45,20.5,2020-07-27 21:15:00.000
6,7,2020-07-28 01:30:00,0,1.3,0,0,22.8,149,-49,32.0,2020-07-27 21:30:00.000
7,8,2020-07-28 01:45:00,0,1.3,0,0,22.8,146,-53,24.3,2020-07-27 21:45:00.000
8,9,2020-07-28 02:00:00,0,1.3,0,0,22.8,143,-56,22.2,2020-07-27 22:00:00.000
9,10,2020-07-28 02:15:00,0,1.3,0,0,22.8,140,-58,18.3,2020-07-27 22:15:00.000
10,11,2020-07-28 02:30:00,0,1.2,0,0,22.8,136,-61,20.6,2020-07-27 22:30:00.000
11,12,2020-07-28 02:45:00,0,1.2,0,0,22.8,133,-62,25.4,2020-07-27 22:45:00.000
12,13,2020-07-28 03:00:00,0,1.2,0,0,22.7,130,-64,25.4,2020-07-27 23:00:00.000
13,14,2020-07-28 03:15:00,0,1.2,0,0,22.8,126,-65,18.1,2020-07-27 23:15:00.000
14,15,2020-07-28 03:30:00,0,1.2,0,0,22.8,123,-66,34.4,2020-07-27 23:30:00.000
15,16,2020-07-28 03:45:00,0,1.2,0,0,22.8,120,-67,23.2,2020-07-27 23:45:00.000
16,17,2020-07-28 04:00:00,0,1.3,0,0,22.8,116,-68,20.6,2020-07-28 00:00:00.000
17,18,2020-07-28 04:15:00,0,1.3,0,0,22.8,113,-69,22.2,2020-07-28 00:15:00.000
18,19,2020-07-28 04:30:00,0,1.3,0,0,22.9,109,-69,22.0,2020-07-28 00:30:00.000
19,20,2020-07-28 04:45:00,0,1.3,0,0,22.9,106,-70,25.8,2020-07-28 00:45:00.000
20,21,2020-07-28 05:00:00,0,1.3,0,0,22.9,102,-70,34.2,2020-07-28 01:00:00.000
21,22,2020-07-28 05:15:00,0,1.3,0,0,23.0,99,-70,17.5,2020-07-28 01:15:00.000
22,23,2020-07-28 05:30:00,0,1.3,0,0,23.0,95,-71,20.2,2020-07-28 01:30:00.000
23,24,2020-07-28 05:45:00,0,1.3,0,0,23.0,91,-71,27.8,2020-07-28 01:45:00.000
24,25,2020-07-28 06:00:00,9,1.4,0,9,23.1,88,-71,42.9,2020-07-28 02:00:00.000
25,26,2020-07-28 06:15:00,50,1.3,162,33,23.3,84,-71,5.6,2020-07-28 02:15:00.000
26,27,2020-07-28 06:30:00,100,1.3,359,42,23.5,81,-71,0.0,2020-07-28 02:30:00.000
27,28,2020-07-28 06:45:00,152,1.3,452,53,23.7,77,-70,0.0,2020-07-28 02:45:00.000
28,29,2020-07-28 07:00:00,208,1.3,523,62,24.1,74,-70,0.0,2020-07-28 03:00:00.000
29,30,2020-07-28 07:15:00,265,1.3,579,69,24.6,70,-70,0.0,2020-07-28 03:15:00.000
30,31,2020-07-28 07:30:00,309,1.3,527,102,25.2,67,-69,4.0,2020-07-28 03:30:00.000
31,32,2020-07-28 07:45:00,361,1.3,540,117,25.8,63,-69,4.9,2020-07-28 03:45:00.000
32,33,2020-07-28 08:00:00,435,1.3,691,87,26.3,60,-68,0.0,2020-07-28 04:00:00.000
33,34,2020-07-28 08:15:00,438,1.5,451,187,26.6,56,-67,10.4,2020-07-28 04:15:00.000
34,35,2020-07-28 08:30:00,532,1.7,691,113,26.9,53,-66,1.8,2020-07-28 04:30:00.000
35,36,2020-07-28 08:45:00,591,1.9,756,99,27.2,49,-65,0.0,2020-07-28 04:45:00.000
36,37,2020-07-28 09:00:00,576,2.1,516,219,27.5,46,-64,9.6,2020-07-28 05:00:00.000
37,38,2020-07-28 09:15:00,665,2.3,718,139,27.7,43,-62,2.4,2020-07-28 05:15:00.000
38,39,2020-07-28 09:30:00,496,2.4,114,411,27.9,39,-60,31.2,2020-07-28 05:30:00.000
39,40,2020-07-28 09:45:00,690,2.5,546,250,28.2,36,-57,9.3,2020-07-28 05:45:00.000
40,41,2020-07-28 10:00:00,606,2.6,234,412,28.4,33,-54,23.6,2020-07-28 06:00:00.000
41,42,2020-07-28 10:15:00,540,2.7,38,506,28.6,30,-51,34.6,2020-07-28 06:15:00.000
42,43,2020-07-28 10:30:00,665,2.7,268,427,28.8,27,-46,21.8,2020-07-28 06:30:00.000
43,44,2020-07-28 10:45:00,721,2.8,364,390,28.9,25,-41,17.1,2020-07-28 06:45:00.000
44,45,2020-07-28 11:00:00,805,2.8,556,292,29.1,23,-34,9.0,2020-07-28 07:00:00.000
45,46,2020-07-28 11:15:00,746,2.9,363,405,29.1,21,-26,16.7,2020-07-28 07:15:00.000
46,47,2020-07-28 11:30:00,720,2.9,283,453,29.2,19,-16,20.2,2020-07-28 07:30:00.000
47,48,2020-07-28 11:45:00,729,2.9,289,454,29.2,19,-5,19.6,2020-07-28 07:45:00.000
48,49,2020-07-28 12:00:00,673,2.9,166,515,29.3,19,6,25.8,2020-07-28 08:00:00.000
49,50,2020-07-28 12:15:00,550,2.9,17,534,29.3,19,16,39.0,2020-07-28 08:15:00.000
50,51,2020-07-28 12:30:00,536,2.9,11,525,29.3,21,26,40.0,2020-07-28 08:30:00.000
51,52,2020-07-28 12:45:00,551,2.9,59,497,29.4,23,34,37.3,2020-07-28 08:45:00.000
52,53,2020-07-28 13:00:00,710,2.9,331,410,29.4,25,41,17.6,2020-07-28 09:00:00.000
53,54,2020-07-28 13:15:00,536,2.8,37,503,29.4,27,46,36.2,2020-07-28 09:15:00.000
54,55,2020-07-28 13:30:00,562,2.7,107,471,29.5,30,51,30.8,2020-07-28 09:30:00.000
55,56,2020-07-28 13:45:00,432,2.6,0,432,29.5,33,54,44.8,2020-07-28 09:45:00.000
56,57,2020-07-28 14:00:00,565,2.5,204,401,29.5,36,57,24.4,2020-07-28 10:00:00.000
57,58,2020-07-28 14:15:00,679,2.6,619,202,29.4,40,60,4.3,2020-07-28 10:15:00.000
58,59,2020-07-28 14:30:00,592,2.7,428,277,29.3,43,62,11.4,2020-07-28 10:30:00.000
59,60,2020-07-28 14:45:00,433,2.7,96,366,29.2,46,64,30.7,2020-07-28 10:45:00.000
60,61,2020-07-28 15:00:00,338,2.8,0,338,29.0,50,65,41.1,2020-07-28 11:00:00.000
61,62,2020-07-28 15:15:00,491,2.8,511,180,28.8,53,66,6.6,2020-07-28 11:15:00.000
62,63,2020-07-28 15:30:00,212,2.8,32,193,28.6,56,67,55.6,2020-07-28 11:30:00.000
63,64,2020-07-28 15:45:00,100,2.8,0,100,28.4,60,68,75.7,2020-07-28 11:45:00.000
64,65,2020-07-28 16:00:00,183,2.8,0,183,28.1,63,69,48.8,2020-07-28 12:00:00.000
65,66,2020-07-28 16:15:00,150,2.7,0,150,27.7,67,69,50.4,2020-07-28 12:15:00.000
66,67,2020-07-28 16:30:00,117,2.6,0,117,27.2,70,70,52.2,2020-07-28 12:30:00.000
67,68,2020-07-28 16:45:00,97,2.5,0,97,26.7,74,70,47.5,2020-07-28 12:45:00.000
68,69,2020-07-28 17:00:00,63,2.4,0,63,26.3,77,71,54.0,2020-07-28 13:00:00.000
69,70,2020-07-28 17:15:00,27,2.4,0,27,25.8,81,71,69.0,2020-07-28 13:15:00.000
70,71,2020-07-28 17:30:00,20,2.3,0,20,25.3,85,71,50.4,2020-07-28 13:30:00.000
71,72,2020-07-28 17:45:00,6,2.2,0,6,24.9,88,71,55.7,2020-07-28 13:45:00.000
72,73,2020-07-28 18:00:00,0,2.1,0,0,24.5,92,71,62.8,2020-07-28 14:00:00.000
73,74,2020-07-28 18:15:00,0,2.1,0,0,24.3,95,71,72.9,2020-07-28 14:15:00.000
74,75,2020-07-28 18:30:00,0,2.0,0,0,24.1,99,71,96.3,2020-07-28 14:30:00.000
75,76,2020-07-28 18:45:00,0,1.9,0,0,24.0,102,70,85.1,2020-07-28 14:45:00.000
76,77,2020-07-28 19:00:00,0,1.9,0,0,23.8,106,70,57.0,2020-07-28 15:00:00.000
77,78,2020-07-28 19:15:00,0,1.8,0,0,23.7,109,70,53.7,2020-07-28 15:15:00.000
78,79,2020-07-28 19:30:00,0,1.8,0,0,23.5,113,69,50.8,2020-07-28 15:30:00.000
79,80,2020-07-28 19:45:00,0,1.7,0,0,23.4,116,68,51.9,2020-07-28 15:45:00.000
80,81,2020-07-28 20:00:00,0,1.7,0,0,23.3,120,68,53.2,2020-07-28 16:00:00.000
81,82,2020-07-28 20:15:00,0,1.6,0,0,23.2,123,67,53.4,2020-07-28 16:15:00.000
82,83,2020-07-28 20:30:00,0,1.6,0,0,23.2,127,65,54.4,2020-07-28 16:30:00.000
83,84,2020-07-28 20:45:00,0,1.5,0,0,23.2,130,64,50.5,2020-07-28 16:45:00.000
84,85,2020-07-28 21:00:00,0,1.5,0,0,23.1,133,63,52.6,2020-07-28 17:00:00.000
85,86,2020-07-28 21:15:00,0,1.6,0,0,23.1,137,61,62.9,2020-07-28 17:15:00.000
86,87,2020-07-28 21:30:00,0,1.6,0,0,23.1,140,59,47.4,2020-07-28 17:30:00.000
87,88,2020-07-28 21:45:00,0,1.6,0,0,23.1,143,56,94.2,2020-07-28 17:45:00.000
88,89,2020-07-28 22:00:00,0,1.7,0,0,23.0,146,53,95.4,2020-07-28 18:00:00.000
89,90,2020-07-28 22:15:00,0,1.7,0,0,23.0,149,49,55.2,2020-07-28 18:15:00.000
90,91,2020-07-28 22:30:00,0,1.7,0,0,23.0,152,45,79.6,2020-07-28 18:30:00.000
91,92,2020-07-28 22:45:00,0,1.7,0,0,23.0,154,39,71.1,2020-07-28 18:45:00.000
92,93,2020-07-28 23:00:00,0,1.7,0,0,22.9,157,32,63.0,2020-07-28 19:00:00.000
93,94,2020-07-28 23:15:00,0,1.6,0,0,22.9,158,24,79.8,2020-07-28 19:15:00.000
94,95,2020-07-28 23:30:00,0,1.6,0,0,22.9,160,15,74.2,2020-07-28 19:30:00.000
95,96,2020-07-28 23:45:00,0,1.6,0,0,22.8,160,5,93.5,2020-07-28 19:45:00.000
