,BLOCK_ID,DATA_DATETIME,GHI,WIND_SPEED,DNI,DHI,TEMPERATURE,ZENITH,AZIMUTH,CLOUD_OPACITY,ENTRY_TIME
0,1,2020-09-04 00:00:00,0,0.8,0,0,23.6,171,-24,73.2,2020-09-03 20:00:00.000
1,2,2020-09-04 00:15:00,0,0.7,0,0,23.5,169,-42,73.0,2020-09-03 20:15:00.000
2,3,2020-09-04 00:30:00,0,0.6,0,0,23.4,166,-53,71.4,2020-09-03 20:30:00.000
3,4,2020-09-04 00:45:00,0,0.6,0,0,23.3,163,-61,45.9,2020-09-03 20:45:00.000
4,5,2020-09-04 01:00:00,0,0.5,0,0,23.2,160,-66,21.4,2020-09-03 21:00:00.000
5,6,2020-09-04 01:15:00,0,0.4,0,0,23.2,156,-69,16.6,2020-09-03 21:15:00.000
6,7,2020-09-04 01:30:00,0,0.3,0,0,23.2,153,-72,16.4,2020-09-03 21:30:00.000
7,8,2020-09-04 01:45:00,0,0.2,0,0,23.1,149,-74,26.3,2020-09-03 21:45:00.000
8,9,2020-09-04 02:00:00,0,0.2,0,0,23.1,145,-76,27.0,2020-09-03 22:00:00.000
9,10,2020-09-04 02:15:00,0,0.2,0,0,23.0,142,-77,15.7,2020-09-03 22:15:00.000
10,11,2020-09-04 02:30:00,0,0.2,0,0,23.0,138,-78,15.0,2020-09-03 22:30:00.000
11,12,2020-09-04 02:45:00,0,0.2,0,0,22.9,134,-79,41.2,2020-09-03 22:45:00.000
12,13,2020-09-04 03:00:00,0,0.2,0,0,22.9,131,-79,27.6,2020-09-03 23:00:00.000
13,14,2020-09-04 03:15:00,0,0.2,0,0,22.8,127,-80,15.0,2020-09-03 23:15:00.000
14,15,2020-09-04 03:30:00,0,0.2,0,0,22.8,123,-81,15.0,2020-09-03 23:30:00.000
15,16,2020-09-04 03:45:00,0,0.2,0,0,22.7,120,-81,15.3,2020-09-03 23:45:00.000
16,17,2020-09-04 04:00:00,0,0.2,0,0,22.7,116,-81,16.0,2020-09-04 00:00:00.000
17,18,2020-09-04 04:15:00,0,0.2,0,0,22.7,112,-82,11.2,2020-09-04 00:15:00.000
18,19,2020-09-04 04:30:00,0,0.3,0,0,22.7,108,-82,0.0,2020-09-04 00:30:00.000
19,20,2020-09-04 04:45:00,0,0.3,0,0,22.6,105,-82,0.0,2020-09-04 00:45:00.000
20,21,2020-09-04 05:00:00,0,0.3,0,0,22.6,101,-82,0.0,2020-09-04 01:00:00.000
21,22,2020-09-04 05:15:00,0,0.2,0,0,22.6,97,-82,11.2,2020-09-04 01:15:00.000
22,23,2020-09-04 05:30:00,0,0.2,0,0,22.6,94,-82,11.2,2020-09-04 01:30:00.000
23,24,2020-09-04 05:45:00,4,0.1,0,4,22.6,90,-82,14.0,2020-09-04 01:45:00.000
24,25,2020-09-04 06:00:00,30,0.0,57,25,22.7,86,-83,12.4,2020-09-04 02:00:00.000
25,26,2020-09-04 06:15:00,79,0.1,312,38,23.1,82,-83,2.7,2020-09-04 02:15:00.000
26,27,2020-09-04 06:30:00,122,0.1,276,69,23.5,79,-82,9.8,2020-09-04 02:30:00.000
27,28,2020-09-04 06:45:00,161,0.2,201,109,24.0,75,-82,17.0,2020-09-04 02:45:00.000
28,29,2020-09-04 07:00:00,215,0.3,265,130,24.5,71,-82,15.4,2020-09-04 03:00:00.000
29,30,2020-09-04 07:15:00,254,0.4,219,171,25.2,68,-82,19.3,2020-09-04 03:15:00.000
30,31,2020-09-04 07:30:00,319,0.6,321,177,25.9,64,-82,15.2,2020-09-04 03:30:00.000
31,32,2020-09-04 07:45:00,372,0.7,349,198,26.6,60,-82,14.7,2020-09-04 03:45:00.000
32,33,2020-09-04 08:00:00,411,0.8,317,236,27.3,56,-81,16.9,2020-09-04 04:00:00.000
33,34,2020-09-04 08:15:00,453,0.9,307,266,27.8,53,-81,18.0,2020-09-04 04:15:00.000
34,35,2020-09-04 08:30:00,529,1.0,436,243,28.3,49,-81,12.7,2020-09-04 04:30:00.000
35,36,2020-09-04 08:45:00,626,1.1,650,167,28.8,45,-80,4.9,2020-09-04 04:45:00.000
36,37,2020-09-04 09:00:00,706,1.3,800,108,29.2,42,-79,0.0,2020-09-04 05:00:00.000
37,38,2020-09-04 09:15:00,751,1.4,811,112,29.5,38,-79,0.0,2020-09-04 05:15:00.000
38,39,2020-09-04 09:30:00,736,1.5,615,229,29.8,34,-78,7.2,2020-09-04 05:30:00.000
39,40,2020-09-04 09:45:00,779,1.6,647,221,30.0,31,-76,6.3,2020-09-04 05:45:00.000
40,41,2020-09-04 10:00:00,830,1.8,715,193,30.2,27,-75,4.0,2020-09-04 06:00:00.000
41,42,2020-09-04 10:15:00,811,1.9,569,288,30.1,23,-72,9.3,2020-09-04 06:15:00.000
42,43,2020-09-04 10:30:00,768,2.1,394,398,30.1,20,-69,16.4,2020-09-04 06:30:00.000
43,44,2020-09-04 10:45:00,800,2.3,430,387,30.1,16,-65,14.8,2020-09-04 06:45:00.000
44,45,2020-09-04 11:00:00,876,2.4,601,290,30.0,13,-58,8.2,2020-09-04 07:00:00.000
45,46,2020-09-04 11:15:00,911,2.5,674,247,29.7,10,-47,5.6,2020-09-04 07:15:00.000
46,47,2020-09-04 11:30:00,971,2.6,837,142,29.5,8,-28,0.0,2020-09-04 07:30:00.000
47,48,2020-09-04 11:45:00,973,2.7,836,143,29.2,7,1,0.0,2020-09-04 07:45:00.000
48,49,2020-09-04 12:00:00,931,2.7,715,223,29.0,8,29,4.0,2020-09-04 08:00:00.000
49,50,2020-09-04 12:15:00,963,2.8,833,143,28.8,10,48,0.0,2020-09-04 08:15:00.000
50,51,2020-09-04 12:30:00,951,2.8,830,143,28.7,13,59,0.0,2020-09-04 08:30:00.000
51,52,2020-09-04 12:45:00,934,2.9,826,142,28.5,17,65,0.0,2020-09-04 08:45:00.000
52,53,2020-09-04 13:00:00,913,2.8,821,141,28.2,20,70,0.0,2020-09-04 09:00:00.000
53,54,2020-09-04 13:15:00,887,2.7,815,140,27.8,24,73,0.0,2020-09-04 09:15:00.000
54,55,2020-09-04 13:30:00,857,2.5,808,138,27.3,27,75,0.0,2020-09-04 09:30:00.000
55,56,2020-09-04 13:45:00,823,2.4,799,136,26.8,31,76,0.0,2020-09-04 09:45:00.000
56,57,2020-09-04 14:00:00,784,2.2,790,133,26.4,34,78,0.0,2020-09-04 10:00:00.000
57,58,2020-09-04 14:15:00,742,2.0,779,130,26.3,38,79,0.0,2020-09-04 10:15:00.000
58,59,2020-09-04 14:30:00,664,1.8,631,192,26.1,42,80,4.8,2020-09-04 10:30:00.000
59,60,2020-09-04 14:45:00,613,1.6,603,188,26.0,45,80,5.6,2020-09-04 10:45:00.000
60,61,2020-09-04 15:00:00,480,1.4,258,311,25.9,49,81,19.6,2020-09-04 11:00:00.000
61,62,2020-09-04 15:15:00,379,1.4,154,284,25.8,53,81,30.6,2020-09-04 11:15:00.000
62,63,2020-09-04 15:30:00,217,1.3,0,217,25.8,57,82,55.4,2020-09-04 11:30:00.000
63,64,2020-09-04 15:45:00,170,1.2,0,170,25.7,60,82,60.5,2020-09-04 11:45:00.000
64,65,2020-09-04 16:00:00,55,1.2,0,55,25.7,64,82,85.4,2020-09-04 12:00:00.000
65,66,2020-09-04 16:15:00,76,1.2,0,76,25.6,68,82,75.0,2020-09-04 12:15:00.000
66,67,2020-09-04 16:30:00,91,1.2,0,91,25.6,71,82,63.2,2020-09-04 12:30:00.000
67,68,2020-09-04 16:45:00,84,1.3,0,84,25.6,75,83,55.0,2020-09-04 12:45:00.000
68,69,2020-09-04 17:00:00,67,1.3,0,67,25.5,79,83,48.8,2020-09-04 13:00:00.000
69,70,2020-09-04 17:15:00,33,1.2,0,33,25.3,83,83,55.0,2020-09-04 13:15:00.000
70,71,2020-09-04 17:30:00,19,1.2,0,19,25.0,86,83,41.0,2020-09-04 13:30:00.000
71,72,2020-09-04 17:45:00,2,1.2,0,2,24.8,90,83,54.3,2020-09-04 13:45:00.000
72,73,2020-09-04 18:00:00,0,1.1,0,0,24.6,94,83,91.4,2020-09-04 14:00:00.000
73,74,2020-09-04 18:15:00,0,1.1,0,0,24.4,97,83,80.3,2020-09-04 14:15:00.000
74,75,2020-09-04 18:30:00,0,1.2,0,0,24.2,101,82,38.8,2020-09-04 14:30:00.000
75,76,2020-09-04 18:45:00,0,1.2,0,0,24.1,105,82,30.3,2020-09-04 14:45:00.000
76,77,2020-09-04 19:00:00,0,1.2,0,0,23.9,109,82,31.0,2020-09-04 15:00:00.000
77,78,2020-09-04 19:15:00,0,1.3,0,0,23.9,112,82,27.1,2020-09-04 15:15:00.000
78,79,2020-09-04 19:30:00,0,1.4,0,0,23.9,116,82,21.8,2020-09-04 15:30:00.000
79,80,2020-09-04 19:45:00,0,1.5,0,0,23.8,120,81,25.2,2020-09-04 15:45:00.000
80,81,2020-09-04 20:00:00,0,1.6,0,0,23.8,123,81,35.6,2020-09-04 16:00:00.000
81,82,2020-09-04 20:15:00,0,1.6,0,0,23.8,127,80,65.1,2020-09-04 16:15:00.000
82,83,2020-09-04 20:30:00,0,1.6,0,0,23.7,131,80,21.8,2020-09-04 16:30:00.000
83,84,2020-09-04 20:45:00,0,1.6,0,0,23.7,135,79,15.0,2020-09-04 16:45:00.000
84,85,2020-09-04 21:00:00,0,1.6,0,0,23.6,138,78,15.0,2020-09-04 17:00:00.000
85,86,2020-09-04 21:15:00,0,1.6,0,0,23.6,142,77,16.0,2020-09-04 17:15:00.000
86,87,2020-09-04 21:30:00,0,1.6,0,0,23.6,146,76,20.0,2020-09-04 17:30:00.000
87,88,2020-09-04 21:45:00,0,1.7,0,0,23.5,149,75,23.1,2020-09-04 17:45:00.000
88,89,2020-09-04 22:00:00,0,1.7,0,0,23.5,153,73,26.4,2020-09-04 18:00:00.000
89,90,2020-09-04 22:15:00,0,1.7,0,0,23.4,156,70,23.6,2020-09-04 18:15:00.000
90,91,2020-09-04 22:30:00,0,1.6,0,0,23.3,160,67,44.2,2020-09-04 18:30:00.000
91,92,2020-09-04 22:45:00,0,1.6,0,0,23.3,163,62,57.8,2020-09-04 18:45:00.000
92,93,2020-09-04 23:00:00,0,1.6,0,0,23.2,166,54,55.0,2020-09-04 19:00:00.000
93,94,2020-09-04 23:15:00,0,1.6,0,0,23.2,169,43,85.3,2020-09-04 19:15:00.000
94,95,2020-09-04 23:30:00,0,1.6,0,0,23.2,171,25,89.0,2020-09-04 19:30:00.000
95,96,2020-09-04 23:45:00,0,1.6,0,0,23.1,172,-1,91.7,2020-09-04 19:45:00.000
