,BLOCK_ID,DATA_DATETIME,GHI,WIND_SPEED,DNI,DHI,TEMPERATURE,ZENITH,AZIMUTH,CLOUD_OPACITY,ENTRY_TIME
0,1,2020-08-17 00:00:00,0,0.4,0,0,22.6,165,-10,27.6,2020-08-16 20:00:00.000
1,2,2020-08-17 00:15:00,0,0.4,0,0,22.6,164,-23,25.8,2020-08-16 20:15:00.000
2,3,2020-08-17 00:30:00,0,0.4,0,0,22.6,163,-34,27.2,2020-08-16 20:30:00.000
3,4,2020-08-17 00:45:00,0,0.3,0,0,22.6,160,-43,24.5,2020-08-16 20:45:00.000
4,5,2020-08-17 01:00:00,0,0.3,0,0,22.5,157,-50,21.0,2020-08-16 21:00:00.000
5,6,2020-08-17 01:15:00,0,0.2,0,0,22.5,155,-55,27.5,2020-08-16 21:15:00.000
6,7,2020-08-17 01:30:00,0,0.2,0,0,22.5,151,-59,52.2,2020-08-16 21:30:00.000
7,8,2020-08-17 01:45:00,0,0.2,0,0,22.5,148,-62,18.3,2020-08-16 21:45:00.000
8,9,2020-08-17 02:00:00,0,0.3,0,0,22.5,145,-65,19.0,2020-08-16 22:00:00.000
9,10,2020-08-17 02:15:00,0,0.2,0,0,22.5,141,-67,30.8,2020-08-16 22:15:00.000
10,11,2020-08-17 02:30:00,0,0.2,0,0,22.4,138,-68,77.6,2020-08-16 22:30:00.000
11,12,2020-08-17 02:45:00,0,0.1,0,0,22.3,134,-70,85.6,2020-08-16 22:45:00.000
12,13,2020-08-17 03:00:00,0,0.1,0,0,22.3,131,-71,65.4,2020-08-16 23:00:00.000
13,14,2020-08-17 03:15:00,0,0.1,0,0,22.2,127,-72,60.2,2020-08-16 23:15:00.000
14,15,2020-08-17 03:30:00,0,0.1,0,0,22.2,124,-73,29.8,2020-08-16 23:30:00.000
15,16,2020-08-17 03:45:00,0,0.1,0,0,22.1,120,-74,21.6,2020-08-16 23:45:00.000
16,17,2020-08-17 04:00:00,0,0.1,0,0,22.1,117,-74,16.0,2020-08-17 00:00:00.000
17,18,2020-08-17 04:15:00,0,0.1,0,0,22.1,113,-75,15.3,2020-08-17 00:15:00.000
18,19,2020-08-17 04:30:00,0,0.1,0,0,22.1,109,-75,16.0,2020-08-17 00:30:00.000
19,20,2020-08-17 04:45:00,0,0.1,0,0,22.0,106,-76,16.0,2020-08-17 00:45:00.000
20,21,2020-08-17 05:00:00,0,0.2,0,0,22.0,102,-76,14.4,2020-08-17 01:00:00.000
21,22,2020-08-17 05:15:00,0,0.3,0,0,22.0,98,-76,14.3,2020-08-17 01:15:00.000
22,23,2020-08-17 05:30:00,0,0.3,0,0,22.0,95,-76,15.0,2020-08-17 01:30:00.000
23,24,2020-08-17 05:45:00,1,0.4,0,1,22.0,91,-76,13.0,2020-08-17 01:45:00.000
24,25,2020-08-17 06:00:00,18,0.4,11,17,22.2,87,-76,13.0,2020-08-17 02:00:00.000
25,26,2020-08-17 06:15:00,55,0.4,111,42,22.6,84,-76,13.0,2020-08-17 02:15:00.000
26,27,2020-08-17 06:30:00,111,0.4,376,45,23.1,80,-76,2.6,2020-08-17 02:30:00.000
27,28,2020-08-17 06:45:00,170,0.4,503,52,23.5,77,-76,0.0,2020-08-17 02:45:00.000
28,29,2020-08-17 07:00:00,228,0.5,569,60,24.0,73,-76,0.0,2020-08-17 03:00:00.000
29,30,2020-08-17 07:15:00,287,0.8,620,67,24.7,69,-76,0.0,2020-08-17 03:15:00.000
30,31,2020-08-17 07:30:00,347,1.1,661,74,25.4,66,-75,0.0,2020-08-17 03:30:00.000
31,32,2020-08-17 07:45:00,406,1.4,695,79,26.1,62,-75,0.0,2020-08-17 03:45:00.000
32,33,2020-08-17 08:00:00,465,1.6,724,85,26.7,58,-74,0.0,2020-08-17 04:00:00.000
33,34,2020-08-17 08:15:00,521,1.8,748,89,27.1,55,-74,0.0,2020-08-17 04:15:00.000
34,35,2020-08-17 08:30:00,575,1.9,768,93,27.5,51,-73,0.0,2020-08-17 04:30:00.000
35,36,2020-08-17 08:45:00,626,2.0,785,97,27.9,48,-72,0.0,2020-08-17 04:45:00.000
36,37,2020-08-17 09:00:00,648,2.2,684,157,28.2,44,-71,4.0,2020-08-17 05:00:00.000
37,38,2020-08-17 09:15:00,629,2.3,473,271,28.4,40,-69,12.6,2020-08-17 05:15:00.000
38,39,2020-08-17 09:30:00,572,2.4,200,412,28.6,37,-68,25.0,2020-08-17 05:30:00.000
39,40,2020-08-17 09:45:00,663,2.4,374,351,28.7,34,-66,17.3,2020-08-17 05:45:00.000
40,41,2020-08-17 10:00:00,694,2.6,382,364,28.9,30,-63,17.0,2020-08-17 06:00:00.000
41,42,2020-08-17 10:15:00,506,2.7,0,506,29.1,27,-60,41.6,2020-08-17 06:15:00.000
42,43,2020-08-17 10:30:00,552,2.9,5,548,29.2,24,-56,38.2,2020-08-17 06:30:00.000
43,44,2020-08-17 10:45:00,702,3.1,250,468,29.4,21,-50,23.3,2020-08-17 06:45:00.000
44,45,2020-08-17 11:00:00,772,3.2,383,408,29.5,18,-43,17.2,2020-08-17 07:00:00.000
45,46,2020-08-17 11:15:00,906,3.3,731,202,29.7,16,-33,4.2,2020-08-17 07:15:00.000
46,47,2020-08-17 11:30:00,893,3.4,668,245,29.8,14,-20,6.4,2020-08-17 07:30:00.000
47,48,2020-08-17 11:45:00,804,3.5,418,397,30.0,13,-5,16.0,2020-08-17 07:45:00.000
48,49,2020-08-17 12:00:00,806,3.5,421,396,30.1,13,11,15.8,2020-08-17 08:00:00.000
49,50,2020-08-17 12:15:00,951,3.5,857,121,30.2,14,25,0.0,2020-08-17 08:15:00.000
50,51,2020-08-17 12:30:00,941,3.4,855,121,30.2,16,37,0.0,2020-08-17 08:30:00.000
51,52,2020-08-17 12:45:00,926,3.4,852,120,30.3,19,46,0.0,2020-08-17 08:45:00.000
52,53,2020-08-17 13:00:00,907,3.4,849,119,30.3,22,52,0.0,2020-08-17 09:00:00.000
53,54,2020-08-17 13:15:00,883,3.3,844,117,30.2,25,57,0.0,2020-08-17 09:15:00.000
54,55,2020-08-17 13:30:00,856,3.2,839,115,30.1,28,61,0.0,2020-08-17 09:30:00.000
55,56,2020-08-17 13:45:00,369,3.2,0,369,30.0,31,64,55.2,2020-08-17 09:45:00.000
56,57,2020-08-17 14:00:00,517,3.1,86,447,29.9,35,67,34.2,2020-08-17 10:00:00.000
57,58,2020-08-17 14:15:00,748,3.0,814,108,29.7,38,68,0.0,2020-08-17 10:15:00.000
58,59,2020-08-17 14:30:00,704,2.9,802,105,29.6,42,70,0.0,2020-08-17 10:30:00.000
59,60,2020-08-17 14:45:00,657,2.8,789,102,29.5,45,71,0.0,2020-08-17 10:45:00.000
60,61,2020-08-17 15:00:00,608,2.7,773,98,29.3,49,72,0.0,2020-08-17 11:00:00.000
61,62,2020-08-17 15:15:00,481,2.7,413,230,29.2,52,73,13.3,2020-08-17 11:15:00.000
62,63,2020-08-17 15:30:00,371,2.8,159,279,29.0,56,74,26.2,2020-08-17 11:30:00.000
63,64,2020-08-17 15:45:00,233,2.8,0,233,28.9,60,75,48.1,2020-08-17 11:45:00.000
64,65,2020-08-17 16:00:00,139,2.8,0,139,28.7,63,75,63.6,2020-08-17 12:00:00.000
65,66,2020-08-17 16:15:00,201,2.8,7,199,28.4,67,75,38.0,2020-08-17 12:15:00.000
66,67,2020-08-17 16:30:00,200,2.7,108,165,28.0,70,76,24.6,2020-08-17 12:30:00.000
67,68,2020-08-17 16:45:00,168,2.7,170,121,27.7,74,76,19.1,2020-08-17 12:45:00.000
68,69,2020-08-17 17:00:00,92,2.6,15,88,27.3,78,76,39.2,2020-08-17 13:00:00.000
69,70,2020-08-17 17:15:00,31,2.5,0,31,26.8,81,76,68.8,2020-08-17 13:15:00.000
70,71,2020-08-17 17:30:00,24,2.4,0,24,26.3,85,76,44.8,2020-08-17 13:30:00.000
71,72,2020-08-17 17:45:00,5,2.3,0,5,25.8,89,76,50.6,2020-08-17 13:45:00.000
72,73,2020-08-17 18:00:00,0,2.2,0,0,25.4,92,76,48.0,2020-08-17 14:00:00.000
73,74,2020-08-17 18:15:00,0,2.1,0,0,25.1,96,76,81.1,2020-08-17 14:15:00.000
74,75,2020-08-17 18:30:00,0,2.0,0,0,24.9,100,76,36.8,2020-08-17 14:30:00.000
75,76,2020-08-17 18:45:00,0,1.9,0,0,24.7,103,76,60.2,2020-08-17 14:45:00.000
76,77,2020-08-17 19:00:00,0,1.8,0,0,24.5,107,76,52.4,2020-08-17 15:00:00.000
77,78,2020-08-17 19:15:00,0,1.7,0,0,24.3,111,75,52.6,2020-08-17 15:15:00.000
78,79,2020-08-17 19:30:00,0,1.6,0,0,24.2,114,75,62.6,2020-08-17 15:30:00.000
79,80,2020-08-17 19:45:00,0,1.6,0,0,24.0,118,74,54.4,2020-08-17 15:45:00.000
80,81,2020-08-17 20:00:00,0,1.5,0,0,23.9,121,74,42.6,2020-08-17 16:00:00.000
81,82,2020-08-17 20:15:00,0,1.4,0,0,23.8,125,73,48.2,2020-08-17 16:15:00.000
82,83,2020-08-17 20:30:00,0,1.4,0,0,23.7,129,72,48.8,2020-08-17 16:30:00.000
83,84,2020-08-17 20:45:00,0,1.3,0,0,23.6,132,71,58.5,2020-08-17 16:45:00.000
84,85,2020-08-17 21:00:00,0,1.2,0,0,23.5,136,70,49.8,2020-08-17 17:00:00.000
85,86,2020-08-17 21:15:00,0,1.3,0,0,23.5,139,68,26.1,2020-08-17 17:15:00.000
86,87,2020-08-17 21:30:00,0,1.3,0,0,23.5,143,67,15.2,2020-08-17 17:30:00.000
87,88,2020-08-17 21:45:00,0,1.3,0,0,23.5,146,64,23.9,2020-08-17 17:45:00.000
88,89,2020-08-17 22:00:00,0,1.4,0,0,23.5,149,62,18.2,2020-08-17 18:00:00.000
89,90,2020-08-17 22:15:00,0,1.3,0,0,23.5,153,58,25.6,2020-08-17 18:15:00.000
90,91,2020-08-17 22:30:00,0,1.3,0,0,23.5,156,54,25.4,2020-08-17 18:30:00.000
91,92,2020-08-17 22:45:00,0,1.3,0,0,23.5,159,48,25.0,2020-08-17 18:45:00.000
92,93,2020-08-17 23:00:00,0,1.3,0,0,23.4,161,41,23.0,2020-08-17 19:00:00.000
93,94,2020-08-17 23:15:00,0,1.3,0,0,23.4,163,31,21.1,2020-08-17 19:15:00.000
94,95,2020-08-17 23:30:00,0,1.4,0,0,23.3,165,19,18.0,2020-08-17 19:30:00.000
95,96,2020-08-17 23:45:00,0,1.4,0,0,23.3,166,5,23.2,2020-08-17 19:45:00.000
