,BLOCK_ID,DATA_DATETIME,GHI,WIND_SPEED,DNI,DHI,TEMPERATURE,ZENITH,AZIMUTH,CLOUD_OPACITY,ENTRY_TIME
0,1,2019-12-31 00:00:00,0,1.5,0,0,23.7,157,-173,0.0,2019-12-30 20:00:00.000
1,2,2019-12-31 00:15:00,0,1.5,0,0,23.7,156,-164,0.0,2019-12-30 20:15:00.000
2,3,2019-12-31 00:30:00,0,1.5,0,0,23.7,155,-156,0.0,2019-12-30 20:30:00.000
3,4,2019-12-31 00:45:00,0,1.5,0,0,23.6,153,-149,0.0,2019-12-30 20:45:00.000
4,5,2019-12-31 01:00:00,0,1.5,0,0,23.6,151,-143,0.0,2019-12-30 21:00:00.000
5,6,2019-12-31 01:15:00,0,1.4,0,0,23.6,149,-138,0.0,2019-12-30 21:15:00.000
6,7,2019-12-31 01:30:00,0,1.3,0,0,23.6,146,-134,0.0,2019-12-30 21:30:00.000
7,8,2019-12-31 01:45:00,0,1.2,0,0,23.6,144,-131,0.0,2019-12-30 21:45:00.000
8,9,2019-12-31 02:00:00,0,1.1,0,0,23.6,141,-128,24.1,2019-12-30 22:00:00.000
9,10,2019-12-31 02:15:00,0,1.2,0,0,23.6,138,-125,25.3,2019-12-30 22:15:00.000
10,11,2019-12-31 02:30:00,0,1.2,0,0,23.5,135,-123,25.5,2019-12-30 22:30:00.000
11,12,2019-12-31 02:45:00,0,1.2,0,0,23.5,131,-121,31.0,2019-12-30 22:45:00.000
12,13,2019-12-31 03:00:00,0,1.3,0,0,23.5,128,-120,31.7,2019-12-30 23:00:00.000
13,14,2019-12-31 03:15:00,0,1.3,0,0,23.5,125,-118,31.8,2019-12-30 23:15:00.000
14,15,2019-12-31 03:30:00,0,1.3,0,0,23.4,122,-117,32.0,2019-12-30 23:30:00.000
15,16,2019-12-31 03:45:00,0,1.2,0,0,23.4,118,-116,32.0,2019-12-30 23:45:00.000
16,17,2019-12-31 04:00:00,0,1.2,0,0,23.4,115,-115,19.8,2019-12-31 00:00:00.000
17,18,2019-12-31 04:15:00,0,1.3,0,0,23.4,111,-115,17.6,2019-12-31 00:15:00.000
18,19,2019-12-31 04:30:00,0,1.3,0,0,23.4,108,-114,27.7,2019-12-31 00:30:00.000
19,20,2019-12-31 04:45:00,0,1.3,0,0,23.3,105,-114,21.1,2019-12-31 00:45:00.000
20,21,2019-12-31 05:00:00,0,1.3,0,0,23.3,101,-114,30.2,2019-12-31 01:00:00.000
21,22,2019-12-31 05:15:00,0,1.3,0,0,23.3,98,-113,29.9,2019-12-31 01:15:00.000
22,23,2019-12-31 05:30:00,0,1.3,0,0,23.3,94,-113,27.2,2019-12-31 01:30:00.000
23,24,2019-12-31 05:45:00,1,1.3,0,1,23.3,91,-113,22.0,2019-12-31 01:45:00.000
24,25,2019-12-31 06:00:00,18,1.3,0,18,23.4,87,-113,22.0,2019-12-31 02:00:00.000
25,26,2019-12-31 06:15:00,56,1.3,97,46,23.7,84,-113,12.3,2019-12-31 02:15:00.000
26,27,2019-12-31 06:30:00,94,1.3,92,79,24.0,81,-114,18.1,2019-12-31 02:30:00.000
27,28,2019-12-31 06:45:00,105,1.3,0,105,24.3,77,-114,39.2,2019-12-31 02:45:00.000
28,29,2019-12-31 07:00:00,162,1.3,16,158,24.7,74,-114,29.7,2019-12-31 03:00:00.000
29,30,2019-12-31 07:15:00,211,1.3,62,190,25.2,70,-115,27.2,2019-12-31 03:15:00.000
30,31,2019-12-31 07:30:00,251,1.4,63,227,25.7,67,-116,28.4,2019-12-31 03:30:00.000
31,32,2019-12-31 07:45:00,228,1.4,0,228,26.3,63,-116,44.5,2019-12-31 03:45:00.000
32,33,2019-12-31 08:00:00,304,1.5,21,293,26.7,60,-117,35.2,2019-12-31 04:00:00.000
33,34,2019-12-31 08:15:00,428,1.5,302,264,27.1,57,-119,18.2,2019-12-31 04:15:00.000
34,35,2019-12-31 08:30:00,442,1.6,199,324,27.4,54,-120,23.7,2019-12-31 04:30:00.000
35,36,2019-12-31 08:45:00,451,1.6,130,369,27.7,50,-121,28.4,2019-12-31 04:45:00.000
36,37,2019-12-31 09:00:00,498,1.6,163,387,28.0,47,-123,26.9,2019-12-31 05:00:00.000
37,38,2019-12-31 09:15:00,538,1.7,180,409,28.3,44,-125,25.9,2019-12-31 05:15:00.000
38,39,2019-12-31 09:30:00,439,1.8,23,422,28.6,41,-128,42.9,2019-12-31 05:30:00.000
39,40,2019-12-31 09:45:00,432,1.9,0,432,28.8,38,-131,46.5,2019-12-31 05:45:00.000
40,41,2019-12-31 10:00:00,418,2.0,0,418,29.1,35,-134,50.4,2019-12-31 06:00:00.000
41,42,2019-12-31 10:15:00,373,2.1,0,373,29.3,33,-138,57.4,2019-12-31 06:15:00.000
42,43,2019-12-31 10:30:00,387,2.3,0,387,29.6,30,-143,57.0,2019-12-31 06:30:00.000
43,44,2019-12-31 10:45:00,425,2.4,0,425,29.8,28,-148,53.9,2019-12-31 06:45:00.000
44,45,2019-12-31 11:00:00,391,2.5,0,391,30.1,27,-155,58.3,2019-12-31 07:00:00.000
45,46,2019-12-31 11:15:00,160,2.6,0,160,30.2,25,-162,83.2,2019-12-31 07:15:00.000
46,47,2019-12-31 11:30:00,402,2.7,0,402,30.4,24,-170,58.1,2019-12-31 07:30:00.000
47,48,2019-12-31 11:45:00,419,2.8,0,419,30.5,24,-178,56.4,2019-12-31 07:45:00.000
48,49,2019-12-31 12:00:00,467,2.9,0,467,30.6,24,173,51.4,2019-12-31 08:00:00.000
49,50,2019-12-31 12:15:00,749,3.0,290,486,30.6,25,165,21.5,2019-12-31 08:15:00.000
50,51,2019-12-31 12:30:00,773,3.1,370,440,30.6,26,157,18.0,2019-12-31 08:30:00.000
51,52,2019-12-31 12:45:00,852,3.3,641,284,30.6,28,151,8.1,2019-12-31 08:45:00.000
52,53,2019-12-31 13:00:00,899,3.4,853,157,30.5,30,145,1.0,2019-12-31 09:00:00.000
53,54,2019-12-31 13:15:00,756,3.4,456,369,30.4,32,140,14.3,2019-12-31 09:15:00.000
54,55,2019-12-31 13:30:00,827,3.5,779,185,30.2,34,136,3.0,2019-12-31 09:30:00.000
55,56,2019-12-31 13:45:00,817,3.6,850,140,30.1,37,132,0.0,2019-12-31 09:45:00.000
56,57,2019-12-31 14:00:00,727,3.6,632,242,29.9,40,129,6.5,2019-12-31 10:00:00.000
57,58,2019-12-31 14:15:00,734,3.5,803,146,29.7,43,126,0.0,2019-12-31 10:15:00.000
58,59,2019-12-31 14:30:00,688,3.3,779,147,29.6,46,124,0.0,2019-12-31 10:30:00.000
59,60,2019-12-31 14:45:00,627,3.2,704,166,29.4,49,122,2.0,2019-12-31 10:45:00.000
60,61,2019-12-31 15:00:00,548,3.1,547,214,29.2,52,120,7.0,2019-12-31 11:00:00.000
61,62,2019-12-31 15:15:00,483,2.9,454,226,28.9,56,119,9.9,2019-12-31 11:15:00.000
62,63,2019-12-31 15:30:00,411,2.8,328,241,28.5,59,118,14.5,2019-12-31 11:30:00.000
63,64,2019-12-31 15:45:00,388,2.6,450,178,28.2,62,117,8.3,2019-12-31 11:45:00.000
64,65,2019-12-31 16:00:00,353,2.5,558,124,27.9,66,116,2.8,2019-12-31 12:00:00.000
65,66,2019-12-31 16:15:00,304,2.4,587,94,27.5,69,115,0.0,2019-12-31 12:15:00.000
66,67,2019-12-31 16:30:00,234,2.3,425,104,27.2,72,115,4.7,2019-12-31 12:30:00.000
67,68,2019-12-31 16:45:00,172,2.2,306,95,26.9,76,114,7.8,2019-12-31 12:45:00.000
68,69,2019-12-31 17:00:00,87,2.1,34,80,26.5,79,114,33.9,2019-12-31 13:00:00.000
69,70,2019-12-31 17:15:00,63,2.0,1,62,26.1,83,113,19.4,2019-12-31 13:15:00.000
70,71,2019-12-31 17:30:00,32,1.9,64,27,25.6,86,113,3.6,2019-12-31 13:30:00.000
71,72,2019-12-31 17:45:00,5,1.8,6,5,25.2,90,113,0.0,2019-12-31 13:45:00.000
72,73,2019-12-31 18:00:00,0,1.8,0,0,24.8,93,113,0.0,2019-12-31 14:00:00.000
73,74,2019-12-31 18:15:00,0,1.7,0,0,24.6,96,113,0.0,2019-12-31 14:15:00.000
74,75,2019-12-31 18:30:00,0,1.7,0,0,24.4,100,113,0.0,2019-12-31 14:30:00.000
75,76,2019-12-31 18:45:00,0,1.7,0,0,24.2,103,114,9.0,2019-12-31 14:45:00.000
76,77,2019-12-31 19:00:00,0,1.6,0,0,24.1,107,114,30.8,2019-12-31 15:00:00.000
77,78,2019-12-31 19:15:00,0,1.6,0,0,24.0,110,115,31.0,2019-12-31 15:15:00.000
78,79,2019-12-31 19:30:00,0,1.5,0,0,24.0,114,115,31.0,2019-12-31 15:30:00.000
79,80,2019-12-31 19:45:00,0,1.5,0,0,24.0,117,116,31.0,2019-12-31 15:45:00.000
80,81,2019-12-31 20:00:00,0,1.4,0,0,23.9,120,117,6.2,2019-12-31 16:00:00.000
81,82,2019-12-31 20:15:00,0,1.5,0,0,23.9,124,118,0.0,2019-12-31 16:15:00.000
82,83,2019-12-31 20:30:00,0,1.6,0,0,23.9,127,119,0.0,2019-12-31 16:30:00.000
83,84,2019-12-31 20:45:00,0,1.7,0,0,23.8,130,120,0.0,2019-12-31 16:45:00.000
84,85,2019-12-31 21:00:00,0,1.8,0,0,23.8,133,122,0.0,2019-12-31 17:00:00.000
85,86,2019-12-31 21:15:00,0,1.9,0,0,23.8,137,124,0.0,2019-12-31 17:15:00.000
86,87,2019-12-31 21:30:00,0,1.9,0,0,23.7,140,126,0.0,2019-12-31 17:30:00.000
87,88,2019-12-31 21:45:00,0,1.9,0,0,23.7,143,129,0.0,2019-12-31 17:45:00.000
88,89,2019-12-31 22:00:00,0,1.9,0,0,23.6,145,133,0.0,2019-12-31 18:00:00.000
89,90,2019-12-31 22:15:00,0,2.0,0,0,23.6,148,137,0.0,2019-12-31 18:15:00.000
90,91,2019-12-31 22:30:00,0,2.0,0,0,23.6,151,141,0.0,2019-12-31 18:30:00.000
91,92,2019-12-31 22:45:00,0,2.0,0,0,23.5,153,147,0.0,2019-12-31 18:45:00.000
92,93,2019-12-31 23:00:00,0,2.0,0,0,23.5,155,154,0.0,2019-12-31 19:00:00.000
93,94,2019-12-31 23:15:00,0,2.0,0,0,23.4,156,161,0.0,2019-12-31 19:15:00.000
94,95,2019-12-31 23:30:00,0,2.0,0,0,23.4,157,169,0.0,2019-12-31 19:30:00.000
95,96,2019-12-31 23:45:00,0,1.9,0,0,23.4,157,178,0.0,2019-12-31 19:45:00.000
