,BLOCK_ID,DATA_DATETIME,GHI,WIND_SPEED,DNI,DHI,TEMPERATURE,ZENITH,AZIMUTH,CLOUD_OPACITY,ENTRY_TIME
0,1,2019-07-18 00:00:00,0,1.9,0,0,23.7,158,-5,36.0,2019-07-17 20:00:00.000
1,2,2019-07-18 00:15:00,0,1.8,0,0,23.6,157,-14,36.0,2019-07-17 20:15:00.000
2,3,2019-07-18 00:30:00,0,1.8,0,0,23.5,156,-22,36.0,2019-07-17 20:30:00.000
3,4,2019-07-18 00:45:00,0,1.7,0,0,23.4,154,-30,36.0,2019-07-17 20:45:00.000
4,5,2019-07-18 01:00:00,0,1.6,0,0,23.4,152,-36,36.0,2019-07-17 21:00:00.000
5,6,2019-07-18 01:15:00,0,1.6,0,0,23.3,150,-41,36.6,2019-07-17 21:15:00.000
6,7,2019-07-18 01:30:00,0,1.5,0,0,23.2,147,-46,36.0,2019-07-17 21:30:00.000
7,8,2019-07-18 01:45:00,0,1.5,0,0,23.1,145,-50,36.8,2019-07-17 21:45:00.000
8,9,2019-07-18 02:00:00,0,1.4,0,0,23.0,142,-53,37.2,2019-07-17 22:00:00.000
9,10,2019-07-18 02:15:00,0,1.4,0,0,23.0,139,-56,36.8,2019-07-17 22:15:00.000
10,11,2019-07-18 02:30:00,0,1.4,0,0,23.0,136,-58,37.0,2019-07-17 22:30:00.000
11,12,2019-07-18 02:45:00,0,1.3,0,0,23.0,132,-60,31.5,2019-07-17 22:45:00.000
12,13,2019-07-18 03:00:00,0,1.3,0,0,23.0,129,-61,36.9,2019-07-17 23:00:00.000
13,14,2019-07-18 03:15:00,0,1.3,0,0,23.0,126,-63,37.0,2019-07-17 23:15:00.000
14,15,2019-07-18 03:30:00,0,1.2,0,0,23.0,122,-64,36.6,2019-07-17 23:30:00.000
15,16,2019-07-18 03:45:00,0,1.2,0,0,23.0,119,-65,37.0,2019-07-17 23:45:00.000
16,17,2019-07-18 04:00:00,0,1.2,0,0,23.0,116,-66,37.0,2019-07-18 00:00:00.000
17,18,2019-07-18 04:15:00,0,1.3,0,0,23.0,112,-67,37.0,2019-07-18 00:15:00.000
18,19,2019-07-18 04:30:00,0,1.3,0,0,23.0,109,-67,37.0,2019-07-18 00:30:00.000
19,20,2019-07-18 04:45:00,0,1.4,0,0,23.0,105,-68,37.0,2019-07-18 00:45:00.000
20,21,2019-07-18 05:00:00,0,1.5,0,0,22.9,102,-68,56.1,2019-07-18 01:00:00.000
21,22,2019-07-18 05:15:00,0,1.5,0,0,22.9,98,-68,53.2,2019-07-18 01:15:00.000
22,23,2019-07-18 05:30:00,0,1.5,0,0,22.9,95,-68,47.4,2019-07-18 01:30:00.000
23,24,2019-07-18 05:45:00,0,1.5,0,0,22.9,91,-69,45.9,2019-07-18 01:45:00.000
24,25,2019-07-18 06:00:00,9,1.4,0,9,22.9,88,-69,45.0,2019-07-18 02:00:00.000
25,26,2019-07-18 06:15:00,34,1.4,0,34,23.0,84,-69,31.7,2019-07-18 02:15:00.000
26,27,2019-07-18 06:30:00,68,1.4,0,68,23.1,81,-68,29.4,2019-07-18 02:30:00.000
27,28,2019-07-18 06:45:00,117,1.4,77,101,23.2,77,-68,19.4,2019-07-18 02:45:00.000
28,29,2019-07-18 07:00:00,148,1.4,20,142,23.4,74,-68,26.2,2019-07-18 03:00:00.000
29,30,2019-07-18 07:15:00,145,1.4,0,145,23.8,70,-67,43.5,2019-07-18 03:15:00.000
30,31,2019-07-18 07:30:00,187,1.4,0,187,24.2,67,-67,40.3,2019-07-18 03:30:00.000
31,32,2019-07-18 07:45:00,234,1.4,0,234,24.6,63,-66,36.2,2019-07-18 03:45:00.000
32,33,2019-07-18 08:00:00,179,1.4,0,179,24.9,60,-66,57.3,2019-07-18 04:00:00.000
33,34,2019-07-18 08:15:00,221,1.6,0,221,25.2,57,-65,53.4,2019-07-18 04:15:00.000
34,35,2019-07-18 08:30:00,161,1.8,0,161,25.4,53,-64,69.3,2019-07-18 04:30:00.000
35,36,2019-07-18 08:45:00,209,1.9,0,209,25.6,50,-62,63.6,2019-07-18 04:45:00.000
36,37,2019-07-18 09:00:00,261,2.1,0,261,25.8,47,-61,58.1,2019-07-18 05:00:00.000
37,38,2019-07-18 09:15:00,279,2.1,0,279,26.0,43,-59,58.1,2019-07-18 05:15:00.000
38,39,2019-07-18 09:30:00,341,2.1,0,341,26.2,40,-57,51.7,2019-07-18 05:30:00.000
39,40,2019-07-18 09:45:00,513,2.1,76,453,26.3,37,-54,30.9,2019-07-18 05:45:00.000
40,41,2019-07-18 10:00:00,452,2.2,0,452,26.5,34,-51,41.8,2019-07-18 06:00:00.000
41,42,2019-07-18 10:15:00,387,2.2,0,387,26.6,31,-47,52.1,2019-07-18 06:15:00.000
42,43,2019-07-18 10:30:00,576,2.2,101,487,26.6,29,-43,30.7,2019-07-18 06:30:00.000
43,44,2019-07-18 10:45:00,505,2.2,0,505,26.7,26,-37,40.8,2019-07-18 06:45:00.000
44,45,2019-07-18 11:00:00,519,2.2,0,519,26.9,24,-30,40.3,2019-07-18 07:00:00.000
45,46,2019-07-18 11:15:00,594,2.3,56,542,27.2,23,-23,32.6,2019-07-18 07:15:00.000
46,47,2019-07-18 11:30:00,515,2.4,6,509,27.5,21,-14,42.1,2019-07-18 07:30:00.000
47,48,2019-07-18 11:45:00,456,2.5,0,456,27.9,21,-4,49.1,2019-07-18 07:45:00.000
48,49,2019-07-18 12:00:00,633,2.6,135,506,28.1,21,5,29.3,2019-07-18 08:00:00.000
49,50,2019-07-18 12:15:00,539,2.6,0,539,28.2,21,15,39.5,2019-07-18 08:15:00.000
50,51,2019-07-18 12:30:00,619,2.7,121,507,28.2,23,24,29.7,2019-07-18 08:30:00.000
51,52,2019-07-18 12:45:00,618,2.8,123,505,28.3,24,31,28.8,2019-07-18 08:45:00.000
52,53,2019-07-18 13:00:00,585,2.8,79,514,28.2,27,38,31.2,2019-07-18 09:00:00.000
53,54,2019-07-18 13:15:00,367,2.6,0,367,27.7,29,43,55.6,2019-07-18 09:15:00.000
54,55,2019-07-18 13:30:00,294,2.4,0,294,27.3,32,48,63.4,2019-07-18 09:30:00.000
55,56,2019-07-18 13:45:00,405,2.2,0,405,26.8,35,51,47.7,2019-07-18 09:45:00.000
56,57,2019-07-18 14:00:00,345,2.2,0,345,26.3,38,54,53.2,2019-07-18 10:00:00.000
57,58,2019-07-18 14:15:00,410,2.2,6,406,25.9,41,57,41.7,2019-07-18 10:15:00.000
58,59,2019-07-18 14:30:00,269,2.2,0,269,25.5,44,59,59.3,2019-07-18 10:30:00.000
59,60,2019-07-18 14:45:00,207,2.3,0,207,25.1,47,61,66.6,2019-07-18 10:45:00.000
60,61,2019-07-18 15:00:00,206,2.4,0,206,24.8,50,62,63.9,2019-07-18 11:00:00.000
61,62,2019-07-18 15:15:00,212,2.4,0,212,24.9,54,64,59.5,2019-07-18 11:15:00.000
62,63,2019-07-18 15:30:00,188,2.5,0,188,25.0,57,65,60.2,2019-07-18 11:30:00.000
63,64,2019-07-18 15:45:00,31,2.5,0,31,25.1,60,66,93.1,2019-07-18 11:45:00.000
64,65,2019-07-18 16:00:00,72,2.4,0,72,25.2,64,66,80.3,2019-07-18 12:00:00.000
65,66,2019-07-18 16:15:00,152,2.3,0,152,25.1,67,67,50.8,2019-07-18 12:15:00.000
66,67,2019-07-18 16:30:00,161,2.1,0,161,24.9,71,68,36.1,2019-07-18 12:30:00.000
67,68,2019-07-18 16:45:00,82,1.9,0,82,24.8,74,68,59.7,2019-07-18 12:45:00.000
68,69,2019-07-18 17:00:00,46,1.8,0,46,24.6,78,68,67.9,2019-07-18 13:00:00.000
69,70,2019-07-18 17:15:00,36,1.7,0,36,24.4,81,69,62.4,2019-07-18 13:15:00.000
70,71,2019-07-18 17:30:00,15,1.6,0,15,24.2,85,69,67.6,2019-07-18 13:30:00.000
71,72,2019-07-18 17:45:00,6,1.5,0,6,24.0,88,69,53.0,2019-07-18 13:45:00.000
72,73,2019-07-18 18:00:00,0,1.4,0,0,23.8,92,69,55.8,2019-07-18 14:00:00.000
73,74,2019-07-18 18:15:00,0,1.4,0,0,23.8,95,69,45.7,2019-07-18 14:15:00.000
74,75,2019-07-18 18:30:00,0,1.4,0,0,23.7,99,68,38.6,2019-07-18 14:30:00.000
75,76,2019-07-18 18:45:00,0,1.3,0,0,23.7,102,68,49.3,2019-07-18 14:45:00.000
76,77,2019-07-18 19:00:00,0,1.3,0,0,23.6,106,68,88.8,2019-07-18 15:00:00.000
77,78,2019-07-18 19:15:00,0,1.5,0,0,23.6,109,67,94.9,2019-07-18 15:15:00.000
78,79,2019-07-18 19:30:00,0,1.7,0,0,23.6,113,67,99.8,2019-07-18 15:30:00.000
79,80,2019-07-18 19:45:00,0,1.8,0,0,23.6,116,66,82.0,2019-07-18 15:45:00.000
80,81,2019-07-18 20:00:00,0,1.9,0,0,23.6,119,65,60.7,2019-07-18 16:00:00.000
81,82,2019-07-18 20:15:00,0,1.9,0,0,23.5,123,64,39.0,2019-07-18 16:15:00.000
82,83,2019-07-18 20:30:00,0,1.8,0,0,23.5,126,63,36.5,2019-07-18 16:30:00.000
83,84,2019-07-18 20:45:00,0,1.7,0,0,23.4,129,61,37.0,2019-07-18 16:45:00.000
84,85,2019-07-18 21:00:00,0,1.6,0,0,23.3,133,60,37.0,2019-07-18 17:00:00.000
85,86,2019-07-18 21:15:00,0,1.5,0,0,23.3,136,58,35.2,2019-07-18 17:15:00.000
86,87,2019-07-18 21:30:00,0,1.5,0,0,23.2,139,56,43.8,2019-07-18 17:30:00.000
87,88,2019-07-18 21:45:00,0,1.4,0,0,23.2,142,53,51.1,2019-07-18 17:45:00.000
88,89,2019-07-18 22:00:00,0,1.4,0,0,23.1,145,50,36.8,2019-07-18 18:00:00.000
89,90,2019-07-18 22:15:00,0,1.4,0,0,23.1,148,46,36.2,2019-07-18 18:15:00.000
90,91,2019-07-18 22:30:00,0,1.5,0,0,23.1,150,41,36.2,2019-07-18 18:30:00.000
91,92,2019-07-18 22:45:00,0,1.5,0,0,23.0,153,36,37.0,2019-07-18 18:45:00.000
92,93,2019-07-18 23:00:00,0,1.5,0,0,23.0,155,29,49.0,2019-07-18 19:00:00.000
93,94,2019-07-18 23:15:00,0,1.5,0,0,23.0,156,22,51.7,2019-07-18 19:15:00.000
94,95,2019-07-18 23:30:00,0,1.4,0,0,22.9,157,13,58.6,2019-07-18 19:30:00.000
95,96,2019-07-18 23:45:00,0,1.4,0,0,22.9,158,4,62.3,2019-07-18 19:45:00.000
