,BLOCK_ID,DATA_DATETIME,GHI,WIND_SPEED,DNI,DHI,TEMPERATURE,ZENITH,AZIMUTH,CLOUD_OPACITY,ENTRY_TIME
0,1,2019-01-09 00:00:00,0,6.3,0,0,25.9,158,-175,0.0,2019-01-08 20:00:00.000
1,2,2019-01-09 00:15:00,0,6.3,0,0,25.8,157,-166,0.0,2019-01-08 20:15:00.000
2,3,2019-01-09 00:30:00,0,6.3,0,0,25.7,156,-157,0.0,2019-01-08 20:30:00.000
3,4,2019-01-09 00:45:00,0,6.3,0,0,25.7,155,-150,0.0,2019-01-08 20:45:00.000
4,5,2019-01-09 01:00:00,0,6.3,0,0,25.6,153,-144,0.0,2019-01-08 21:00:00.000
5,6,2019-01-09 01:15:00,0,6.3,0,0,25.6,150,-138,0.0,2019-01-08 21:15:00.000
6,7,2019-01-09 01:30:00,0,6.3,0,0,25.5,148,-134,0.0,2019-01-08 21:30:00.000
7,8,2019-01-09 01:45:00,0,6.2,0,0,25.4,145,-130,0.0,2019-01-08 21:45:00.000
8,9,2019-01-09 02:00:00,0,6.3,0,0,25.4,142,-127,0.0,2019-01-08 22:00:00.000
9,10,2019-01-09 02:15:00,0,6.3,0,0,25.4,139,-125,0.0,2019-01-08 22:15:00.000
10,11,2019-01-09 02:30:00,0,6.3,0,0,25.4,136,-122,0.0,2019-01-08 22:30:00.000
11,12,2019-01-09 02:45:00,0,6.3,0,0,25.4,133,-120,0.0,2019-01-08 22:45:00.000
12,13,2019-01-09 03:00:00,0,6.3,0,0,25.4,129,-119,0.0,2019-01-08 23:00:00.000
13,14,2019-01-09 03:15:00,0,6.3,0,0,25.4,126,-118,0.0,2019-01-08 23:15:00.000
14,15,2019-01-09 03:30:00,0,6.3,0,0,25.4,123,-116,0.0,2019-01-08 23:30:00.000
15,16,2019-01-09 03:45:00,0,6.3,0,0,25.4,119,-115,0.0,2019-01-08 23:45:00.000
16,17,2019-01-09 04:00:00,0,6.3,0,0,25.4,116,-115,0.0,2019-01-09 00:00:00.000
17,18,2019-01-09 04:15:00,0,6.3,0,0,25.4,112,-114,0.0,2019-01-09 00:15:00.000
18,19,2019-01-09 04:30:00,0,6.3,0,0,25.4,109,-114,0.0,2019-01-09 00:30:00.000
19,20,2019-01-09 04:45:00,0,6.3,0,0,25.4,106,-113,0.0,2019-01-09 00:45:00.000
20,21,2019-01-09 05:00:00,0,6.3,0,0,25.4,102,-113,0.0,2019-01-09 01:00:00.000
21,22,2019-01-09 05:15:00,0,6.2,0,0,25.4,99,-113,0.0,2019-01-09 01:15:00.000
22,23,2019-01-09 05:30:00,0,6.0,0,0,25.5,95,-112,0.0,2019-01-09 01:30:00.000
23,24,2019-01-09 05:45:00,0,5.9,0,0,25.5,92,-112,0.0,2019-01-09 01:45:00.000
24,25,2019-01-09 06:00:00,13,5.8,23,11,25.6,88,-112,0.0,2019-01-09 02:00:00.000
25,26,2019-01-09 06:15:00,34,5.6,0,34,25.6,85,-113,28.5,2019-01-09 02:15:00.000
26,27,2019-01-09 06:30:00,32,5.5,0,32,25.7,81,-113,65.1,2019-01-09 02:30:00.000
27,28,2019-01-09 06:45:00,80,5.4,0,80,25.7,78,-113,46.9,2019-01-09 02:45:00.000
28,29,2019-01-09 07:00:00,107,5.3,0,107,25.7,74,-113,48.4,2019-01-09 03:00:00.000
29,30,2019-01-09 07:15:00,181,5.1,0,181,25.8,71,-114,32.6,2019-01-09 03:15:00.000
30,31,2019-01-09 07:30:00,210,5.0,0,210,25.8,68,-115,36.2,2019-01-09 03:30:00.000
31,32,2019-01-09 07:45:00,256,4.9,21,246,25.9,64,-115,34.6,2019-01-09 03:45:00.000
32,33,2019-01-09 08:00:00,257,4.8,14,251,25.9,61,-116,42.3,2019-01-09 04:00:00.000
33,34,2019-01-09 08:15:00,206,4.8,0,206,26.0,58,-117,59.4,2019-01-09 04:15:00.000
34,35,2019-01-09 08:30:00,312,4.9,0,312,26.0,54,-118,44.6,2019-01-09 04:30:00.000
35,36,2019-01-09 08:45:00,349,4.9,0,349,26.1,51,-120,43.3,2019-01-09 04:45:00.000
36,37,2019-01-09 09:00:00,345,4.9,0,345,26.1,48,-122,48.0,2019-01-09 05:00:00.000
37,38,2019-01-09 09:15:00,414,5.0,0,414,26.2,45,-124,42.0,2019-01-09 05:15:00.000
38,39,2019-01-09 09:30:00,559,5.0,163,436,26.2,42,-126,26.2,2019-01-09 05:30:00.000
39,40,2019-01-09 09:45:00,489,5.1,21,472,26.3,39,-129,38.8,2019-01-09 05:45:00.000
40,41,2019-01-09 10:00:00,714,5.1,450,347,26.3,36,-132,14.6,2019-01-09 06:00:00.000
41,42,2019-01-09 10:15:00,850,5.1,804,176,26.4,33,-136,2.1,2019-01-09 06:15:00.000
42,43,2019-01-09 10:30:00,834,5.2,660,265,26.4,30,-140,7.0,2019-01-09 06:30:00.000
43,44,2019-01-09 10:45:00,847,5.2,637,285,26.5,28,-146,8.0,2019-01-09 06:45:00.000
44,45,2019-01-09 11:00:00,917,5.3,815,186,26.5,26,-152,2.6,2019-01-09 07:00:00.000
45,46,2019-01-09 11:15:00,951,5.3,889,144,26.5,25,-159,0.5,2019-01-09 07:15:00.000
46,47,2019-01-09 11:30:00,898,5.3,689,267,26.5,24,-167,7.1,2019-01-09 07:30:00.000
47,48,2019-01-09 11:45:00,930,5.4,776,216,26.6,23,-176,4.3,2019-01-09 07:45:00.000
48,49,2019-01-09 12:00:00,958,5.4,869,158,26.6,23,175,1.5,2019-01-09 08:00:00.000
49,50,2019-01-09 12:15:00,900,5.4,721,239,26.6,24,167,7.0,2019-01-09 08:15:00.000
50,51,2019-01-09 12:30:00,913,5.5,787,200,26.6,25,159,4.7,2019-01-09 08:30:00.000
51,52,2019-01-09 12:45:00,944,5.5,916,123,26.6,26,151,0.0,2019-01-09 08:45:00.000
52,53,2019-01-09 13:00:00,925,5.6,913,122,26.6,28,145,0.0,2019-01-09 09:00:00.000
53,54,2019-01-09 13:15:00,902,5.6,908,120,26.7,31,140,0.0,2019-01-09 09:15:00.000
54,55,2019-01-09 13:30:00,874,5.7,903,118,26.7,33,135,0.0,2019-01-09 09:30:00.000
55,56,2019-01-09 13:45:00,842,5.7,896,115,26.7,36,132,0.0,2019-01-09 09:45:00.000
56,57,2019-01-09 14:00:00,805,5.8,887,113,26.7,39,128,0.0,2019-01-09 10:00:00.000
57,58,2019-01-09 14:15:00,737,5.9,765,167,26.7,42,126,3.6,2019-01-09 10:15:00.000
58,59,2019-01-09 14:30:00,721,6.0,865,107,26.8,45,123,0.0,2019-01-09 10:30:00.000
59,60,2019-01-09 14:45:00,673,6.1,850,104,26.8,48,121,0.0,2019-01-09 10:45:00.000
60,61,2019-01-09 15:00:00,623,6.1,832,101,26.8,51,120,0.0,2019-01-09 11:00:00.000
61,62,2019-01-09 15:15:00,569,6.2,811,97,26.9,54,118,0.0,2019-01-09 11:15:00.000
62,63,2019-01-09 15:30:00,513,6.3,787,94,26.9,58,117,0.0,2019-01-09 11:30:00.000
63,64,2019-01-09 15:45:00,455,6.4,757,89,26.9,61,116,0.0,2019-01-09 11:45:00.000
64,65,2019-01-09 16:00:00,395,6.5,721,84,27.0,65,115,0.0,2019-01-09 12:00:00.000
65,66,2019-01-09 16:15:00,334,6.6,678,79,27.0,68,114,0.0,2019-01-09 12:15:00.000
66,67,2019-01-09 16:30:00,273,6.7,626,72,27.0,71,114,0.0,2019-01-09 12:30:00.000
67,68,2019-01-09 16:45:00,212,6.8,561,64,27.1,75,113,0.0,2019-01-09 12:45:00.000
68,69,2019-01-09 17:00:00,153,6.8,478,55,27.1,78,113,0.0,2019-01-09 13:00:00.000
69,70,2019-01-09 17:15:00,90,6.7,238,56,27.1,82,113,7.1,2019-01-09 13:15:00.000
70,71,2019-01-09 17:30:00,48,6.6,200,29,27.0,85,112,0.4,2019-01-09 13:30:00.000
71,72,2019-01-09 17:45:00,12,6.5,27,9,27.0,89,112,0.0,2019-01-09 13:45:00.000
72,73,2019-01-09 18:00:00,0,6.4,0,0,27.0,92,112,0.0,2019-01-09 14:00:00.000
73,74,2019-01-09 18:15:00,0,6.4,0,0,27.0,96,112,0.0,2019-01-09 14:15:00.000
74,75,2019-01-09 18:30:00,0,6.3,0,0,26.9,99,112,0.0,2019-01-09 14:30:00.000
75,76,2019-01-09 18:45:00,0,6.2,0,0,26.9,102,113,0.0,2019-01-09 14:45:00.000
76,77,2019-01-09 19:00:00,0,6.1,0,0,26.9,106,113,0.0,2019-01-09 15:00:00.000
77,78,2019-01-09 19:15:00,0,6.0,0,0,26.9,109,113,0.0,2019-01-09 15:15:00.000
78,79,2019-01-09 19:30:00,0,5.9,0,0,26.8,113,114,0.0,2019-01-09 15:30:00.000
79,80,2019-01-09 19:45:00,0,5.8,0,0,26.8,116,115,0.0,2019-01-09 15:45:00.000
80,81,2019-01-09 20:00:00,0,5.7,0,0,26.8,120,115,0.0,2019-01-09 16:00:00.000
81,82,2019-01-09 20:15:00,0,5.7,0,0,26.8,123,116,0.0,2019-01-09 16:15:00.000
82,83,2019-01-09 20:30:00,0,5.7,0,0,26.8,126,118,0.0,2019-01-09 16:30:00.000
83,84,2019-01-09 20:45:00,0,5.7,0,0,26.8,130,119,0.0,2019-01-09 16:45:00.000
84,85,2019-01-09 21:00:00,0,5.7,0,0,26.8,133,121,0.0,2019-01-09 17:00:00.000
85,86,2019-01-09 21:15:00,0,5.7,0,0,26.8,136,122,0.0,2019-01-09 17:15:00.000
86,87,2019-01-09 21:30:00,0,5.7,0,0,26.9,139,125,0.0,2019-01-09 17:30:00.000
87,88,2019-01-09 21:45:00,0,5.6,0,0,26.9,142,127,0.0,2019-01-09 17:45:00.000
88,89,2019-01-09 22:00:00,0,5.6,0,0,26.9,145,130,0.0,2019-01-09 18:00:00.000
89,90,2019-01-09 22:15:00,0,5.6,0,0,26.9,148,134,0.0,2019-01-09 18:15:00.000
90,91,2019-01-09 22:30:00,0,5.6,0,0,26.9,151,139,0.0,2019-01-09 18:30:00.000
91,92,2019-01-09 22:45:00,0,5.6,0,0,26.9,153,144,0.0,2019-01-09 18:45:00.000
92,93,2019-01-09 23:00:00,0,5.6,0,0,26.9,155,151,0.0,2019-01-09 19:00:00.000
93,94,2019-01-09 23:15:00,0,5.5,0,0,26.9,157,158,0.0,2019-01-09 19:15:00.000
94,95,2019-01-09 23:30:00,0,5.5,0,0,26.8,158,166,0.0,2019-01-09 19:30:00.000
95,96,2019-01-09 23:45:00,0,5.5,0,0,26.8,158,176,0.0,2019-01-09 19:45:00.000
