,BLOCK_ID,DATA_DATETIME,GHI,WIND_SPEED,DNI,DHI,TEMPERATURE,ZENITH,AZIMUTH,CLOUD_OPACITY,ENTRY_TIME
0,1,2019-09-05 00:00:00,0,0.7,0,0,20.3,171,-24,0.0,2019-09-04 20:00:00.000
1,2,2019-09-05 00:15:00,0,0.7,0,0,20.3,169,-42,0.0,2019-09-04 20:15:00.000
2,3,2019-09-05 00:30:00,0,0.7,0,0,20.2,166,-53,0.0,2019-09-04 20:30:00.000
3,4,2019-09-05 00:45:00,0,0.6,0,0,20.2,163,-61,0.0,2019-09-04 20:45:00.000
4,5,2019-09-05 01:00:00,0,0.6,0,0,20.2,160,-66,0.0,2019-09-04 21:00:00.000
5,6,2019-09-05 01:15:00,0,0.6,0,0,20.2,156,-69,0.0,2019-09-04 21:15:00.000
6,7,2019-09-05 01:30:00,0,0.7,0,0,20.2,153,-72,0.0,2019-09-04 21:30:00.000
7,8,2019-09-05 01:45:00,0,0.7,0,0,20.2,149,-74,0.0,2019-09-04 21:45:00.000
8,9,2019-09-05 02:00:00,0,0.7,0,0,20.2,145,-76,0.0,2019-09-04 22:00:00.000
9,10,2019-09-05 02:15:00,0,0.8,0,0,20.2,142,-77,0.0,2019-09-04 22:15:00.000
10,11,2019-09-05 02:30:00,0,0.8,0,0,20.1,138,-78,0.0,2019-09-04 22:30:00.000
11,12,2019-09-05 02:45:00,0,0.9,0,0,20.1,134,-79,0.0,2019-09-04 22:45:00.000
12,13,2019-09-05 03:00:00,0,0.9,0,0,20.0,131,-79,0.0,2019-09-04 23:00:00.000
13,14,2019-09-05 03:15:00,0,0.9,0,0,20.0,127,-80,0.0,2019-09-04 23:15:00.000
14,15,2019-09-05 03:30:00,0,0.9,0,0,20.0,123,-81,0.0,2019-09-04 23:30:00.000
15,16,2019-09-05 03:45:00,0,0.9,0,0,20.0,120,-81,0.0,2019-09-04 23:45:00.000
16,17,2019-09-05 04:00:00,0,0.9,0,0,20.0,116,-81,0.0,2019-09-05 00:00:00.000
17,18,2019-09-05 04:15:00,0,0.9,0,0,20.0,112,-82,0.0,2019-09-05 00:15:00.000
18,19,2019-09-05 04:30:00,0,0.9,0,0,20.0,108,-82,0.0,2019-09-05 00:30:00.000
19,20,2019-09-05 04:45:00,0,0.9,0,0,20.0,105,-82,0.0,2019-09-05 00:45:00.000
20,21,2019-09-05 05:00:00,0,0.9,0,0,20.0,101,-82,0.0,2019-09-05 01:00:00.000
21,22,2019-09-05 05:15:00,0,0.9,0,0,20.0,97,-82,0.0,2019-09-05 01:15:00.000
22,23,2019-09-05 05:30:00,0,0.9,0,0,20.1,94,-82,0.0,2019-09-05 01:30:00.000
23,24,2019-09-05 05:45:00,4,0.9,10,3,20.1,90,-82,0.0,2019-09-05 01:45:00.000
24,25,2019-09-05 06:00:00,31,0.9,72,25,20.3,86,-83,6.8,2019-09-05 02:00:00.000
25,26,2019-09-05 06:15:00,60,0.9,22,58,20.9,82,-83,23.2,2019-09-05 02:15:00.000
26,27,2019-09-05 06:30:00,80,0.9,0,80,21.6,79,-82,40.4,2019-09-05 02:30:00.000
27,28,2019-09-05 06:45:00,70,0.9,0,70,22.3,75,-82,63.7,2019-09-05 02:45:00.000
28,29,2019-09-05 07:00:00,152,0.8,0,152,23.1,71,-82,41.0,2019-09-05 03:00:00.000
29,30,2019-09-05 07:15:00,130,0.8,0,130,24.0,68,-82,59.0,2019-09-05 03:15:00.000
30,31,2019-09-05 07:30:00,162,0.8,0,162,24.9,64,-82,57.1,2019-09-05 03:30:00.000
31,32,2019-09-05 07:45:00,227,0.7,0,227,25.9,60,-82,48.5,2019-09-05 03:45:00.000
32,33,2019-09-05 08:00:00,346,0.8,82,300,26.6,56,-81,31.0,2019-09-05 04:00:00.000
33,34,2019-09-05 08:15:00,461,0.9,324,264,27.0,53,-81,17.3,2019-09-05 04:15:00.000
34,35,2019-09-05 08:30:00,559,1.1,541,203,27.4,49,-81,8.8,2019-09-05 04:30:00.000
35,36,2019-09-05 08:45:00,661,1.4,780,112,27.8,45,-80,0.6,2019-09-05 04:45:00.000
36,37,2019-09-05 09:00:00,715,1.6,814,106,28.2,42,-79,0.0,2019-09-05 05:00:00.000
37,38,2019-09-05 09:15:00,728,1.8,698,176,28.6,38,-79,4.4,2019-09-05 05:15:00.000
38,39,2019-09-05 09:30:00,802,1.9,833,114,29.0,34,-78,0.2,2019-09-05 05:30:00.000
39,40,2019-09-05 09:45:00,804,2.0,710,193,29.4,31,-76,4.5,2019-09-05 05:45:00.000
40,41,2019-09-05 10:00:00,861,2.2,800,148,29.8,27,-75,1.8,2019-09-05 06:00:00.000
41,42,2019-09-05 10:15:00,866,2.4,725,200,30.0,23,-72,4.5,2019-09-05 06:15:00.000
42,43,2019-09-05 10:30:00,924,2.7,835,138,30.3,20,-69,0.9,2019-09-05 06:30:00.000
43,44,2019-09-05 10:45:00,950,2.9,853,131,30.5,16,-65,0.3,2019-09-05 06:45:00.000
44,45,2019-09-05 11:00:00,968,3.1,861,130,30.7,13,-58,0.0,2019-09-05 07:00:00.000
45,46,2019-09-05 11:15:00,979,3.2,857,135,30.7,10,-47,0.0,2019-09-05 07:15:00.000
46,47,2019-09-05 11:30:00,986,3.3,854,139,30.8,8,-28,0.0,2019-09-05 07:30:00.000
47,48,2019-09-05 11:45:00,988,3.3,855,139,30.8,7,1,0.0,2019-09-05 07:45:00.000
48,49,2019-09-05 12:00:00,985,3.4,854,139,30.9,8,29,0.0,2019-09-05 08:00:00.000
49,50,2019-09-05 12:15:00,978,3.3,852,139,30.9,10,48,0.0,2019-09-05 08:15:00.000
50,51,2019-09-05 12:30:00,965,3.2,849,138,31.0,13,59,0.0,2019-09-05 08:30:00.000
51,52,2019-09-05 12:45:00,948,3.1,846,137,31.0,17,65,0.0,2019-09-05 08:45:00.000
52,53,2019-09-05 13:00:00,926,3.0,841,136,31.0,20,70,0.0,2019-09-05 09:00:00.000
53,54,2019-09-05 13:15:00,900,2.9,834,135,31.0,24,73,0.0,2019-09-05 09:15:00.000
54,55,2019-09-05 13:30:00,868,2.7,824,135,31.0,27,75,0.0,2019-09-05 09:30:00.000
55,56,2019-09-05 13:45:00,831,2.5,806,139,31.0,31,76,0.0,2019-09-05 09:45:00.000
56,57,2019-09-05 14:00:00,791,2.3,786,142,31.0,34,78,0.0,2019-09-05 10:00:00.000
57,58,2019-09-05 14:15:00,717,2.2,650,205,30.9,38,79,4.0,2019-09-05 10:15:00.000
58,59,2019-09-05 14:30:00,689,2.0,703,165,30.7,42,80,1.4,2019-09-05 10:30:00.000
59,60,2019-09-05 14:45:00,650,1.8,726,140,30.6,45,80,0.0,2019-09-05 10:45:00.000
60,61,2019-09-05 15:00:00,597,1.7,706,135,30.4,49,81,0.0,2019-09-05 11:00:00.000
61,62,2019-09-05 15:15:00,540,1.6,674,133,30.1,53,81,0.3,2019-09-05 11:15:00.000
62,63,2019-09-05 15:30:00,483,1.5,649,125,29.8,57,82,0.2,2019-09-05 11:30:00.000
63,64,2019-09-05 15:45:00,425,1.5,623,116,29.5,60,82,0.0,2019-09-05 11:45:00.000
64,65,2019-09-05 16:00:00,364,1.4,585,107,29.2,64,82,0.0,2019-09-05 12:00:00.000
65,66,2019-09-05 16:15:00,296,1.5,489,109,28.7,68,82,2.3,2019-09-05 12:15:00.000
66,67,2019-09-05 16:30:00,212,1.5,240,135,28.3,71,82,12.1,2019-09-05 12:30:00.000
67,68,2019-09-05 16:45:00,168,1.5,279,96,27.9,75,83,7.1,2019-09-05 12:45:00.000
68,69,2019-09-05 17:00:00,111,1.5,165,78,27.4,79,83,10.2,2019-09-05 13:00:00.000
69,70,2019-09-05 17:15:00,56,1.5,2,56,26.6,83,83,20.8,2019-09-05 13:15:00.000
70,71,2019-09-05 17:30:00,22,1.6,2,22,25.8,86,83,25.2,2019-09-05 13:30:00.000
71,72,2019-09-05 17:45:00,2,1.6,0,2,25.1,90,83,26.2,2019-09-05 13:45:00.000
72,73,2019-09-05 18:00:00,0,1.6,0,0,24.4,94,83,36.5,2019-09-05 14:00:00.000
73,74,2019-09-05 18:15:00,0,1.6,0,0,24.1,97,83,49.9,2019-09-05 14:15:00.000
74,75,2019-09-05 18:30:00,0,1.6,0,0,23.8,101,82,52.0,2019-09-05 14:30:00.000
75,76,2019-09-05 18:45:00,0,1.6,0,0,23.5,105,82,25.9,2019-09-05 14:45:00.000
76,77,2019-09-05 19:00:00,0,1.6,0,0,23.2,109,82,0.0,2019-09-05 15:00:00.000
77,78,2019-09-05 19:15:00,0,1.5,0,0,23.0,112,82,0.0,2019-09-05 15:15:00.000
78,79,2019-09-05 19:30:00,0,1.5,0,0,22.8,116,82,0.0,2019-09-05 15:30:00.000
79,80,2019-09-05 19:45:00,0,1.4,0,0,22.7,120,81,0.0,2019-09-05 15:45:00.000
80,81,2019-09-05 20:00:00,0,1.4,0,0,22.5,123,81,0.0,2019-09-05 16:00:00.000
81,82,2019-09-05 20:15:00,0,1.3,0,0,22.4,127,80,0.0,2019-09-05 16:15:00.000
82,83,2019-09-05 20:30:00,0,1.4,0,0,22.2,131,80,0.0,2019-09-05 16:30:00.000
83,84,2019-09-05 20:45:00,0,1.4,0,0,22.1,135,79,0.0,2019-09-05 16:45:00.000
84,85,2019-09-05 21:00:00,0,1.3,0,0,22.0,138,78,0.0,2019-09-05 17:00:00.000
85,86,2019-09-05 21:15:00,0,1.3,0,0,21.9,142,77,0.0,2019-09-05 17:15:00.000
86,87,2019-09-05 21:30:00,0,1.2,0,0,21.9,146,76,0.0,2019-09-05 17:30:00.000
87,88,2019-09-05 21:45:00,0,1.2,0,0,21.8,149,75,0.0,2019-09-05 17:45:00.000
88,89,2019-09-05 22:00:00,0,1.1,0,0,21.8,153,73,0.0,2019-09-05 18:00:00.000
89,90,2019-09-05 22:15:00,0,1.1,0,0,21.7,156,70,0.0,2019-09-05 18:15:00.000
90,91,2019-09-05 22:30:00,0,1.0,0,0,21.7,160,67,0.0,2019-09-05 18:30:00.000
91,92,2019-09-05 22:45:00,0,0.9,0,0,21.6,163,62,0.0,2019-09-05 18:45:00.000
92,93,2019-09-05 23:00:00,0,0.8,0,0,21.6,166,54,0.0,2019-09-05 19:00:00.000
93,94,2019-09-05 23:15:00,0,0.8,0,0,21.5,169,43,0.0,2019-09-05 19:15:00.000
94,95,2019-09-05 23:30:00,0,0.9,0,0,21.5,171,25,0.0,2019-09-05 19:30:00.000
95,96,2019-09-05 23:45:00,0,0.9,0,0,21.4,172,-1,0.0,2019-09-05 19:45:00.000
