,BLOCK_ID,DATA_DATETIME,GHI,WIND_SPEED,DNI,DHI,TEMPERATURE,ZENITH,AZIMUTH,CLOUD_OPACITY,ENTRY_TIME
0,1,2019-06-07 00:00:00,0,1.3,0,0,24.1,156,-9,41.6,2019-06-06 20:00:00.000
1,2,2019-06-07 00:15:00,0,1.3,0,0,24.1,156,-18,52.3,2019-06-06 20:15:00.000
2,3,2019-06-07 00:30:00,0,1.3,0,0,24.1,154,-25,52.2,2019-06-06 20:30:00.000
3,4,2019-06-07 00:45:00,0,1.3,0,0,24.1,152,-32,7.9,2019-06-06 20:45:00.000
4,5,2019-06-07 01:00:00,0,1.3,0,0,24.0,150,-37,43.2,2019-06-06 21:00:00.000
5,6,2019-06-07 01:15:00,0,1.3,0,0,24.0,148,-42,52.0,2019-06-06 21:15:00.000
6,7,2019-06-07 01:30:00,0,1.4,0,0,24.0,145,-46,52.0,2019-06-06 21:30:00.000
7,8,2019-06-07 01:45:00,0,1.4,0,0,24.0,142,-50,38.8,2019-06-06 21:45:00.000
8,9,2019-06-07 02:00:00,0,1.4,0,0,23.9,140,-53,1.6,2019-06-06 22:00:00.000
9,10,2019-06-07 02:15:00,0,1.4,0,0,23.9,137,-55,0.0,2019-06-06 22:15:00.000
10,11,2019-06-07 02:30:00,0,1.4,0,0,23.9,133,-57,0.0,2019-06-06 22:30:00.000
11,12,2019-06-07 02:45:00,0,1.3,0,0,23.8,130,-59,0.0,2019-06-06 22:45:00.000
12,13,2019-06-07 03:00:00,0,1.3,0,0,23.8,127,-61,0.0,2019-06-06 23:00:00.000
13,14,2019-06-07 03:15:00,0,1.3,0,0,23.8,124,-62,0.0,2019-06-06 23:15:00.000
14,15,2019-06-07 03:30:00,0,1.3,0,0,23.7,120,-63,45.4,2019-06-06 23:30:00.000
15,16,2019-06-07 03:45:00,0,1.3,0,0,23.7,117,-64,0.0,2019-06-06 23:45:00.000
16,17,2019-06-07 04:00:00,0,1.3,0,0,23.7,114,-65,0.0,2019-06-07 00:00:00.000
17,18,2019-06-07 04:15:00,0,1.3,0,0,23.7,110,-66,0.0,2019-06-07 00:15:00.000
18,19,2019-06-07 04:30:00,0,1.2,0,0,23.7,107,-66,45.4,2019-06-07 00:30:00.000
19,20,2019-06-07 04:45:00,0,1.2,0,0,23.6,103,-67,96.0,2019-06-07 00:45:00.000
20,21,2019-06-07 05:00:00,0,1.2,0,0,23.6,100,-67,71.3,2019-06-07 01:00:00.000
21,22,2019-06-07 05:15:00,0,1.2,0,0,23.6,96,-67,25.9,2019-06-07 01:15:00.000
22,23,2019-06-07 05:30:00,0,1.2,0,0,23.7,93,-67,0.0,2019-06-07 01:30:00.000
23,24,2019-06-07 05:45:00,5,1.2,17,3,23.7,90,-67,0.0,2019-06-07 01:45:00.000
24,25,2019-06-07 06:00:00,36,1.2,183,20,23.8,86,-67,0.0,2019-06-07 02:00:00.000
25,26,2019-06-07 06:15:00,79,1.3,356,32,24.1,83,-67,0.0,2019-06-07 02:15:00.000
26,27,2019-06-07 06:30:00,129,1.3,456,42,24.5,79,-67,0.0,2019-06-07 02:30:00.000
27,28,2019-06-07 06:45:00,182,1.4,531,50,24.9,76,-67,0.0,2019-06-07 02:45:00.000
28,29,2019-06-07 07:00:00,237,1.4,589,57,25.4,72,-66,0.0,2019-06-07 03:00:00.000
29,30,2019-06-07 07:15:00,292,1.1,635,62,26.1,69,-66,0.0,2019-06-07 03:15:00.000
30,31,2019-06-07 07:30:00,348,0.7,672,68,26.8,65,-65,0.0,2019-06-07 03:30:00.000
31,32,2019-06-07 07:45:00,402,0.4,703,72,27.5,62,-65,0.0,2019-06-07 03:45:00.000
32,33,2019-06-07 08:00:00,455,0.2,728,76,28.2,59,-64,0.0,2019-06-07 04:00:00.000
33,34,2019-06-07 08:15:00,485,0.3,640,123,28.6,55,-63,4.1,2019-06-07 04:15:00.000
34,35,2019-06-07 08:30:00,536,0.5,665,125,29.0,52,-61,3.7,2019-06-07 04:30:00.000
35,36,2019-06-07 08:45:00,554,0.6,560,184,29.4,49,-60,8.1,2019-06-07 04:45:00.000
36,37,2019-06-07 09:00:00,596,0.7,574,194,29.7,46,-58,8.0,2019-06-07 05:00:00.000
37,38,2019-06-07 09:15:00,638,0.8,603,192,30.0,42,-56,7.4,2019-06-07 05:15:00.000
38,39,2019-06-07 09:30:00,695,1.0,689,162,30.2,39,-54,4.4,2019-06-07 05:30:00.000
39,40,2019-06-07 09:45:00,762,1.1,826,96,30.4,36,-51,0.0,2019-06-07 05:45:00.000
40,41,2019-06-07 10:00:00,793,1.3,833,98,30.5,34,-47,0.0,2019-06-07 06:00:00.000
41,42,2019-06-07 10:15:00,816,1.4,823,109,30.4,31,-43,0.5,2019-06-07 06:15:00.000
42,43,2019-06-07 10:30:00,842,1.5,841,102,30.3,28,-38,0.0,2019-06-07 06:30:00.000
43,44,2019-06-07 10:45:00,849,1.7,799,132,30.1,26,-32,1.2,2019-06-07 06:45:00.000
44,45,2019-06-07 11:00:00,806,1.8,613,248,29.9,24,-25,7.6,2019-06-07 07:00:00.000
45,46,2019-06-07 11:15:00,701,1.8,293,431,29.6,23,-17,20.4,2019-06-07 07:15:00.000
46,47,2019-06-07 11:30:00,759,1.9,431,359,29.4,22,-9,14.3,2019-06-07 07:30:00.000
47,48,2019-06-07 11:45:00,870,1.9,761,164,29.1,22,1,1.9,2019-06-07 07:45:00.000
48,49,2019-06-07 12:00:00,885,1.9,820,127,28.8,22,10,0.0,2019-06-07 08:00:00.000
49,50,2019-06-07 12:15:00,863,2.0,767,158,28.6,23,18,1.8,2019-06-07 08:15:00.000
50,51,2019-06-07 12:30:00,817,2.0,647,228,28.3,25,26,5.9,2019-06-07 08:30:00.000
51,52,2019-06-07 12:45:00,733,2.0,438,341,28.1,27,33,14.1,2019-06-07 08:45:00.000
52,53,2019-06-07 13:00:00,708,2.0,412,347,27.9,29,39,15.0,2019-06-07 09:00:00.000
53,54,2019-06-07 13:15:00,658,1.8,322,382,27.9,31,44,18.7,2019-06-07 09:15:00.000
54,55,2019-06-07 13:30:00,576,1.7,169,436,28.0,34,48,26.3,2019-06-07 09:30:00.000
55,56,2019-06-07 13:45:00,355,1.5,0,355,28.0,37,51,52.7,2019-06-07 09:45:00.000
56,57,2019-06-07 14:00:00,414,1.4,0,414,28.0,40,54,41.7,2019-06-07 10:00:00.000
57,58,2019-06-07 14:15:00,210,1.3,0,210,28.0,43,56,68.9,2019-06-07 10:15:00.000
58,59,2019-06-07 14:30:00,94,1.2,0,94,27.9,46,58,85.1,2019-06-07 10:30:00.000
59,60,2019-06-07 14:45:00,145,1.2,0,145,27.9,49,60,75.1,2019-06-07 10:45:00.000
60,61,2019-06-07 15:00:00,101,1.1,0,101,27.8,52,62,81.3,2019-06-07 11:00:00.000
61,62,2019-06-07 15:15:00,35,1.1,0,35,27.7,56,63,92.8,2019-06-07 11:15:00.000
62,63,2019-06-07 15:30:00,30,1.2,0,30,27.6,59,64,93.2,2019-06-07 11:30:00.000
63,64,2019-06-07 15:45:00,27,1.2,0,27,27.4,62,65,92.9,2019-06-07 11:45:00.000
64,65,2019-06-07 16:00:00,27,1.2,0,27,27.2,66,65,91.9,2019-06-07 12:00:00.000
65,66,2019-06-07 16:15:00,28,1.2,0,28,27.0,69,66,89.7,2019-06-07 12:15:00.000
66,67,2019-06-07 16:30:00,32,1.1,0,32,26.7,73,66,85.3,2019-06-07 12:30:00.000
67,68,2019-06-07 16:45:00,17,1.1,0,17,26.5,76,67,89.6,2019-06-07 12:45:00.000
68,69,2019-06-07 17:00:00,19,1.1,0,19,26.2,80,67,82.9,2019-06-07 13:00:00.000
69,70,2019-06-07 17:15:00,16,1.1,0,16,25.8,83,67,76.4,2019-06-07 13:15:00.000
70,71,2019-06-07 17:30:00,18,1.1,0,18,25.4,87,67,26.1,2019-06-07 13:30:00.000
71,72,2019-06-07 17:45:00,3,1.0,0,3,25.0,90,67,9.0,2019-06-07 13:45:00.000
72,73,2019-06-07 18:00:00,0,1.0,0,0,24.7,93,67,9.0,2019-06-07 14:00:00.000
73,74,2019-06-07 18:15:00,0,1.0,0,0,24.6,97,67,28.8,2019-06-07 14:15:00.000
74,75,2019-06-07 18:30:00,0,1.0,0,0,24.5,100,67,40.3,2019-06-07 14:30:00.000
75,76,2019-06-07 18:45:00,0,1.0,0,0,24.5,104,66,38.9,2019-06-07 14:45:00.000
76,77,2019-06-07 19:00:00,0,1.0,0,0,24.4,107,66,27.5,2019-06-07 15:00:00.000
77,78,2019-06-07 19:15:00,0,1.0,0,0,24.3,111,65,36.8,2019-06-07 15:15:00.000
78,79,2019-06-07 19:30:00,0,1.0,0,0,24.3,114,65,36.8,2019-06-07 15:30:00.000
79,80,2019-06-07 19:45:00,0,1.1,0,0,24.2,117,64,36.8,2019-06-07 15:45:00.000
80,81,2019-06-07 20:00:00,0,1.1,0,0,24.1,121,63,7.4,2019-06-07 16:00:00.000
81,82,2019-06-07 20:15:00,0,1.0,0,0,24.1,124,62,0.0,2019-06-07 16:15:00.000
82,83,2019-06-07 20:30:00,0,1.0,0,0,24.1,127,60,0.0,2019-06-07 16:30:00.000
83,84,2019-06-07 20:45:00,0,0.9,0,0,24.1,131,59,0.0,2019-06-07 16:45:00.000
84,85,2019-06-07 21:00:00,0,0.9,0,0,24.1,134,57,0.0,2019-06-07 17:00:00.000
85,86,2019-06-07 21:15:00,0,0.9,0,0,24.1,137,55,0.0,2019-06-07 17:15:00.000
86,87,2019-06-07 21:30:00,0,0.8,0,0,24.0,140,52,0.0,2019-06-07 17:30:00.000
87,88,2019-06-07 21:45:00,0,0.8,0,0,24.0,143,49,0.0,2019-06-07 17:45:00.000
88,89,2019-06-07 22:00:00,0,0.7,0,0,24.0,146,46,0.0,2019-06-07 18:00:00.000
89,90,2019-06-07 22:15:00,0,0.7,0,0,24.0,148,42,0.0,2019-06-07 18:15:00.000
90,91,2019-06-07 22:30:00,0,0.7,0,0,24.0,151,37,0.0,2019-06-07 18:30:00.000
91,92,2019-06-07 22:45:00,0,0.6,0,0,23.9,153,31,0.0,2019-06-07 18:45:00.000
92,93,2019-06-07 23:00:00,0,0.6,0,0,23.9,154,24,0.0,2019-06-07 19:00:00.000
93,94,2019-06-07 23:15:00,0,0.5,0,0,23.9,156,16,0.0,2019-06-07 19:15:00.000
94,95,2019-06-07 23:30:00,0,0.5,0,0,23.9,156,8,0.0,2019-06-07 19:30:00.000
95,96,2019-06-07 23:45:00,0,0.4,0,0,23.9,157,-1,0.0,2019-06-07 19:45:00.000
