,BLOCK_ID,DATA_DATETIME,GHI,WIND_SPEED,DNI,DHI,TEMPERATURE,ZENITH,AZIMUTH,CLOUD_OPACITY,ENTRY_TIME
0,1,2019-12-29 00:00:00,0,1.7,0,0,23.2,157,-172,0.0,2019-12-28 20:00:00.000
1,2,2019-12-29 00:15:00,0,1.7,0,0,23.2,156,-164,0.0,2019-12-28 20:15:00.000
2,3,2019-12-29 00:30:00,0,1.7,0,0,23.2,155,-156,0.0,2019-12-28 20:30:00.000
3,4,2019-12-29 00:45:00,0,1.7,0,0,23.1,153,-149,0.0,2019-12-28 20:45:00.000
4,5,2019-12-29 01:00:00,0,1.7,0,0,23.1,151,-143,0.0,2019-12-28 21:00:00.000
5,6,2019-12-29 01:15:00,0,1.7,0,0,23.1,149,-138,0.0,2019-12-28 21:15:00.000
6,7,2019-12-29 01:30:00,0,1.7,0,0,23.1,146,-134,0.0,2019-12-28 21:30:00.000
7,8,2019-12-29 01:45:00,0,1.8,0,0,23.2,143,-131,0.0,2019-12-28 21:45:00.000
8,9,2019-12-29 02:00:00,0,1.8,0,0,23.2,140,-128,0.0,2019-12-28 22:00:00.000
9,10,2019-12-29 02:15:00,0,1.8,0,0,23.1,137,-125,0.0,2019-12-28 22:15:00.000
10,11,2019-12-29 02:30:00,0,1.7,0,0,23.1,134,-123,0.0,2019-12-28 22:30:00.000
11,12,2019-12-29 02:45:00,0,1.7,0,0,23.0,131,-121,0.0,2019-12-28 22:45:00.000
12,13,2019-12-29 03:00:00,0,1.6,0,0,23.0,128,-120,0.0,2019-12-28 23:00:00.000
13,14,2019-12-29 03:15:00,0,1.6,0,0,23.0,125,-118,0.0,2019-12-28 23:15:00.000
14,15,2019-12-29 03:30:00,0,1.6,0,0,22.9,121,-117,0.0,2019-12-28 23:30:00.000
15,16,2019-12-29 03:45:00,0,1.6,0,0,22.9,118,-116,0.0,2019-12-28 23:45:00.000
16,17,2019-12-29 04:00:00,0,1.6,0,0,22.9,115,-115,0.0,2019-12-29 00:00:00.000
17,18,2019-12-29 04:15:00,0,1.6,0,0,22.9,111,-115,0.0,2019-12-29 00:15:00.000
18,19,2019-12-29 04:30:00,0,1.6,0,0,22.8,108,-114,0.0,2019-12-29 00:30:00.000
19,20,2019-12-29 04:45:00,0,1.7,0,0,22.8,104,-114,0.0,2019-12-29 00:45:00.000
20,21,2019-12-29 05:00:00,0,1.7,0,0,22.8,101,-114,24.8,2019-12-29 01:00:00.000
21,22,2019-12-29 05:15:00,0,1.6,0,0,22.8,98,-113,30.7,2019-12-29 01:15:00.000
22,23,2019-12-29 05:30:00,0,1.6,0,0,22.8,94,-113,30.8,2019-12-29 01:30:00.000
23,24,2019-12-29 05:45:00,1,1.6,0,1,22.8,91,-113,30.8,2019-12-29 01:45:00.000
24,25,2019-12-29 06:00:00,17,1.6,0,17,22.9,87,-113,30.8,2019-12-29 02:00:00.000
25,26,2019-12-29 06:15:00,57,1.6,70,49,23.2,84,-114,14.7,2019-12-29 02:15:00.000
26,27,2019-12-29 06:30:00,97,1.6,104,80,23.6,80,-114,17.4,2019-12-29 02:30:00.000
27,28,2019-12-29 06:45:00,147,1.6,187,104,23.9,77,-114,15.8,2019-12-29 02:45:00.000
28,29,2019-12-29 07:00:00,204,1.6,285,122,24.3,73,-115,13.0,2019-12-29 03:00:00.000
29,30,2019-12-29 07:15:00,227,1.5,185,165,24.9,70,-115,22.3,2019-12-29 03:15:00.000
30,31,2019-12-29 07:30:00,280,1.5,215,193,25.5,67,-116,21.4,2019-12-29 03:30:00.000
31,32,2019-12-29 07:45:00,361,1.5,386,187,26.1,63,-117,12.9,2019-12-29 03:45:00.000
32,33,2019-12-29 08:00:00,415,1.5,432,200,26.7,60,-118,11.8,2019-12-29 04:00:00.000
33,34,2019-12-29 08:15:00,492,1.5,600,166,27.0,57,-119,6.4,2019-12-29 04:15:00.000
34,35,2019-12-29 08:30:00,416,1.6,114,349,27.4,53,-120,28.4,2019-12-29 04:30:00.000
35,36,2019-12-29 08:45:00,355,1.6,0,355,27.8,50,-122,43.9,2019-12-29 04:45:00.000
36,37,2019-12-29 09:00:00,295,1.7,0,295,28.1,47,-123,56.6,2019-12-29 05:00:00.000
37,38,2019-12-29 09:15:00,274,1.7,0,274,28.4,44,-126,62.5,2019-12-29 05:15:00.000
38,39,2019-12-29 09:30:00,349,1.7,0,349,28.7,41,-128,54.7,2019-12-29 05:30:00.000
39,40,2019-12-29 09:45:00,372,1.7,0,372,29.0,38,-131,54.1,2019-12-29 05:45:00.000
40,41,2019-12-29 10:00:00,466,1.8,0,466,29.3,35,-134,44.8,2019-12-29 06:00:00.000
41,42,2019-12-29 10:15:00,412,1.8,0,412,29.4,33,-138,52.9,2019-12-29 06:15:00.000
42,43,2019-12-29 10:30:00,457,1.8,0,457,29.5,30,-143,49.3,2019-12-29 06:30:00.000
43,44,2019-12-29 10:45:00,697,1.8,230,494,29.6,28,-149,24.4,2019-12-29 06:45:00.000
44,45,2019-12-29 11:00:00,761,1.8,350,448,29.7,27,-155,18.9,2019-12-29 07:00:00.000
45,46,2019-12-29 11:15:00,771,1.8,354,451,29.7,25,-162,18.8,2019-12-29 07:15:00.000
46,47,2019-12-29 11:30:00,821,1.9,464,398,29.8,24,-170,14.2,2019-12-29 07:30:00.000
47,48,2019-12-29 11:45:00,772,1.9,333,467,29.8,24,-179,19.6,2019-12-29 07:45:00.000
48,49,2019-12-29 12:00:00,752,1.9,285,491,29.9,24,173,21.6,2019-12-29 08:00:00.000
49,50,2019-12-29 12:15:00,768,2.0,337,463,30.0,25,165,19.3,2019-12-29 08:15:00.000
50,51,2019-12-29 12:30:00,782,2.0,393,429,30.2,26,157,17.0,2019-12-29 08:30:00.000
51,52,2019-12-29 12:45:00,753,2.0,348,444,30.4,28,151,18.7,2019-12-29 08:45:00.000
52,53,2019-12-29 13:00:00,747,2.1,376,421,30.5,30,145,17.5,2019-12-29 09:00:00.000
53,54,2019-12-29 13:15:00,753,2.4,449,373,30.4,32,140,14.5,2019-12-29 09:15:00.000
54,55,2019-12-29 13:30:00,746,2.7,498,336,30.3,35,135,12.4,2019-12-29 09:30:00.000
55,56,2019-12-29 13:45:00,694,3.0,422,358,30.2,37,132,15.2,2019-12-29 09:45:00.000
56,57,2019-12-29 14:00:00,723,3.2,629,243,30.1,40,129,7.5,2019-12-29 10:00:00.000
57,58,2019-12-29 14:15:00,657,3.0,515,281,29.9,43,126,11.3,2019-12-29 10:15:00.000
58,59,2019-12-29 14:30:00,605,2.8,458,288,29.8,46,124,13.2,2019-12-29 10:30:00.000
59,60,2019-12-29 14:45:00,583,2.5,527,240,29.6,49,122,10.1,2019-12-29 10:45:00.000
60,61,2019-12-29 15:00:00,535,2.3,504,228,29.4,53,120,10.5,2019-12-29 11:00:00.000
61,62,2019-12-29 15:15:00,472,2.2,419,237,29.2,56,119,13.2,2019-12-29 11:15:00.000
62,63,2019-12-29 15:30:00,440,2.1,490,190,28.9,59,118,9.7,2019-12-29 11:30:00.000
63,64,2019-12-29 15:45:00,430,2.0,726,94,28.7,62,117,0.0,2019-12-29 11:45:00.000
64,65,2019-12-29 16:00:00,353,1.9,565,121,28.4,66,116,4.7,2019-12-29 12:00:00.000
65,66,2019-12-29 16:15:00,250,1.7,207,177,28.1,69,115,19.2,2019-12-29 12:15:00.000
66,67,2019-12-29 16:30:00,145,1.5,35,133,27.8,73,115,42.6,2019-12-29 12:30:00.000
67,68,2019-12-29 16:45:00,125,1.3,0,125,27.5,76,114,34.0,2019-12-29 12:45:00.000
68,69,2019-12-29 17:00:00,81,1.1,0,81,27.1,79,114,38.8,2019-12-29 13:00:00.000
69,70,2019-12-29 17:15:00,50,1.0,0,50,26.5,83,114,36.2,2019-12-29 13:15:00.000
70,71,2019-12-29 17:30:00,30,1.0,57,25,26.0,86,113,9.1,2019-12-29 13:30:00.000
71,72,2019-12-29 17:45:00,4,0.9,7,4,25.4,90,113,0.0,2019-12-29 13:45:00.000
72,73,2019-12-29 18:00:00,0,0.8,0,0,24.9,93,113,0.0,2019-12-29 14:00:00.000
73,74,2019-12-29 18:15:00,0,0.8,0,0,24.7,97,113,0.0,2019-12-29 14:15:00.000
74,75,2019-12-29 18:30:00,0,0.8,0,0,24.4,100,114,0.0,2019-12-29 14:30:00.000
75,76,2019-12-29 18:45:00,0,0.7,0,0,24.2,104,114,0.0,2019-12-29 14:45:00.000
76,77,2019-12-29 19:00:00,0,0.7,0,0,24.0,107,114,0.0,2019-12-29 15:00:00.000
77,78,2019-12-29 19:15:00,0,0.7,0,0,23.9,110,115,0.0,2019-12-29 15:15:00.000
78,79,2019-12-29 19:30:00,0,0.7,0,0,23.9,114,115,0.0,2019-12-29 15:30:00.000
79,80,2019-12-29 19:45:00,0,0.7,0,0,23.8,117,116,0.0,2019-12-29 15:45:00.000
80,81,2019-12-29 20:00:00,0,0.7,0,0,23.7,121,117,20.3,2019-12-29 16:00:00.000
81,82,2019-12-29 20:15:00,0,0.8,0,0,23.6,124,118,25.9,2019-12-29 16:15:00.000
82,83,2019-12-29 20:30:00,0,0.9,0,0,23.6,127,119,22.7,2019-12-29 16:30:00.000
83,84,2019-12-29 20:45:00,0,1.0,0,0,23.5,130,121,30.1,2019-12-29 16:45:00.000
84,85,2019-12-29 21:00:00,0,1.1,0,0,23.4,134,122,31.3,2019-12-29 17:00:00.000
85,86,2019-12-29 21:15:00,0,1.1,0,0,23.3,137,124,30.0,2019-12-29 17:15:00.000
86,87,2019-12-29 21:30:00,0,1.2,0,0,23.3,140,127,31.3,2019-12-29 17:30:00.000
87,88,2019-12-29 21:45:00,0,1.2,0,0,23.2,143,130,33.0,2019-12-29 17:45:00.000
88,89,2019-12-29 22:00:00,0,1.3,0,0,23.1,146,133,30.0,2019-12-29 18:00:00.000
89,90,2019-12-29 22:15:00,0,1.3,0,0,23.1,148,137,31.3,2019-12-29 18:15:00.000
90,91,2019-12-29 22:30:00,0,1.3,0,0,23.1,151,142,30.8,2019-12-29 18:30:00.000
91,92,2019-12-29 22:45:00,0,1.4,0,0,23.0,153,148,34.2,2019-12-29 18:45:00.000
92,93,2019-12-29 23:00:00,0,1.4,0,0,23.0,155,154,30.8,2019-12-29 19:00:00.000
93,94,2019-12-29 23:15:00,0,1.4,0,0,23.0,156,162,30.9,2019-12-29 19:15:00.000
94,95,2019-12-29 23:30:00,0,1.5,0,0,22.9,157,170,28.9,2019-12-29 19:30:00.000
95,96,2019-12-29 23:45:00,0,1.5,0,0,22.9,157,179,31.0,2019-12-29 19:45:00.000
