,BLOCK_ID,DATA_DATETIME,GHI,WIND_SPEED,DNI,DHI,TEMPERATURE,ZENITH,AZIMUTH,CLOUD_OPACITY,ENTRY_TIME
0,1,2019-04-16 00:00:00,0,4.2,0,0,27.1,169,-19,37.0,2019-04-15 20:00:00.000
1,2,2019-04-16 00:15:00,0,4.1,0,0,27.1,168,-35,37.0,2019-04-15 20:15:00.000
2,3,2019-04-16 00:30:00,0,4.1,0,0,27.1,165,-47,37.0,2019-04-15 20:30:00.000
3,4,2019-04-16 00:45:00,0,4.0,0,0,27.1,162,-55,0.0,2019-04-15 20:45:00.000
4,5,2019-04-16 01:00:00,0,4.0,0,0,27.1,159,-61,0.0,2019-04-15 21:00:00.000
5,6,2019-04-16 01:15:00,0,3.9,0,0,27.0,156,-65,0.0,2019-04-15 21:15:00.000
6,7,2019-04-16 01:30:00,0,3.9,0,0,27.0,152,-68,29.6,2019-04-15 21:30:00.000
7,8,2019-04-16 01:45:00,0,3.8,0,0,27.0,149,-71,37.0,2019-04-15 21:45:00.000
8,9,2019-04-16 02:00:00,0,3.8,0,0,27.0,145,-72,37.0,2019-04-15 22:00:00.000
9,10,2019-04-16 02:15:00,0,3.8,0,0,27.0,142,-74,41.4,2019-04-15 22:15:00.000
10,11,2019-04-16 02:30:00,0,3.7,0,0,26.9,138,-75,33.8,2019-04-15 22:30:00.000
11,12,2019-04-16 02:45:00,0,3.7,0,0,26.9,134,-76,4.0,2019-04-15 22:45:00.000
12,13,2019-04-16 03:00:00,0,3.7,0,0,26.9,131,-77,0.0,2019-04-15 23:00:00.000
13,14,2019-04-16 03:15:00,0,3.6,0,0,26.9,127,-78,0.0,2019-04-15 23:15:00.000
14,15,2019-04-16 03:30:00,0,3.6,0,0,26.8,123,-78,0.0,2019-04-15 23:30:00.000
15,16,2019-04-16 03:45:00,0,3.6,0,0,26.8,120,-79,0.0,2019-04-15 23:45:00.000
16,17,2019-04-16 04:00:00,0,3.6,0,0,26.8,116,-79,0.0,2019-04-16 00:00:00.000
17,18,2019-04-16 04:15:00,0,3.5,0,0,26.8,112,-80,0.0,2019-04-16 00:15:00.000
18,19,2019-04-16 04:30:00,0,3.5,0,0,26.7,109,-80,0.0,2019-04-16 00:30:00.000
19,20,2019-04-16 04:45:00,0,3.5,0,0,26.7,105,-80,0.0,2019-04-16 00:45:00.000
20,21,2019-04-16 05:00:00,0,3.4,0,0,26.7,101,-80,0.0,2019-04-16 01:00:00.000
21,22,2019-04-16 05:15:00,0,3.5,0,0,26.7,98,-80,0.0,2019-04-16 01:15:00.000
22,23,2019-04-16 05:30:00,0,3.5,0,0,26.8,94,-80,0.0,2019-04-16 01:30:00.000
23,24,2019-04-16 05:45:00,4,3.5,13,3,26.8,90,-81,0.0,2019-04-16 01:45:00.000
24,25,2019-04-16 06:00:00,33,3.5,174,18,26.8,86,-81,0.0,2019-04-16 02:00:00.000
25,26,2019-04-16 06:15:00,81,3.5,381,32,26.9,83,-81,0.0,2019-04-16 02:15:00.000
26,27,2019-04-16 06:30:00,136,3.5,489,43,26.9,79,-80,0.0,2019-04-16 02:30:00.000
27,28,2019-04-16 06:45:00,196,3.5,568,52,26.9,75,-80,0.0,2019-04-16 02:45:00.000
28,29,2019-04-16 07:00:00,257,3.6,628,59,27.0,72,-80,0.0,2019-04-16 03:00:00.000
29,30,2019-04-16 07:15:00,319,3.6,675,66,27.0,68,-80,0.0,2019-04-16 03:15:00.000
30,31,2019-04-16 07:30:00,381,3.6,713,72,27.0,64,-80,0.0,2019-04-16 03:30:00.000
31,32,2019-04-16 07:45:00,443,3.6,744,77,27.1,61,-79,0.0,2019-04-16 03:45:00.000
32,33,2019-04-16 08:00:00,503,3.6,770,82,27.1,57,-79,0.0,2019-04-16 04:00:00.000
33,34,2019-04-16 08:15:00,561,3.4,792,86,27.1,53,-79,0.0,2019-04-16 04:15:00.000
34,35,2019-04-16 08:30:00,617,3.3,810,90,27.1,49,-78,0.0,2019-04-16 04:30:00.000
35,36,2019-04-16 08:45:00,670,3.1,826,94,27.0,46,-77,0.0,2019-04-16 04:45:00.000
36,37,2019-04-16 09:00:00,719,3.0,839,97,27.0,42,-76,0.0,2019-04-16 05:00:00.000
37,38,2019-04-16 09:15:00,766,2.8,851,100,27.0,39,-75,0.0,2019-04-16 05:15:00.000
38,39,2019-04-16 09:30:00,809,2.7,861,103,27.0,35,-74,0.0,2019-04-16 05:30:00.000
39,40,2019-04-16 09:45:00,848,2.5,869,105,27.0,31,-73,0.0,2019-04-16 05:45:00.000
40,41,2019-04-16 10:00:00,883,2.3,876,108,27.0,28,-70,0.0,2019-04-16 06:00:00.000
41,42,2019-04-16 10:15:00,914,2.2,882,110,26.9,24,-68,0.0,2019-04-16 06:15:00.000
42,43,2019-04-16 10:30:00,940,2.1,887,111,26.9,21,-64,0.0,2019-04-16 06:30:00.000
43,44,2019-04-16 10:45:00,962,1.9,892,112,26.9,18,-59,0.0,2019-04-16 06:45:00.000
44,45,2019-04-16 11:00:00,979,1.8,895,113,26.9,14,-51,0.0,2019-04-16 07:00:00.000
45,46,2019-04-16 11:15:00,992,1.7,898,113,26.9,12,-40,0.0,2019-04-16 07:15:00.000
46,47,2019-04-16 11:30:00,1000,1.7,899,114,27.0,10,-23,0.0,2019-04-16 07:30:00.000
47,48,2019-04-16 11:45:00,1002,1.6,899,114,27.0,9,-1,0.0,2019-04-16 07:45:00.000
48,49,2019-04-16 12:00:00,1000,1.6,899,114,27.0,10,21,0.0,2019-04-16 08:00:00.000
49,50,2019-04-16 12:15:00,993,1.6,898,114,27.1,12,39,0.0,2019-04-16 08:15:00.000
50,51,2019-04-16 12:30:00,981,1.5,895,113,27.1,14,50,0.0,2019-04-16 08:30:00.000
51,52,2019-04-16 12:45:00,965,1.5,893,112,27.1,17,58,0.0,2019-04-16 08:45:00.000
52,53,2019-04-16 13:00:00,943,1.4,889,111,27.2,21,64,0.0,2019-04-16 09:00:00.000
53,54,2019-04-16 13:15:00,917,1.4,884,109,27.2,24,67,0.0,2019-04-16 09:15:00.000
54,55,2019-04-16 13:30:00,887,1.4,878,108,27.2,27,70,0.0,2019-04-16 09:30:00.000
55,56,2019-04-16 13:45:00,852,1.3,869,107,27.3,31,72,0.0,2019-04-16 09:45:00.000
56,57,2019-04-16 14:00:00,813,1.3,859,106,27.3,35,74,0.0,2019-04-16 10:00:00.000
57,58,2019-04-16 14:15:00,769,1.4,847,104,27.3,38,75,0.0,2019-04-16 10:15:00.000
58,59,2019-04-16 14:30:00,723,1.4,833,102,27.4,42,76,0.0,2019-04-16 10:30:00.000
59,60,2019-04-16 14:45:00,673,1.4,818,99,27.4,45,77,0.0,2019-04-16 10:45:00.000
60,61,2019-04-16 15:00:00,620,1.5,801,96,27.5,49,78,0.0,2019-04-16 11:00:00.000
61,62,2019-04-16 15:15:00,565,1.5,782,92,27.5,53,78,0.0,2019-04-16 11:15:00.000
62,63,2019-04-16 15:30:00,507,1.6,759,88,27.6,56,79,0.0,2019-04-16 11:30:00.000
63,64,2019-04-16 15:45:00,447,1.6,732,83,27.6,60,79,0.0,2019-04-16 11:45:00.000
64,65,2019-04-16 16:00:00,386,1.7,700,78,27.6,64,80,0.0,2019-04-16 12:00:00.000
65,66,2019-04-16 16:15:00,324,1.7,661,72,27.7,68,80,0.0,2019-04-16 12:15:00.000
66,67,2019-04-16 16:30:00,262,1.8,612,65,27.7,71,80,0.0,2019-04-16 12:30:00.000
67,68,2019-04-16 16:45:00,200,1.8,551,57,27.8,75,80,0.0,2019-04-16 12:45:00.000
68,69,2019-04-16 17:00:00,141,1.9,471,47,27.8,79,80,0.0,2019-04-16 13:00:00.000
69,70,2019-04-16 17:15:00,85,2.0,362,36,27.8,82,80,0.0,2019-04-16 13:15:00.000
70,71,2019-04-16 17:30:00,37,2.1,169,21,27.8,86,80,0.0,2019-04-16 13:30:00.000
71,72,2019-04-16 17:45:00,5,2.1,10,4,27.8,90,80,0.0,2019-04-16 13:45:00.000
72,73,2019-04-16 18:00:00,0,2.2,0,0,27.8,93,80,24.4,2019-04-16 14:00:00.000
73,74,2019-04-16 18:15:00,0,2.3,0,0,27.8,97,80,10.8,2019-04-16 14:15:00.000
74,75,2019-04-16 18:30:00,0,2.4,0,0,27.7,101,80,36.7,2019-04-16 14:30:00.000
75,76,2019-04-16 18:45:00,0,2.5,0,0,27.7,104,80,25.8,2019-04-16 14:45:00.000
76,77,2019-04-16 19:00:00,0,2.6,0,0,27.7,108,80,0.0,2019-04-16 15:00:00.000
77,78,2019-04-16 19:15:00,0,2.7,0,0,27.7,112,79,0.0,2019-04-16 15:15:00.000
78,79,2019-04-16 19:30:00,0,2.8,0,0,27.7,116,79,0.0,2019-04-16 15:30:00.000
79,80,2019-04-16 19:45:00,0,2.9,0,0,27.7,119,79,0.0,2019-04-16 15:45:00.000
80,81,2019-04-16 20:00:00,0,3.0,0,0,27.7,123,78,0.0,2019-04-16 16:00:00.000
81,82,2019-04-16 20:15:00,0,3.0,0,0,27.7,127,77,0.0,2019-04-16 16:15:00.000
82,83,2019-04-16 20:30:00,0,3.0,0,0,27.8,130,77,0.0,2019-04-16 16:30:00.000
83,84,2019-04-16 20:45:00,0,3.1,0,0,27.8,134,76,0.0,2019-04-16 16:45:00.000
84,85,2019-04-16 21:00:00,0,3.1,0,0,27.8,137,75,0.0,2019-04-16 17:00:00.000
85,86,2019-04-16 21:15:00,0,3.1,0,0,27.9,141,74,0.0,2019-04-16 17:15:00.000
86,87,2019-04-16 21:30:00,0,3.2,0,0,27.9,145,72,0.0,2019-04-16 17:30:00.000
87,88,2019-04-16 21:45:00,0,3.2,0,0,27.9,148,70,0.0,2019-04-16 17:45:00.000
88,89,2019-04-16 22:00:00,0,3.3,0,0,28.0,152,68,0.0,2019-04-16 18:00:00.000
89,90,2019-04-16 22:15:00,0,3.3,0,0,28.0,155,65,0.0,2019-04-16 18:15:00.000
90,91,2019-04-16 22:30:00,0,3.3,0,0,28.0,159,61,0.0,2019-04-16 18:30:00.000
91,92,2019-04-16 22:45:00,0,3.4,0,0,28.1,162,55,0.0,2019-04-16 18:45:00.000
92,93,2019-04-16 23:00:00,0,3.4,0,0,28.1,165,47,0.0,2019-04-16 19:00:00.000
93,94,2019-04-16 23:15:00,0,3.4,0,0,28.1,167,36,0.0,2019-04-16 19:15:00.000
94,95,2019-04-16 23:30:00,0,3.4,0,0,28.0,169,20,0.0,2019-04-16 19:30:00.000
95,96,2019-04-16 23:45:00,0,3.3,0,0,28.0,170,1,0.0,2019-04-16 19:45:00.000
