,BLOCK_ID,DATA_DATETIME,GHI,WIND_SPEED,DNI,DHI,TEMPERATURE,ZENITH,AZIMUTH,CLOUD_OPACITY,ENTRY_TIME
0,1,2020-09-19 00:00:00,0,0.8,0,0,23.2,174,-63,39.0,2020-09-18 20:00:00.000
1,2,2020-09-19 00:15:00,0,0.7,0,0,23.1,171,-74,28.6,2020-09-18 20:15:00.000
2,3,2020-09-19 00:30:00,0,0.7,0,0,23.1,167,-78,41.0,2020-09-18 20:30:00.000
3,4,2020-09-19 00:45:00,0,0.7,0,0,23.0,163,-81,44.8,2020-09-18 20:45:00.000
4,5,2020-09-19 01:00:00,0,0.7,0,0,23.0,160,-83,38.6,2020-09-18 21:00:00.000
5,6,2020-09-19 01:15:00,0,0.6,0,0,23.0,156,-84,32.2,2020-09-18 21:15:00.000
6,7,2020-09-19 01:30:00,0,0.6,0,0,22.9,152,-85,42.0,2020-09-18 21:30:00.000
7,8,2020-09-19 01:45:00,0,0.5,0,0,22.9,149,-85,54.2,2020-09-18 21:45:00.000
8,9,2020-09-19 02:00:00,0,0.5,0,0,22.9,145,-86,50.0,2020-09-18 22:00:00.000
9,10,2020-09-19 02:15:00,0,0.4,0,0,22.9,141,-86,21.6,2020-09-18 22:15:00.000
10,11,2020-09-19 02:30:00,0,0.3,0,0,22.9,137,-87,3.2,2020-09-18 22:30:00.000
11,12,2020-09-19 02:45:00,0,0.3,0,0,22.9,134,-87,0.0,2020-09-18 22:45:00.000
12,13,2020-09-19 03:00:00,0,0.2,0,0,22.9,130,-87,0.0,2020-09-18 23:00:00.000
13,14,2020-09-19 03:15:00,0,0.2,0,0,22.8,126,-87,4.8,2020-09-18 23:15:00.000
14,15,2020-09-19 03:30:00,0,0.1,0,0,22.8,122,-87,3.2,2020-09-18 23:30:00.000
15,16,2020-09-19 03:45:00,0,0.1,0,0,22.7,119,-88,15.7,2020-09-18 23:45:00.000
16,17,2020-09-19 04:00:00,0,0.1,0,0,22.7,115,-88,15.8,2020-09-19 00:00:00.000
17,18,2020-09-19 04:15:00,0,0.1,0,0,22.7,111,-88,16.0,2020-09-19 00:15:00.000
18,19,2020-09-19 04:30:00,0,0.2,0,0,22.8,107,-88,15.2,2020-09-19 00:30:00.000
19,20,2020-09-19 04:45:00,0,0.2,0,0,22.8,104,-88,16.6,2020-09-19 00:45:00.000
20,21,2020-09-19 05:00:00,0,0.2,0,0,22.9,100,-88,14.8,2020-09-19 01:00:00.000
21,22,2020-09-19 05:15:00,0,0.3,0,0,22.9,96,-88,14.3,2020-09-19 01:15:00.000
22,23,2020-09-19 05:30:00,0,0.3,0,0,23.0,92,-88,15.8,2020-09-19 01:30:00.000
23,24,2020-09-19 05:45:00,9,0.3,0,9,23.1,89,-88,14.3,2020-09-19 01:45:00.000
24,25,2020-09-19 06:00:00,41,0.3,47,37,23.2,85,-88,14.2,2020-09-19 02:00:00.000
25,26,2020-09-19 06:15:00,80,0.3,72,68,23.4,81,-88,18.5,2020-09-19 02:15:00.000
26,27,2020-09-19 06:30:00,151,0.3,404,60,23.6,77,-88,3.0,2020-09-19 02:30:00.000
27,28,2020-09-19 06:45:00,205,0.3,447,81,23.9,74,-88,3.9,2020-09-19 02:45:00.000
28,29,2020-09-19 07:00:00,247,0.3,351,125,24.3,70,-88,10.6,2020-09-19 03:00:00.000
29,30,2020-09-19 07:15:00,274,0.3,221,185,25.1,66,-88,18.8,2020-09-19 03:15:00.000
30,31,2020-09-19 07:30:00,324,0.2,239,212,25.9,62,-88,19.0,2020-09-19 03:30:00.000
31,32,2020-09-19 07:45:00,422,0.2,496,162,26.8,59,-88,8.4,2020-09-19 03:45:00.000
32,33,2020-09-19 08:00:00,520,0.2,733,98,27.6,55,-88,0.0,2020-09-19 04:00:00.000
33,34,2020-09-19 08:15:00,577,0.2,755,102,28.1,51,-88,0.0,2020-09-19 04:15:00.000
34,35,2020-09-19 08:30:00,631,0.3,773,107,28.6,47,-88,0.0,2020-09-19 04:30:00.000
35,36,2020-09-19 08:45:00,683,0.5,789,111,29.2,44,-88,0.0,2020-09-19 04:45:00.000
36,37,2020-09-19 09:00:00,731,0.5,802,115,29.7,40,-88,0.0,2020-09-19 05:00:00.000
37,38,2020-09-19 09:15:00,775,0.5,813,118,30.0,36,-88,0.0,2020-09-19 05:15:00.000
38,39,2020-09-19 09:30:00,816,0.4,823,121,30.4,32,-88,0.0,2020-09-19 05:30:00.000
39,40,2020-09-19 09:45:00,853,0.4,831,123,30.8,29,-87,0.0,2020-09-19 05:45:00.000
40,41,2020-09-19 10:00:00,886,0.4,838,126,31.1,25,-87,0.0,2020-09-19 06:00:00.000
41,42,2020-09-19 10:15:00,756,0.4,377,406,31.2,21,-87,17.3,2020-09-19 06:15:00.000
42,43,2020-09-19 10:30:00,682,0.5,161,529,31.3,17,-86,27.4,2020-09-19 06:30:00.000
43,44,2020-09-19 10:45:00,640,0.6,66,577,31.4,14,-85,33.2,2020-09-19 06:45:00.000
44,45,2020-09-19 11:00:00,440,0.6,0,440,31.3,10,-83,54.8,2020-09-19 07:00:00.000
45,46,2020-09-19 11:15:00,461,0.8,0,461,30.8,6,-79,53.2,2020-09-19 07:15:00.000
46,47,2020-09-19 11:30:00,757,0.9,273,484,30.2,3,-61,23.6,2020-09-19 07:30:00.000
47,48,2020-09-19 11:45:00,185,1.0,0,185,29.7,2,44,81.3,2020-09-19 07:45:00.000
48,49,2020-09-19 12:00:00,233,1.1,0,233,29.2,5,77,76.4,2020-09-19 08:00:00.000
49,50,2020-09-19 12:15:00,216,1.2,0,216,29.0,9,83,77.9,2020-09-19 08:15:00.000
50,51,2020-09-19 12:30:00,91,1.2,0,91,28.9,13,85,90.6,2020-09-19 08:30:00.000
51,52,2020-09-19 12:45:00,63,1.3,0,63,28.8,16,86,93.3,2020-09-19 08:45:00.000
52,53,2020-09-19 13:00:00,127,1.3,0,127,28.7,20,87,86.2,2020-09-19 09:00:00.000
53,54,2020-09-19 13:15:00,450,1.2,0,450,28.7,24,87,49.6,2020-09-19 09:15:00.000
54,55,2020-09-19 13:30:00,353,1.1,0,353,28.7,28,88,59.0,2020-09-19 09:30:00.000
55,56,2020-09-19 13:45:00,262,1.0,0,262,28.7,31,88,68.0,2020-09-19 09:45:00.000
56,57,2020-09-19 14:00:00,397,0.9,0,397,28.7,35,88,49.2,2020-09-19 10:00:00.000
57,58,2020-09-19 14:15:00,213,0.9,0,213,28.7,39,88,70.8,2020-09-19 10:15:00.000
58,59,2020-09-19 14:30:00,534,0.9,313,305,28.7,43,88,22.0,2020-09-19 10:30:00.000
59,60,2020-09-19 14:45:00,522,0.9,304,310,28.6,46,88,18.1,2020-09-19 10:45:00.000
60,61,2020-09-19 15:00:00,463,0.9,236,312,28.5,50,88,20.4,2020-09-19 11:00:00.000
61,62,2020-09-19 15:15:00,333,1.0,24,320,28.3,54,88,36.4,2020-09-19 11:15:00.000
62,63,2020-09-19 15:30:00,336,1.0,73,297,28.0,58,88,28.0,2020-09-19 11:30:00.000
63,64,2020-09-19 15:45:00,301,1.0,90,257,27.8,61,88,26.2,2020-09-19 11:45:00.000
64,65,2020-09-19 16:00:00,246,1.0,32,232,27.6,65,88,29.0,2020-09-19 12:00:00.000
65,66,2020-09-19 16:15:00,233,1.1,180,167,27.3,69,88,18.4,2020-09-19 12:15:00.000
66,67,2020-09-19 16:30:00,159,1.1,15,154,27.0,73,88,28.8,2020-09-19 12:30:00.000
67,68,2020-09-19 16:45:00,144,1.2,199,96,26.7,76,88,12.4,2020-09-19 12:45:00.000
68,69,2020-09-19 17:00:00,88,1.2,65,77,26.4,80,88,17.2,2020-09-19 13:00:00.000
69,70,2020-09-19 17:15:00,46,1.2,0,46,26.0,84,88,17.8,2020-09-19 13:15:00.000
70,71,2020-09-19 17:30:00,13,1.2,0,13,25.5,88,88,25.4,2020-09-19 13:30:00.000
71,72,2020-09-19 17:45:00,0,1.1,0,0,25.1,91,88,65.0,2020-09-19 13:45:00.000
72,73,2020-09-19 18:00:00,0,1.1,0,0,24.7,95,88,55.4,2020-09-19 14:00:00.000
73,74,2020-09-19 18:15:00,0,1.1,0,0,24.6,99,88,45.9,2020-09-19 14:15:00.000
74,75,2020-09-19 18:30:00,0,1.0,0,0,24.5,103,88,20.0,2020-09-19 14:30:00.000
75,76,2020-09-19 18:45:00,0,1.0,0,0,24.3,106,88,29.5,2020-09-19 14:45:00.000
76,77,2020-09-19 19:00:00,0,0.9,0,0,24.2,110,88,38.0,2020-09-19 15:00:00.000
77,78,2020-09-19 19:15:00,0,0.8,0,0,24.1,114,88,39.0,2020-09-19 15:15:00.000
78,79,2020-09-19 19:30:00,0,0.6,0,0,24.1,118,88,47.2,2020-09-19 15:30:00.000
79,80,2020-09-19 19:45:00,0,0.5,0,0,24.0,121,88,51.8,2020-09-19 15:45:00.000
80,81,2020-09-19 20:00:00,0,0.4,0,0,23.9,125,88,16.8,2020-09-19 16:00:00.000
81,82,2020-09-19 20:15:00,0,0.4,0,0,23.9,129,87,13.7,2020-09-19 16:15:00.000
82,83,2020-09-19 20:30:00,0,0.5,0,0,23.8,133,87,13.8,2020-09-19 16:30:00.000
83,84,2020-09-19 20:45:00,0,0.5,0,0,23.7,136,87,54.0,2020-09-19 16:45:00.000
84,85,2020-09-19 21:00:00,0,0.6,0,0,23.7,140,87,34.2,2020-09-19 17:00:00.000
85,86,2020-09-19 21:15:00,0,0.6,0,0,23.6,144,86,62.0,2020-09-19 17:15:00.000
86,87,2020-09-19 21:30:00,0,0.5,0,0,23.5,148,86,50.0,2020-09-19 17:30:00.000
87,88,2020-09-19 21:45:00,0,0.5,0,0,23.5,151,86,32.8,2020-09-19 17:45:00.000
88,89,2020-09-19 22:00:00,0,0.5,0,0,23.4,155,85,17.6,2020-09-19 18:00:00.000
89,90,2020-09-19 22:15:00,0,0.5,0,0,23.4,159,84,13.0,2020-09-19 18:15:00.000
90,91,2020-09-19 22:30:00,0,0.5,0,0,23.4,163,83,14.6,2020-09-19 18:30:00.000
91,92,2020-09-19 22:45:00,0,0.6,0,0,23.4,166,81,14.7,2020-09-19 18:45:00.000
92,93,2020-09-19 23:00:00,0,0.6,0,0,23.3,170,77,13.2,2020-09-19 19:00:00.000
93,94,2020-09-19 23:15:00,0,0.6,0,0,23.3,174,69,13.7,2020-09-19 19:15:00.000
94,95,2020-09-19 23:30:00,0,0.6,0,0,23.2,177,44,14.6,2020-09-19 19:30:00.000
95,96,2020-09-19 23:45:00,0,0.6,0,0,23.2,177,-29,15.0,2020-09-19 19:45:00.000
