,BLOCK_ID,DATA_DATETIME,GHI,WIND_SPEED,DNI,DHI,TEMPERATURE,ZENITH,AZIMUTH,CLOUD_OPACITY,ENTRY_TIME
0,1,2021-07-09 00:00:00,0,0.1,0,0,22.5,157,-6,97.0,2021-07-08 20:00:00.000
1,2,2021-07-09 00:15:00,0,0.2,0,0,22.5,156,-14,97.0,2021-07-08 20:15:00.000
2,3,2021-07-09 00:30:00,0,0.2,0,0,22.4,155,-22,97.0,2021-07-08 20:30:00.000
3,4,2021-07-09 00:45:00,0,0.3,0,0,22.4,153,-29,96.0,2021-07-08 20:45:00.000
4,5,2021-07-09 01:00:00,0,0.3,0,0,22.3,151,-35,96.0,2021-07-08 21:00:00.000
5,6,2021-07-09 01:15:00,0,0.3,0,0,22.3,149,-40,87.2,2021-07-08 21:15:00.000
6,7,2021-07-09 01:30:00,0,0.4,0,0,22.3,146,-45,72.0,2021-07-08 21:30:00.000
7,8,2021-07-09 01:45:00,0,0.4,0,0,22.3,144,-48,71.0,2021-07-08 21:45:00.000
8,9,2021-07-09 02:00:00,0,0.4,0,0,22.3,141,-52,66.4,2021-07-08 22:00:00.000
9,10,2021-07-09 02:15:00,0,0.4,0,0,22.2,138,-54,53.0,2021-07-08 22:15:00.000
10,11,2021-07-09 02:30:00,0,0.4,0,0,22.2,135,-56,34.8,2021-07-08 22:30:00.000
11,12,2021-07-09 02:45:00,0,0.3,0,0,22.2,132,-58,18.1,2021-07-08 22:45:00.000
12,13,2021-07-09 03:00:00,0,0.3,0,0,22.2,128,-60,18.4,2021-07-08 23:00:00.000
13,14,2021-07-09 03:15:00,0,0.3,0,0,22.1,125,-61,20.7,2021-07-08 23:15:00.000
14,15,2021-07-09 03:30:00,0,0.2,0,0,22.1,122,-63,20.0,2021-07-08 23:30:00.000
15,16,2021-07-09 03:45:00,0,0.2,0,0,22.1,118,-64,19.6,2021-07-08 23:45:00.000
16,17,2021-07-09 04:00:00,0,0.2,0,0,22.1,115,-65,20.2,2021-07-09 00:00:00.000
17,18,2021-07-09 04:15:00,0,0.2,0,0,22.1,112,-65,37.0,2021-07-09 00:15:00.000
18,19,2021-07-09 04:30:00,0,0.2,0,0,22.0,108,-66,40.2,2021-07-09 00:30:00.000
19,20,2021-07-09 04:45:00,0,0.2,0,0,22.0,105,-66,62.1,2021-07-09 00:45:00.000
20,21,2021-07-09 05:00:00,0,0.2,0,0,22.0,101,-67,70.0,2021-07-09 01:00:00.000
21,22,2021-07-09 05:15:00,0,0.2,0,0,22.0,98,-67,68.4,2021-07-09 01:15:00.000
22,23,2021-07-09 05:30:00,0,0.1,0,0,22.0,94,-67,85.4,2021-07-09 01:30:00.000
23,24,2021-07-09 05:45:00,0,0.1,0,0,21.9,91,-67,73.7,2021-07-09 01:45:00.000
24,25,2021-07-09 06:00:00,8,0.1,0,8,22.0,88,-67,61.8,2021-07-09 02:00:00.000
25,26,2021-07-09 06:15:00,39,0.1,0,39,22.3,84,-67,31.5,2021-07-09 02:15:00.000
26,27,2021-07-09 06:30:00,79,0.1,27,74,22.5,81,-67,24.0,2021-07-09 02:30:00.000
27,28,2021-07-09 06:45:00,102,0.1,0,102,22.8,77,-67,34.0,2021-07-09 02:45:00.000
28,29,2021-07-09 07:00:00,115,0.2,0,115,23.1,74,-67,45.0,2021-07-09 03:00:00.000
29,30,2021-07-09 07:15:00,147,0.3,0,147,23.4,70,-66,44.5,2021-07-09 03:15:00.000
30,31,2021-07-09 07:30:00,172,0.3,0,172,23.8,67,-66,46.4,2021-07-09 03:30:00.000
31,32,2021-07-09 07:45:00,243,0.4,62,214,24.2,63,-65,35.7,2021-07-09 03:45:00.000
32,33,2021-07-09 08:00:00,307,0.5,94,261,24.5,60,-64,28.2,2021-07-09 04:00:00.000
33,34,2021-07-09 08:15:00,287,0.6,0,287,24.9,57,-63,40.3,2021-07-09 04:15:00.000
34,35,2021-07-09 08:30:00,378,0.6,109,312,25.2,53,-62,28.9,2021-07-09 04:30:00.000
35,36,2021-07-09 08:45:00,530,0.7,530,190,25.6,50,-61,8.5,2021-07-09 04:45:00.000
36,37,2021-07-09 09:00:00,578,0.8,568,190,25.9,47,-59,7.4,2021-07-09 05:00:00.000
37,38,2021-07-09 09:15:00,626,0.9,633,171,26.1,44,-57,6.0,2021-07-09 05:15:00.000
38,39,2021-07-09 09:30:00,622,0.9,475,261,26.3,41,-55,12.0,2021-07-09 05:30:00.000
39,40,2021-07-09 09:45:00,487,1.0,191,337,26.5,38,-52,34.2,2021-07-09 05:45:00.000
40,41,2021-07-09 10:00:00,178,1.1,0,178,26.7,35,-49,77.0,2021-07-09 06:00:00.000
41,42,2021-07-09 10:15:00,451,1.2,0,451,26.8,32,-45,43.9,2021-07-09 06:15:00.000
42,43,2021-07-09 10:30:00,512,1.2,0,512,26.9,29,-40,38.2,2021-07-09 06:30:00.000
43,44,2021-07-09 10:45:00,487,1.3,0,487,27.0,27,-35,42.6,2021-07-09 06:45:00.000
44,45,2021-07-09 11:00:00,669,1.4,294,403,27.1,25,-28,22.6,2021-07-09 07:00:00.000
45,46,2021-07-09 11:15:00,666,1.4,218,466,27.3,24,-21,23.9,2021-07-09 07:15:00.000
46,47,2021-07-09 11:30:00,681,1.5,238,461,27.5,23,-12,22.8,2021-07-09 07:30:00.000
47,48,2021-07-09 11:45:00,683,1.6,238,462,27.6,22,-3,22.9,2021-07-09 07:45:00.000
48,49,2021-07-09 12:00:00,691,1.6,256,454,27.7,22,6,22.0,2021-07-09 08:00:00.000
49,50,2021-07-09 12:15:00,739,1.7,384,384,27.7,23,15,16.1,2021-07-09 08:15:00.000
50,51,2021-07-09 12:30:00,652,1.7,197,471,27.6,24,23,25.2,2021-07-09 08:30:00.000
51,52,2021-07-09 12:45:00,466,1.8,52,419,27.5,26,30,45.6,2021-07-09 08:45:00.000
52,53,2021-07-09 13:00:00,602,1.8,130,487,27.4,28,36,28.4,2021-07-09 09:00:00.000
53,54,2021-07-09 13:15:00,465,1.7,0,465,27.4,30,42,43.2,2021-07-09 09:15:00.000
54,55,2021-07-09 13:30:00,491,1.6,5,488,27.4,33,46,38.0,2021-07-09 09:30:00.000
55,56,2021-07-09 13:45:00,518,1.6,70,462,27.4,35,50,32.1,2021-07-09 09:45:00.000
56,57,2021-07-09 14:00:00,586,1.5,286,362,27.3,38,53,19.8,2021-07-09 10:00:00.000
57,58,2021-07-09 14:15:00,669,1.5,677,162,27.3,41,55,3.5,2021-07-09 10:15:00.000
58,59,2021-07-09 14:30:00,653,1.5,764,109,27.3,45,58,0.0,2021-07-09 10:30:00.000
59,60,2021-07-09 14:45:00,523,1.4,384,264,27.3,48,59,14.3,2021-07-09 10:45:00.000
60,61,2021-07-09 15:00:00,453,1.4,259,289,27.2,51,61,19.8,2021-07-09 11:00:00.000
61,62,2021-07-09 15:15:00,417,1.4,267,263,27.0,54,62,18.9,2021-07-09 11:15:00.000
62,63,2021-07-09 15:30:00,381,1.4,272,235,26.7,58,63,18.0,2021-07-09 11:30:00.000
63,64,2021-07-09 15:45:00,330,1.3,222,221,26.5,61,64,20.0,2021-07-09 11:45:00.000
64,65,2021-07-09 16:00:00,236,1.3,18,227,26.3,64,65,34.2,2021-07-09 12:00:00.000
65,66,2021-07-09 16:15:00,157,1.3,0,157,26.1,68,66,48.4,2021-07-09 12:15:00.000
66,67,2021-07-09 16:30:00,122,1.3,0,122,25.9,71,66,50.8,2021-07-09 12:30:00.000
67,68,2021-07-09 16:45:00,95,1.2,0,95,25.8,75,67,50.4,2021-07-09 12:45:00.000
68,69,2021-07-09 17:00:00,61,1.2,0,61,25.5,78,67,56.2,2021-07-09 13:00:00.000
69,70,2021-07-09 17:15:00,29,1.2,0,29,25.1,82,67,66.5,2021-07-09 13:15:00.000
70,71,2021-07-09 17:30:00,20,1.2,0,20,24.7,85,67,55.0,2021-07-09 13:30:00.000
71,72,2021-07-09 17:45:00,1,1.2,0,1,24.4,88,67,89.7,2021-07-09 13:45:00.000
72,73,2021-07-09 18:00:00,0,1.2,0,0,24.0,92,67,96.0,2021-07-09 14:00:00.000
73,74,2021-07-09 18:15:00,0,1.2,0,0,23.9,95,67,84.8,2021-07-09 14:15:00.000
74,75,2021-07-09 18:30:00,0,1.2,0,0,23.7,99,67,88.2,2021-07-09 14:30:00.000
75,76,2021-07-09 18:45:00,0,1.1,0,0,23.6,102,67,95.3,2021-07-09 14:45:00.000
76,77,2021-07-09 19:00:00,0,1.1,0,0,23.4,106,66,96.0,2021-07-09 15:00:00.000
77,78,2021-07-09 19:15:00,0,1.1,0,0,23.3,109,66,96.0,2021-07-09 15:15:00.000
78,79,2021-07-09 19:30:00,0,1.0,0,0,23.2,113,65,96.8,2021-07-09 15:30:00.000
79,80,2021-07-09 19:45:00,0,1.0,0,0,23.1,116,64,97.0,2021-07-09 15:45:00.000
80,81,2021-07-09 20:00:00,0,0.9,0,0,23.0,119,64,97.0,2021-07-09 16:00:00.000
81,82,2021-07-09 20:15:00,0,0.9,0,0,23.0,123,62,97.0,2021-07-09 16:15:00.000
82,83,2021-07-09 20:30:00,0,0.9,0,0,22.9,126,61,97.0,2021-07-09 16:30:00.000
83,84,2021-07-09 20:45:00,0,0.8,0,0,22.9,129,60,97.0,2021-07-09 16:45:00.000
84,85,2021-07-09 21:00:00,0,0.8,0,0,22.8,132,58,97.0,2021-07-09 17:00:00.000
85,86,2021-07-09 21:15:00,0,0.8,0,0,22.8,136,56,97.0,2021-07-09 17:15:00.000
86,87,2021-07-09 21:30:00,0,0.8,0,0,22.8,139,54,97.0,2021-07-09 17:30:00.000
87,88,2021-07-09 21:45:00,0,0.8,0,0,22.7,142,51,96.7,2021-07-09 17:45:00.000
88,89,2021-07-09 22:00:00,0,0.8,0,0,22.7,145,48,96.8,2021-07-09 18:00:00.000
89,90,2021-07-09 22:15:00,0,0.9,0,0,22.7,147,44,97.0,2021-07-09 18:15:00.000
90,91,2021-07-09 22:30:00,0,0.9,0,0,22.6,150,39,97.0,2021-07-09 18:30:00.000
91,92,2021-07-09 22:45:00,0,1.0,0,0,22.6,152,34,97.0,2021-07-09 18:45:00.000
92,93,2021-07-09 23:00:00,0,1.0,0,0,22.5,154,27,97.0,2021-07-09 19:00:00.000
93,94,2021-07-09 23:15:00,0,1.0,0,0,22.6,155,20,97.0,2021-07-09 19:15:00.000
94,95,2021-07-09 23:30:00,0,1.0,0,0,22.6,156,12,97.0,2021-07-09 19:30:00.000
95,96,2021-07-09 23:45:00,0,1.0,0,0,22.6,157,3,97.0,2021-07-09 19:45:00.000
