,BLOCK_ID,DATA_DATETIME,GHI,WIND_SPEED,DNI,DHI,TEMPERATURE,ZENITH,AZIMUTH,CLOUD_OPACITY,ENTRY_TIME
0,1,2019-02-03 00:00:00,0,4.4,0,0,26.2,163,-179,37.0,2019-02-02 20:00:00.000
1,2,2019-02-03 00:15:00,0,4.3,0,0,26.2,163,-167,37.0,2019-02-02 20:15:00.000
2,3,2019-02-03 00:30:00,0,4.2,0,0,26.2,162,-156,37.0,2019-02-02 20:30:00.000
3,4,2019-02-03 00:45:00,0,4.1,0,0,26.2,160,-146,37.0,2019-02-02 20:45:00.000
4,5,2019-02-03 01:00:00,0,4.0,0,0,26.2,158,-139,37.0,2019-02-02 21:00:00.000
5,6,2019-02-03 01:15:00,0,3.9,0,0,26.2,155,-133,37.0,2019-02-02 21:15:00.000
6,7,2019-02-03 01:30:00,0,3.8,0,0,26.2,152,-128,37.0,2019-02-02 21:30:00.000
7,8,2019-02-03 01:45:00,0,3.7,0,0,26.2,149,-124,15.1,2019-02-02 21:45:00.000
8,9,2019-02-03 02:00:00,0,3.6,0,0,26.2,146,-121,37.0,2019-02-02 22:00:00.000
9,10,2019-02-03 02:15:00,0,3.6,0,0,26.2,143,-118,37.0,2019-02-02 22:15:00.000
10,11,2019-02-03 02:30:00,0,3.7,0,0,26.2,139,-116,37.0,2019-02-02 22:30:00.000
11,12,2019-02-03 02:45:00,0,3.7,0,0,26.2,136,-114,37.0,2019-02-02 22:45:00.000
12,13,2019-02-03 03:00:00,0,3.7,0,0,26.2,133,-113,37.0,2019-02-02 23:00:00.000
13,14,2019-02-03 03:15:00,0,3.8,0,0,26.2,129,-112,46.3,2019-02-02 23:15:00.000
14,15,2019-02-03 03:30:00,0,3.8,0,0,26.2,126,-111,38.9,2019-02-02 23:30:00.000
15,16,2019-02-03 03:45:00,0,3.9,0,0,26.2,122,-110,11.1,2019-02-02 23:45:00.000
16,17,2019-02-03 04:00:00,0,3.9,0,0,26.2,119,-109,37.0,2019-02-03 00:00:00.000
17,18,2019-02-03 04:15:00,0,3.9,0,0,26.2,115,-109,37.0,2019-02-03 00:15:00.000
18,19,2019-02-03 04:30:00,0,4.0,0,0,26.2,111,-108,37.0,2019-02-03 00:30:00.000
19,20,2019-02-03 04:45:00,0,4.0,0,0,26.3,108,-108,37.0,2019-02-03 00:45:00.000
20,21,2019-02-03 05:00:00,0,4.0,0,0,26.3,104,-107,37.0,2019-02-03 01:00:00.000
21,22,2019-02-03 05:15:00,0,4.1,0,0,26.3,101,-107,36.7,2019-02-03 01:15:00.000
22,23,2019-02-03 05:30:00,0,4.1,0,0,26.4,97,-107,36.0,2019-02-03 01:30:00.000
23,24,2019-02-03 05:45:00,0,4.1,0,0,26.5,94,-107,36.4,2019-02-03 01:45:00.000
24,25,2019-02-03 06:00:00,1,4.2,0,1,26.5,90,-107,36.0,2019-02-03 02:00:00.000
25,26,2019-02-03 06:15:00,22,4.2,0,22,26.6,86,-107,30.9,2019-02-03 02:15:00.000
26,27,2019-02-03 06:30:00,65,4.2,64,56,26.6,83,-107,14.3,2019-02-03 02:30:00.000
27,28,2019-02-03 06:45:00,114,4.3,163,82,26.7,79,-108,12.6,2019-02-03 02:45:00.000
28,29,2019-02-03 07:00:00,187,4.3,454,73,26.8,76,-108,1.3,2019-02-03 03:00:00.000
29,30,2019-02-03 07:15:00,252,4.3,558,79,26.8,72,-108,0.0,2019-02-03 03:15:00.000
30,31,2019-02-03 07:30:00,315,4.3,621,87,26.9,69,-109,0.0,2019-02-03 03:30:00.000
31,32,2019-02-03 07:45:00,379,4.4,673,94,27.0,65,-109,0.0,2019-02-03 03:45:00.000
32,33,2019-02-03 08:00:00,441,4.4,715,99,27.0,61,-110,0.0,2019-02-03 04:00:00.000
33,34,2019-02-03 08:15:00,502,4.3,751,103,27.0,58,-111,0.0,2019-02-03 04:15:00.000
34,35,2019-02-03 08:30:00,561,4.3,782,106,27.0,54,-112,0.0,2019-02-03 04:30:00.000
35,36,2019-02-03 08:45:00,618,4.2,809,109,27.0,51,-113,0.0,2019-02-03 04:45:00.000
36,37,2019-02-03 09:00:00,585,4.2,471,268,26.9,48,-114,13.0,2019-02-03 05:00:00.000
37,38,2019-02-03 09:15:00,683,4.1,680,193,26.9,44,-116,5.8,2019-02-03 05:15:00.000
38,39,2019-02-03 09:30:00,745,4.0,763,168,26.9,41,-117,3.4,2019-02-03 05:30:00.000
39,40,2019-02-03 09:45:00,816,4.0,885,114,26.9,37,-120,0.0,2019-02-03 05:45:00.000
40,41,2019-02-03 10:00:00,856,3.9,897,114,26.9,34,-122,0.0,2019-02-03 06:00:00.000
41,42,2019-02-03 10:15:00,892,3.9,909,114,26.9,31,-126,0.0,2019-02-03 06:15:00.000
42,43,2019-02-03 10:30:00,879,3.8,763,207,26.9,28,-130,4.8,2019-02-03 06:30:00.000
43,44,2019-02-03 10:45:00,873,3.8,667,271,26.8,25,-135,8.0,2019-02-03 06:45:00.000
44,45,2019-02-03 11:00:00,875,3.8,616,308,26.8,23,-141,9.9,2019-02-03 07:00:00.000
45,46,2019-02-03 11:15:00,917,3.8,699,264,26.9,21,-149,7.1,2019-02-03 07:15:00.000
46,47,2019-02-03 11:30:00,907,3.9,635,307,26.9,19,-158,9.3,2019-02-03 07:30:00.000
47,48,2019-02-03 11:45:00,887,4.0,565,350,26.9,18,-169,11.9,2019-02-03 07:45:00.000
48,49,2019-02-03 12:00:00,828,4.1,400,447,26.9,18,179,18.1,2019-02-03 08:00:00.000
49,50,2019-02-03 12:15:00,964,4.1,796,208,26.9,18,168,4.3,2019-02-03 08:15:00.000
50,51,2019-02-03 12:30:00,960,4.2,802,202,27.0,19,157,4.1,2019-02-03 08:30:00.000
51,52,2019-02-03 12:45:00,885,4.3,612,312,27.0,21,148,10.5,2019-02-03 08:45:00.000
52,53,2019-02-03 13:00:00,778,4.4,354,452,27.0,23,140,19.9,2019-02-03 09:00:00.000
53,54,2019-02-03 13:15:00,753,4.5,345,441,27.0,26,134,20.7,2019-02-03 09:15:00.000
54,55,2019-02-03 13:30:00,616,4.5,74,551,27.0,28,129,33.2,2019-02-03 09:30:00.000
55,56,2019-02-03 13:45:00,672,4.6,247,463,27.1,31,125,24.4,2019-02-03 09:45:00.000
56,57,2019-02-03 14:00:00,725,4.7,456,350,27.1,35,122,15.1,2019-02-03 10:00:00.000
57,58,2019-02-03 14:15:00,573,4.8,125,474,27.1,38,119,29.6,2019-02-03 10:15:00.000
58,59,2019-02-03 14:30:00,619,4.9,335,367,27.1,41,117,19.6,2019-02-03 10:30:00.000
59,60,2019-02-03 14:45:00,642,5.0,533,262,27.1,44,115,11.2,2019-02-03 10:45:00.000
60,61,2019-02-03 15:00:00,609,5.1,573,225,27.2,48,114,9.3,2019-02-03 11:00:00.000
61,62,2019-02-03 15:15:00,544,5.2,491,237,27.2,51,112,12.0,2019-02-03 11:15:00.000
62,63,2019-02-03 15:30:00,429,5.3,209,307,27.2,55,111,23.7,2019-02-03 11:30:00.000
63,64,2019-02-03 15:45:00,393,5.4,234,270,27.2,58,110,21.8,2019-02-03 11:45:00.000
64,65,2019-02-03 16:00:00,361,5.5,293,223,27.2,62,110,18.2,2019-02-03 12:00:00.000
65,66,2019-02-03 16:15:00,279,5.6,118,230,27.2,65,109,26.4,2019-02-03 12:15:00.000
66,67,2019-02-03 16:30:00,204,5.7,21,196,27.3,69,108,35.9,2019-02-03 12:30:00.000
67,68,2019-02-03 16:45:00,164,5.8,0,164,27.3,72,108,35.7,2019-02-03 12:45:00.000
68,69,2019-02-03 17:00:00,121,5.8,0,121,27.3,76,108,36.7,2019-02-03 13:00:00.000
69,70,2019-02-03 17:15:00,79,5.9,0,79,27.3,80,107,40.8,2019-02-03 13:15:00.000
70,71,2019-02-03 17:30:00,47,5.9,0,47,27.2,83,107,36.6,2019-02-03 13:30:00.000
71,72,2019-02-03 17:45:00,27,5.9,53,22,27.2,87,107,7.2,2019-02-03 13:45:00.000
72,73,2019-02-03 18:00:00,2,6.0,6,2,27.2,90,107,0.0,2019-02-03 14:00:00.000
73,74,2019-02-03 18:15:00,0,6.0,0,0,27.2,94,107,0.0,2019-02-03 14:15:00.000
74,75,2019-02-03 18:30:00,0,6.0,0,0,27.1,98,107,0.0,2019-02-03 14:30:00.000
75,76,2019-02-03 18:45:00,0,6.0,0,0,27.1,101,107,0.0,2019-02-03 14:45:00.000
76,77,2019-02-03 19:00:00,0,6.1,0,0,27.1,105,107,0.0,2019-02-03 15:00:00.000
77,78,2019-02-03 19:15:00,0,6.1,0,0,27.1,108,108,0.0,2019-02-03 15:15:00.000
78,79,2019-02-03 19:30:00,0,6.1,0,0,27.0,112,108,0.0,2019-02-03 15:30:00.000
79,80,2019-02-03 19:45:00,0,6.1,0,0,27.0,115,108,0.0,2019-02-03 15:45:00.000
80,81,2019-02-03 20:00:00,0,6.2,0,0,27.0,119,109,0.0,2019-02-03 16:00:00.000
81,82,2019-02-03 20:15:00,0,6.2,0,0,27.0,123,110,0.0,2019-02-03 16:15:00.000
82,83,2019-02-03 20:30:00,0,6.2,0,0,27.0,126,111,0.0,2019-02-03 16:30:00.000
83,84,2019-02-03 20:45:00,0,6.2,0,0,27.0,130,112,0.0,2019-02-03 16:45:00.000
84,85,2019-02-03 21:00:00,0,6.2,0,0,26.9,133,113,0.0,2019-02-03 17:00:00.000
85,86,2019-02-03 21:15:00,0,6.2,0,0,26.9,136,114,0.0,2019-02-03 17:15:00.000
86,87,2019-02-03 21:30:00,0,6.2,0,0,26.9,140,116,0.0,2019-02-03 17:30:00.000
87,88,2019-02-03 21:45:00,0,6.2,0,0,26.9,143,118,0.0,2019-02-03 17:45:00.000
88,89,2019-02-03 22:00:00,0,6.2,0,0,26.9,146,121,0.0,2019-02-03 18:00:00.000
89,90,2019-02-03 22:15:00,0,6.2,0,0,26.9,150,124,0.0,2019-02-03 18:15:00.000
90,91,2019-02-03 22:30:00,0,6.2,0,0,26.8,153,128,0.0,2019-02-03 18:30:00.000
91,92,2019-02-03 22:45:00,0,6.2,0,0,26.8,156,133,0.0,2019-02-03 18:45:00.000
92,93,2019-02-03 23:00:00,0,6.2,0,0,26.8,158,139,0.0,2019-02-03 19:00:00.000
93,94,2019-02-03 23:15:00,0,6.1,0,0,26.8,160,147,0.0,2019-02-03 19:15:00.000
94,95,2019-02-03 23:30:00,0,6.0,0,0,26.7,162,157,0.0,2019-02-03 19:30:00.000
95,96,2019-02-03 23:45:00,0,5.9,0,0,26.7,163,168,0.0,2019-02-03 19:45:00.000
