,BLOCK_ID,DATA_DATETIME,GHI,WIND_SPEED,DNI,DHI,TEMPERATURE,ZENITH,AZIMUTH,CLOUD_OPACITY,ENTRY_TIME
0,1,2021-07-26 00:00:00,0,1.5,0,0,22.9,159,-5,15.0,2021-07-25 20:00:00.000
1,2,2021-07-26 00:15:00,0,1.5,0,0,22.9,159,-15,0.0,2021-07-25 20:15:00.000
2,3,2021-07-26 00:30:00,0,1.5,0,0,22.9,157,-24,0.0,2021-07-25 20:30:00.000
3,4,2021-07-26 00:45:00,0,1.5,0,0,22.8,156,-31,0.0,2021-07-25 20:45:00.000
4,5,2021-07-26 01:00:00,0,1.5,0,0,22.8,154,-38,12.0,2021-07-25 21:00:00.000
5,6,2021-07-26 01:15:00,0,1.4,0,0,22.8,151,-44,13.7,2021-07-25 21:15:00.000
6,7,2021-07-26 01:30:00,0,1.4,0,0,22.7,148,-48,13.0,2021-07-25 21:30:00.000
7,8,2021-07-26 01:45:00,0,1.4,0,0,22.7,146,-52,11.2,2021-07-25 21:45:00.000
8,9,2021-07-26 02:00:00,0,1.4,0,0,22.6,143,-55,0.0,2021-07-25 22:00:00.000
9,10,2021-07-26 02:15:00,0,1.4,0,0,22.6,139,-58,15.9,2021-07-25 22:15:00.000
10,11,2021-07-26 02:30:00,0,1.4,0,0,22.6,136,-60,16.4,2021-07-25 22:30:00.000
11,12,2021-07-26 02:45:00,0,1.4,0,0,22.5,133,-62,13.7,2021-07-25 22:45:00.000
12,13,2021-07-26 03:00:00,0,1.4,0,0,22.5,130,-63,17.0,2021-07-25 23:00:00.000
13,14,2021-07-26 03:15:00,0,1.4,0,0,22.5,126,-65,15.7,2021-07-25 23:15:00.000
14,15,2021-07-26 03:30:00,0,1.4,0,0,22.5,123,-66,13.4,2021-07-25 23:30:00.000
15,16,2021-07-26 03:45:00,0,1.4,0,0,22.5,119,-67,15.5,2021-07-25 23:45:00.000
16,17,2021-07-26 04:00:00,0,1.4,0,0,22.4,116,-67,16.6,2021-07-26 00:00:00.000
17,18,2021-07-26 04:15:00,0,1.4,0,0,22.4,113,-68,13.6,2021-07-26 00:15:00.000
18,19,2021-07-26 04:30:00,0,1.4,0,0,22.4,109,-69,14.2,2021-07-26 00:30:00.000
19,20,2021-07-26 04:45:00,0,1.4,0,0,22.4,106,-69,14.4,2021-07-26 00:45:00.000
20,21,2021-07-26 05:00:00,0,1.4,0,0,22.4,102,-70,12.2,2021-07-26 01:00:00.000
21,22,2021-07-26 05:15:00,0,1.4,0,0,22.4,99,-70,0.0,2021-07-26 01:15:00.000
22,23,2021-07-26 05:30:00,0,1.5,0,0,22.4,95,-70,9.6,2021-07-26 01:30:00.000
23,24,2021-07-26 05:45:00,0,1.5,0,0,22.4,91,-70,12.3,2021-07-26 01:45:00.000
24,25,2021-07-26 06:00:00,14,1.5,0,14,22.5,88,-70,12.2,2021-07-26 02:00:00.000
25,26,2021-07-26 06:15:00,50,1.5,151,33,22.9,84,-70,6.3,2021-07-26 02:15:00.000
26,27,2021-07-26 06:30:00,92,1.5,233,56,23.3,81,-70,7.2,2021-07-26 02:30:00.000
27,28,2021-07-26 06:45:00,152,1.5,450,53,23.6,77,-70,0.0,2021-07-26 02:45:00.000
28,29,2021-07-26 07:00:00,193,1.5,370,91,24.1,74,-69,7.2,2021-07-26 03:00:00.000
29,30,2021-07-26 07:15:00,265,1.8,580,70,24.6,70,-69,0.0,2021-07-26 03:15:00.000
30,31,2021-07-26 07:30:00,322,2.0,626,76,25.1,67,-69,0.0,2021-07-26 03:30:00.000
31,32,2021-07-26 07:45:00,379,2.2,664,81,25.7,63,-68,0.0,2021-07-26 03:45:00.000
32,33,2021-07-26 08:00:00,435,2.5,695,86,26.2,60,-67,0.0,2021-07-26 04:00:00.000
33,34,2021-07-26 08:15:00,489,2.6,722,90,26.5,56,-66,0.0,2021-07-26 04:15:00.000
34,35,2021-07-26 08:30:00,484,2.8,476,200,26.9,53,-65,10.4,2021-07-26 04:30:00.000
35,36,2021-07-26 08:45:00,485,2.9,310,283,27.2,50,-64,18.1,2021-07-26 04:45:00.000
36,37,2021-07-26 09:00:00,475,3.1,175,355,27.6,46,-63,25.6,2021-07-26 05:00:00.000
37,38,2021-07-26 09:15:00,543,3.1,278,339,27.9,43,-61,20.6,2021-07-26 05:15:00.000
38,39,2021-07-26 09:30:00,639,3.2,483,267,28.2,40,-59,11.8,2021-07-26 05:30:00.000
39,40,2021-07-26 09:45:00,648,3.2,410,318,28.5,37,-56,15.1,2021-07-26 05:45:00.000
40,41,2021-07-26 10:00:00,776,3.3,754,147,28.8,33,-53,2.6,2021-07-26 06:00:00.000
41,42,2021-07-26 10:15:00,729,3.3,501,296,29.0,31,-50,11.9,2021-07-26 06:15:00.000
42,43,2021-07-26 10:30:00,787,3.3,612,246,29.2,28,-45,7.8,2021-07-26 06:30:00.000
43,44,2021-07-26 10:45:00,807,3.4,616,250,29.3,25,-39,7.8,2021-07-26 06:45:00.000
44,45,2021-07-26 11:00:00,881,3.4,806,138,29.5,23,-33,1.4,2021-07-26 07:00:00.000
45,46,2021-07-26 11:15:00,849,3.4,667,227,29.6,21,-25,6.3,2021-07-26 07:15:00.000
46,47,2021-07-26 11:30:00,871,3.4,709,205,29.6,20,-15,4.8,2021-07-26 07:30:00.000
47,48,2021-07-26 11:45:00,881,3.4,728,194,29.7,19,-5,4.2,2021-07-26 07:45:00.000
48,49,2021-07-26 12:00:00,920,3.4,854,114,29.8,19,6,0.0,2021-07-26 08:00:00.000
49,50,2021-07-26 12:15:00,915,3.4,854,113,29.8,20,16,0.0,2021-07-26 08:15:00.000
50,51,2021-07-26 12:30:00,907,3.4,853,112,29.8,21,25,0.0,2021-07-26 08:30:00.000
51,52,2021-07-26 12:45:00,893,3.3,851,111,29.8,23,33,0.0,2021-07-26 08:45:00.000
52,53,2021-07-26 13:00:00,876,3.3,848,109,29.8,25,40,0.0,2021-07-26 09:00:00.000
53,54,2021-07-26 13:15:00,853,3.3,844,108,29.8,28,45,0.0,2021-07-26 09:15:00.000
54,55,2021-07-26 13:30:00,827,3.4,838,107,29.7,31,50,0.0,2021-07-26 09:30:00.000
55,56,2021-07-26 13:45:00,796,3.4,828,106,29.7,34,53,0.0,2021-07-26 09:45:00.000
56,57,2021-07-26 14:00:00,761,3.4,817,106,29.6,37,56,0.0,2021-07-26 10:00:00.000
57,58,2021-07-26 14:15:00,723,3.4,805,105,29.5,40,59,0.0,2021-07-26 10:15:00.000
58,59,2021-07-26 14:30:00,681,3.4,792,103,29.3,43,61,0.0,2021-07-26 10:30:00.000
59,60,2021-07-26 14:45:00,637,3.3,778,100,29.1,46,63,0.0,2021-07-26 10:45:00.000
60,61,2021-07-26 15:00:00,590,3.3,763,97,28.9,50,64,0.0,2021-07-26 11:00:00.000
61,62,2021-07-26 15:15:00,540,3.2,744,93,28.7,53,66,0.0,2021-07-26 11:15:00.000
62,63,2021-07-26 15:30:00,487,3.2,723,89,28.4,57,67,0.0,2021-07-26 11:30:00.000
63,64,2021-07-26 15:45:00,433,3.1,697,85,28.2,60,67,0.0,2021-07-26 11:45:00.000
64,65,2021-07-26 16:00:00,377,3.0,667,80,27.9,64,68,0.0,2021-07-26 12:00:00.000
65,66,2021-07-26 16:15:00,321,2.8,630,74,27.6,67,69,0.0,2021-07-26 12:15:00.000
66,67,2021-07-26 16:30:00,263,2.7,586,68,27.2,71,69,0.0,2021-07-26 12:30:00.000
67,68,2021-07-26 16:45:00,207,2.5,530,60,26.9,74,70,0.0,2021-07-26 12:45:00.000
68,69,2021-07-26 17:00:00,151,2.4,459,51,26.5,78,70,0.0,2021-07-26 13:00:00.000
69,70,2021-07-26 17:15:00,98,2.3,366,41,26.0,81,70,0.0,2021-07-26 13:15:00.000
70,71,2021-07-26 17:30:00,48,2.1,145,33,25.5,85,70,7.2,2021-07-26 13:30:00.000
71,72,2021-07-26 17:45:00,12,2.0,0,12,24.9,88,70,15.9,2021-07-26 13:45:00.000
72,73,2021-07-26 18:00:00,0,1.9,0,0,24.5,92,70,18.0,2021-07-26 14:00:00.000
73,74,2021-07-26 18:15:00,0,1.8,0,0,24.2,95,70,19.0,2021-07-26 14:15:00.000
74,75,2021-07-26 18:30:00,0,1.7,0,0,24.0,99,70,19.0,2021-07-26 14:30:00.000
75,76,2021-07-26 18:45:00,0,1.6,0,0,23.7,102,70,19.3,2021-07-26 14:45:00.000
76,77,2021-07-26 19:00:00,0,1.6,0,0,23.5,106,69,19.2,2021-07-26 15:00:00.000
77,78,2021-07-26 19:15:00,0,1.6,0,0,23.4,109,69,19.0,2021-07-26 15:15:00.000
78,79,2021-07-26 19:30:00,0,1.6,0,0,23.4,113,68,19.0,2021-07-26 15:30:00.000
79,80,2021-07-26 19:45:00,0,1.5,0,0,23.3,116,68,20.0,2021-07-26 15:45:00.000
80,81,2021-07-26 20:00:00,0,1.5,0,0,23.2,120,67,13.6,2021-07-26 16:00:00.000
81,82,2021-07-26 20:15:00,0,1.5,0,0,23.2,123,66,12.0,2021-07-26 16:15:00.000
82,83,2021-07-26 20:30:00,0,1.5,0,0,23.1,126,65,12.0,2021-07-26 16:30:00.000
83,84,2021-07-26 20:45:00,0,1.5,0,0,23.1,130,63,10.0,2021-07-26 16:45:00.000
84,85,2021-07-26 21:00:00,0,1.5,0,0,23.0,133,62,11.6,2021-07-26 17:00:00.000
85,86,2021-07-26 21:15:00,0,1.5,0,0,23.0,136,60,12.0,2021-07-26 17:15:00.000
86,87,2021-07-26 21:30:00,0,1.5,0,0,22.9,140,58,12.0,2021-07-26 17:30:00.000
87,88,2021-07-26 21:45:00,0,1.5,0,0,22.9,143,55,14.7,2021-07-26 17:45:00.000
88,89,2021-07-26 22:00:00,0,1.5,0,0,22.8,146,52,14.0,2021-07-26 18:00:00.000
89,90,2021-07-26 22:15:00,0,1.5,0,0,22.8,149,48,15.0,2021-07-26 18:15:00.000
90,91,2021-07-26 22:30:00,0,1.5,0,0,22.7,151,44,15.0,2021-07-26 18:30:00.000
91,92,2021-07-26 22:45:00,0,1.5,0,0,22.7,154,38,15.0,2021-07-26 18:45:00.000
92,93,2021-07-26 23:00:00,0,1.5,0,0,22.6,156,31,13.4,2021-07-26 19:00:00.000
93,94,2021-07-26 23:15:00,0,1.5,0,0,22.6,158,24,14.0,2021-07-26 19:15:00.000
94,95,2021-07-26 23:30:00,0,1.5,0,0,22.6,159,15,13.2,2021-07-26 19:30:00.000
95,96,2021-07-26 23:45:00,0,1.5,0,0,22.6,160,5,14.0,2021-07-26 19:45:00.000
