,BLOCK_ID,DATA_DATETIME,GHI,WIND_SPEED,DNI,DHI,TEMPERATURE,ZENITH,AZIMUTH,CLOUD_OPACITY,ENTRY_TIME
0,1,2020-10-02 00:00:00,0,1.0,0,0,23.5,173,-112,25.4,2020-10-01 20:00:00.000
1,2,2020-10-02 00:15:00,0,1.0,0,0,23.4,170,-104,23.8,2020-10-01 20:15:00.000
2,3,2020-10-02 00:30:00,0,1.0,0,0,23.4,166,-101,21.0,2020-10-01 20:30:00.000
3,4,2020-10-02 00:45:00,0,0.9,0,0,23.3,162,-98,33.1,2020-10-01 20:45:00.000
4,5,2020-10-02 01:00:00,0,0.9,0,0,23.3,159,-97,20.8,2020-10-01 21:00:00.000
5,6,2020-10-02 01:15:00,0,0.9,0,0,23.3,155,-96,21.5,2020-10-01 21:15:00.000
6,7,2020-10-02 01:30:00,0,0.9,0,0,23.3,151,-95,41.0,2020-10-01 21:30:00.000
7,8,2020-10-02 01:45:00,0,0.9,0,0,23.3,147,-95,44.4,2020-10-01 21:45:00.000
8,9,2020-10-02 02:00:00,0,0.9,0,0,23.2,144,-94,42.2,2020-10-01 22:00:00.000
9,10,2020-10-02 02:15:00,0,0.9,0,0,23.2,140,-94,46.5,2020-10-01 22:15:00.000
10,11,2020-10-02 02:30:00,0,0.9,0,0,23.1,136,-94,28.8,2020-10-01 22:30:00.000
11,12,2020-10-02 02:45:00,0,0.9,0,0,23.1,132,-94,40.3,2020-10-01 22:45:00.000
12,13,2020-10-02 03:00:00,0,0.9,0,0,23.0,129,-94,50.6,2020-10-01 23:00:00.000
13,14,2020-10-02 03:15:00,0,0.8,0,0,23.0,125,-93,23.5,2020-10-01 23:15:00.000
14,15,2020-10-02 03:30:00,0,0.8,0,0,22.9,121,-93,36.0,2020-10-01 23:30:00.000
15,16,2020-10-02 03:45:00,0,0.7,0,0,22.9,117,-93,20.1,2020-10-01 23:45:00.000
16,17,2020-10-02 04:00:00,0,0.7,0,0,22.9,114,-93,16.4,2020-10-02 00:00:00.000
17,18,2020-10-02 04:15:00,0,0.7,0,0,22.9,110,-93,14.3,2020-10-02 00:15:00.000
18,19,2020-10-02 04:30:00,0,0.7,0,0,22.9,106,-93,28.6,2020-10-02 00:30:00.000
19,20,2020-10-02 04:45:00,0,0.8,0,0,22.9,102,-93,92.3,2020-10-02 00:45:00.000
20,21,2020-10-02 05:00:00,0,0.8,0,0,22.9,99,-93,87.4,2020-10-02 01:00:00.000
21,22,2020-10-02 05:15:00,0,0.8,0,0,23.0,95,-93,88.3,2020-10-02 01:15:00.000
22,23,2020-10-02 05:30:00,0,0.8,0,0,23.1,91,-93,94.6,2020-10-02 01:30:00.000
23,24,2020-10-02 05:45:00,4,0.8,0,4,23.1,88,-93,88.0,2020-10-02 01:45:00.000
24,25,2020-10-02 06:00:00,33,0.8,0,33,23.3,84,-93,47.8,2020-10-02 02:00:00.000
25,26,2020-10-02 06:15:00,64,0.8,0,64,23.8,80,-93,43.1,2020-10-02 02:15:00.000
26,27,2020-10-02 06:30:00,120,0.9,8,118,24.3,76,-93,29.8,2020-10-02 02:30:00.000
27,28,2020-10-02 06:45:00,167,0.9,31,158,24.8,73,-94,27.2,2020-10-02 02:45:00.000
28,29,2020-10-02 07:00:00,214,1.0,61,191,25.3,69,-94,26.8,2020-10-02 03:00:00.000
29,30,2020-10-02 07:15:00,326,1.2,445,139,25.8,65,-94,7.6,2020-10-02 03:15:00.000
30,31,2020-10-02 07:30:00,408,1.6,624,107,26.4,61,-94,1.8,2020-10-02 03:30:00.000
31,32,2020-10-02 07:45:00,475,1.9,699,100,26.9,58,-94,0.0,2020-10-02 03:45:00.000
32,33,2020-10-02 08:00:00,535,2.1,727,105,27.4,54,-94,0.0,2020-10-02 04:00:00.000
33,34,2020-10-02 08:15:00,554,2.2,580,180,27.6,50,-95,6.3,2020-10-02 04:15:00.000
34,35,2020-10-02 08:30:00,613,2.3,634,176,27.9,46,-95,4.8,2020-10-02 04:30:00.000
35,36,2020-10-02 08:45:00,592,2.4,394,303,28.1,43,-96,14.8,2020-10-02 04:45:00.000
36,37,2020-10-02 09:00:00,608,2.5,324,355,28.3,39,-96,18.2,2020-10-02 05:00:00.000
37,38,2020-10-02 09:15:00,614,2.5,249,410,28.5,35,-97,22.0,2020-10-02 05:15:00.000
38,39,2020-10-02 09:30:00,605,2.6,161,468,28.7,31,-97,26.8,2020-10-02 05:30:00.000
39,40,2020-10-02 09:45:00,613,2.7,130,496,28.8,28,-98,29.1,2020-10-02 05:45:00.000
40,41,2020-10-02 10:00:00,673,2.7,207,484,29.0,24,-100,24.8,2020-10-02 06:00:00.000
41,42,2020-10-02 10:15:00,737,2.7,309,447,29.2,20,-101,20.1,2020-10-02 06:15:00.000
42,43,2020-10-02 10:30:00,775,2.7,358,432,29.3,17,-104,18.0,2020-10-02 06:30:00.000
43,44,2020-10-02 10:45:00,845,2.7,500,358,29.5,13,-108,12.3,2020-10-02 06:45:00.000
44,45,2020-10-02 11:00:00,763,2.7,282,486,29.6,9,-115,21.8,2020-10-02 07:00:00.000
45,46,2020-10-02 11:15:00,720,2.7,178,543,29.6,6,-130,26.8,2020-10-02 07:15:00.000
46,47,2020-10-02 11:30:00,890,2.8,563,329,29.6,4,-165,9.8,2020-10-02 07:30:00.000
47,48,2020-10-02 11:45:00,882,2.8,542,342,29.7,5,148,10.5,2020-10-02 07:45:00.000
48,49,2020-10-02 12:00:00,919,2.9,659,266,29.7,8,122,6.2,2020-10-02 08:00:00.000
49,50,2020-10-02 12:15:00,918,3.0,684,246,29.7,11,112,5.3,2020-10-02 08:15:00.000
50,51,2020-10-02 12:30:00,942,3.1,805,163,29.6,14,106,1.2,2020-10-02 08:30:00.000
51,52,2020-10-02 12:45:00,934,3.2,837,138,29.6,18,103,0.0,2020-10-02 08:45:00.000
52,53,2020-10-02 13:00:00,909,3.2,833,136,29.6,22,101,0.0,2020-10-02 09:00:00.000
53,54,2020-10-02 13:15:00,868,3.1,783,160,29.6,25,99,1.5,2020-10-02 09:15:00.000
54,55,2020-10-02 13:30:00,663,3.0,272,424,29.6,29,98,21.8,2020-10-02 09:30:00.000
55,56,2020-10-02 13:45:00,432,2.9,0,432,29.5,33,97,46.5,2020-10-02 09:45:00.000
56,57,2020-10-02 14:00:00,479,2.7,0,479,29.5,37,96,37.4,2020-10-02 10:00:00.000
57,58,2020-10-02 14:15:00,505,2.6,97,433,29.4,40,96,29.6,2020-10-02 10:15:00.000
58,59,2020-10-02 14:30:00,646,2.5,659,174,29.3,44,95,3.4,2020-10-02 10:30:00.000
59,60,2020-10-02 14:45:00,596,2.4,634,167,29.2,48,95,3.6,2020-10-02 10:45:00.000
60,61,2020-10-02 15:00:00,526,2.3,536,193,29.1,51,95,6.4,2020-10-02 11:00:00.000
61,62,2020-10-02 15:15:00,352,2.2,39,330,28.9,55,95,30.3,2020-10-02 11:15:00.000
62,63,2020-10-02 15:30:00,375,2.1,290,227,28.7,59,94,15.8,2020-10-02 11:30:00.000
63,64,2020-10-02 15:45:00,325,2.0,269,199,28.5,63,94,16.3,2020-10-02 11:45:00.000
64,65,2020-10-02 16:00:00,188,1.9,0,188,28.2,66,94,42.2,2020-10-02 12:00:00.000
65,66,2020-10-02 16:15:00,146,1.8,0,146,27.9,70,94,44.1,2020-10-02 12:15:00.000
66,67,2020-10-02 16:30:00,122,1.7,0,122,27.6,74,94,39.8,2020-10-02 12:30:00.000
67,68,2020-10-02 16:45:00,102,1.7,15,99,27.3,78,94,29.3,2020-10-02 12:45:00.000
68,69,2020-10-02 17:00:00,51,1.6,0,51,26.9,81,94,41.6,2020-10-02 13:00:00.000
69,70,2020-10-02 17:15:00,20,1.6,0,20,26.5,85,93,48.3,2020-10-02 13:15:00.000
70,71,2020-10-02 17:30:00,5,1.5,0,5,26.0,89,93,35.0,2020-10-02 13:30:00.000
71,72,2020-10-02 17:45:00,0,1.5,0,0,25.6,93,93,45.4,2020-10-02 13:45:00.000
72,73,2020-10-02 18:00:00,0,1.5,0,0,25.2,96,93,61.2,2020-10-02 14:00:00.000
73,74,2020-10-02 18:15:00,0,1.5,0,0,25.1,100,93,76.5,2020-10-02 14:15:00.000
74,75,2020-10-02 18:30:00,0,1.5,0,0,24.9,104,93,59.2,2020-10-02 14:30:00.000
75,76,2020-10-02 18:45:00,0,1.5,0,0,24.8,108,93,52.4,2020-10-02 14:45:00.000
76,77,2020-10-02 19:00:00,0,1.5,0,0,24.6,111,93,91.9,2020-10-02 15:00:00.000
77,78,2020-10-02 19:15:00,0,1.4,0,0,24.5,115,94,91.4,2020-10-02 15:15:00.000
78,79,2020-10-02 19:30:00,0,1.2,0,0,24.4,119,94,87.6,2020-10-02 15:30:00.000
79,80,2020-10-02 19:45:00,0,1.1,0,0,24.3,123,94,96.0,2020-10-02 15:45:00.000
80,81,2020-10-02 20:00:00,0,1.0,0,0,24.2,126,94,96.0,2020-10-02 16:00:00.000
81,82,2020-10-02 20:15:00,0,1.1,0,0,24.2,130,94,92.5,2020-10-02 16:15:00.000
82,83,2020-10-02 20:30:00,0,1.1,0,0,24.1,134,94,81.8,2020-10-02 16:30:00.000
83,84,2020-10-02 20:45:00,0,1.2,0,0,24.1,138,94,92.8,2020-10-02 16:45:00.000
84,85,2020-10-02 21:00:00,0,1.2,0,0,24.0,141,95,90.2,2020-10-02 17:00:00.000
85,86,2020-10-02 21:15:00,0,1.1,0,0,24.0,145,95,96.1,2020-10-02 17:15:00.000
86,87,2020-10-02 21:30:00,0,1.0,0,0,23.9,149,96,96.4,2020-10-02 17:30:00.000
87,88,2020-10-02 21:45:00,0,0.9,0,0,23.9,152,96,96.7,2020-10-02 17:45:00.000
88,89,2020-10-02 22:00:00,0,0.8,0,0,23.8,156,97,96.8,2020-10-02 18:00:00.000
89,90,2020-10-02 22:15:00,0,0.8,0,0,23.7,160,98,85.0,2020-10-02 18:15:00.000
90,91,2020-10-02 22:30:00,0,0.7,0,0,23.7,164,100,70.6,2020-10-02 18:30:00.000
91,92,2020-10-02 22:45:00,0,0.7,0,0,23.6,167,103,81.0,2020-10-02 18:45:00.000
92,93,2020-10-02 23:00:00,0,0.7,0,0,23.5,171,109,85.6,2020-10-02 19:00:00.000
93,94,2020-10-02 23:15:00,0,0.7,0,0,23.5,174,122,91.8,2020-10-02 19:15:00.000
94,95,2020-10-02 23:30:00,0,0.7,0,0,23.4,177,161,96.8,2020-10-02 19:30:00.000
95,96,2020-10-02 23:45:00,0,0.7,0,0,23.4,176,-140,94.5,2020-10-02 19:45:00.000
