,BLOCK_ID,DATA_DATETIME,GHI,WIND_SPEED,DNI,DHI,TEMPERATURE,ZENITH,AZIMUTH,CLOUD_OPACITY,ENTRY_TIME
0,1,2019-01-04 00:00:00,0,5.4,0,0,26.5,158,-174,39.3,2019-01-03 20:00:00.000
1,2,2019-01-04 00:15:00,0,5.4,0,0,26.4,157,-165,36.5,2019-01-03 20:15:00.000
2,3,2019-01-04 00:30:00,0,5.3,0,0,26.3,156,-157,37.9,2019-01-03 20:30:00.000
3,4,2019-01-04 00:45:00,0,5.3,0,0,26.3,154,-150,36.5,2019-01-03 20:45:00.000
4,5,2019-01-04 01:00:00,0,5.3,0,0,26.2,152,-144,37.9,2019-01-03 21:00:00.000
5,6,2019-01-04 01:15:00,0,5.2,0,0,26.2,150,-139,36.5,2019-01-03 21:15:00.000
6,7,2019-01-04 01:30:00,0,5.2,0,0,26.1,147,-134,36.5,2019-01-03 21:30:00.000
7,8,2019-01-04 01:45:00,0,5.2,0,0,26.0,144,-131,36.5,2019-01-03 21:45:00.000
8,9,2019-01-04 02:00:00,0,5.1,0,0,26.0,141,-128,38.2,2019-01-03 22:00:00.000
9,10,2019-01-04 02:15:00,0,5.1,0,0,26.0,138,-125,38.7,2019-01-03 22:15:00.000
10,11,2019-01-04 02:30:00,0,5.0,0,0,26.0,135,-123,38.7,2019-01-03 22:30:00.000
11,12,2019-01-04 02:45:00,0,5.0,0,0,26.0,132,-121,38.7,2019-01-03 22:45:00.000
12,13,2019-01-04 03:00:00,0,5.0,0,0,25.9,129,-119,38.7,2019-01-03 23:00:00.000
13,14,2019-01-04 03:15:00,0,4.9,0,0,25.9,125,-118,38.7,2019-01-03 23:15:00.000
14,15,2019-01-04 03:30:00,0,4.9,0,0,25.9,122,-117,39.4,2019-01-03 23:30:00.000
15,16,2019-01-04 03:45:00,0,4.8,0,0,25.9,119,-116,39.4,2019-01-03 23:45:00.000
16,17,2019-01-04 04:00:00,0,4.8,0,0,25.9,115,-115,39.0,2019-01-04 00:00:00.000
17,18,2019-01-04 04:15:00,0,4.8,0,0,25.9,112,-115,38.0,2019-01-04 00:15:00.000
18,19,2019-01-04 04:30:00,0,4.7,0,0,25.8,108,-114,39.2,2019-01-04 00:30:00.000
19,20,2019-01-04 04:45:00,0,4.7,0,0,25.8,105,-114,39.0,2019-01-04 00:45:00.000
20,21,2019-01-04 05:00:00,0,4.6,0,0,25.8,102,-113,39.8,2019-01-04 01:00:00.000
21,22,2019-01-04 05:15:00,0,4.6,0,0,25.9,98,-113,40.0,2019-01-04 01:15:00.000
22,23,2019-01-04 05:30:00,0,4.5,0,0,25.9,95,-113,37.8,2019-01-04 01:30:00.000
23,24,2019-01-04 05:45:00,0,4.5,0,0,26.0,91,-113,32.2,2019-01-04 01:45:00.000
24,25,2019-01-04 06:00:00,11,4.4,0,11,26.0,88,-113,33.7,2019-01-04 02:00:00.000
25,26,2019-01-04 06:15:00,42,4.4,0,42,26.1,84,-113,25.8,2019-01-04 02:15:00.000
26,27,2019-01-04 06:30:00,83,4.3,26,78,26.1,81,-113,22.5,2019-01-04 02:30:00.000
27,28,2019-01-04 06:45:00,138,4.3,186,98,26.1,77,-114,14.0,2019-01-04 02:45:00.000
28,29,2019-01-04 07:00:00,187,4.3,218,127,26.2,74,-114,15.0,2019-01-04 03:00:00.000
29,30,2019-01-04 07:15:00,224,4.2,165,168,26.2,71,-115,20.0,2019-01-04 03:15:00.000
30,31,2019-01-04 07:30:00,298,4.2,346,164,26.3,67,-115,12.2,2019-01-04 03:30:00.000
31,32,2019-01-04 07:45:00,383,4.1,573,129,26.3,64,-116,4.2,2019-01-04 03:45:00.000
32,33,2019-01-04 08:00:00,457,4.1,716,105,26.4,61,-117,0.0,2019-01-04 04:00:00.000
33,34,2019-01-04 08:15:00,513,4.1,744,111,26.3,57,-118,0.0,2019-01-04 04:15:00.000
34,35,2019-01-04 08:30:00,563,4.1,739,128,26.3,54,-119,1.0,2019-01-04 04:30:00.000
35,36,2019-01-04 08:45:00,615,4.1,762,133,26.3,51,-121,0.9,2019-01-04 04:45:00.000
36,37,2019-01-04 09:00:00,638,4.0,661,192,26.2,48,-123,4.8,2019-01-04 05:00:00.000
37,38,2019-01-04 09:15:00,672,4.0,630,221,26.2,44,-125,6.3,2019-01-04 05:15:00.000
38,39,2019-01-04 09:30:00,666,4.0,478,308,26.2,41,-127,12.2,2019-01-04 05:30:00.000
39,40,2019-01-04 09:45:00,630,4.0,298,394,26.1,38,-130,21.2,2019-01-04 05:45:00.000
40,41,2019-01-04 10:00:00,813,4.0,769,188,26.1,36,-133,2.4,2019-01-04 06:00:00.000
41,42,2019-01-04 10:15:00,862,4.0,843,155,26.1,33,-137,0.2,2019-01-04 06:15:00.000
42,43,2019-01-04 10:30:00,888,4.0,846,159,26.1,31,-142,0.2,2019-01-04 06:30:00.000
43,44,2019-01-04 10:45:00,846,4.0,636,287,26.0,28,-147,7.2,2019-01-04 06:45:00.000
44,45,2019-01-04 11:00:00,776,4.0,385,431,26.0,26,-153,16.6,2019-01-04 07:00:00.000
45,46,2019-01-04 11:15:00,888,4.0,681,270,26.0,25,-161,5.9,2019-01-04 07:15:00.000
46,47,2019-01-04 11:30:00,952,4.1,864,162,26.1,24,-169,0.0,2019-01-04 07:30:00.000
47,48,2019-01-04 11:45:00,826,4.1,489,378,26.1,24,-177,13.5,2019-01-04 07:45:00.000
48,49,2019-01-04 12:00:00,656,4.2,71,591,26.2,24,174,31.3,2019-01-04 08:00:00.000
49,50,2019-01-04 12:15:00,703,4.2,173,546,26.2,24,166,25.8,2019-01-04 08:15:00.000
50,51,2019-01-04 12:30:00,755,4.3,314,472,26.3,25,158,19.4,2019-01-04 08:30:00.000
51,52,2019-01-04 12:45:00,762,4.3,357,445,26.3,27,151,17.3,2019-01-04 08:45:00.000
52,53,2019-01-04 13:00:00,723,4.4,294,466,26.3,29,145,19.9,2019-01-04 09:00:00.000
53,54,2019-01-04 13:15:00,779,4.4,505,348,26.4,31,140,11.3,2019-01-04 09:15:00.000
54,55,2019-01-04 13:30:00,790,4.5,617,278,26.4,34,136,7.0,2019-01-04 09:30:00.000
55,56,2019-01-04 13:45:00,786,4.6,706,219,26.5,37,132,3.8,2019-01-04 09:45:00.000
56,57,2019-01-04 14:00:00,774,4.6,786,166,26.5,39,129,0.9,2019-01-04 10:00:00.000
57,58,2019-01-04 14:15:00,741,4.7,806,146,26.6,42,126,0.0,2019-01-04 10:15:00.000
58,59,2019-01-04 14:30:00,650,4.8,596,231,26.6,45,124,6.8,2019-01-04 10:30:00.000
59,60,2019-01-04 14:45:00,496,4.8,240,342,26.7,49,122,23.3,2019-01-04 10:45:00.000
60,61,2019-01-04 15:00:00,505,4.9,354,284,26.7,52,120,15.9,2019-01-04 11:00:00.000
61,62,2019-01-04 15:15:00,424,5.0,199,308,26.8,55,119,22.6,2019-01-04 11:15:00.000
62,63,2019-01-04 15:30:00,359,5.0,102,307,26.8,58,118,26.7,2019-01-04 11:30:00.000
63,64,2019-01-04 15:45:00,332,5.1,147,263,26.9,62,117,23.3,2019-01-04 11:45:00.000
64,65,2019-01-04 16:00:00,296,5.2,170,224,26.9,65,116,21.3,2019-01-04 12:00:00.000
65,66,2019-01-04 16:15:00,268,5.2,265,171,27.0,68,115,15.2,2019-01-04 12:15:00.000
66,67,2019-01-04 16:30:00,193,5.3,72,169,27.0,72,114,25.1,2019-01-04 12:30:00.000
67,68,2019-01-04 16:45:00,122,5.4,0,122,27.1,75,114,39.2,2019-01-04 12:45:00.000
68,69,2019-01-04 17:00:00,64,5.4,0,64,27.1,79,113,54.5,2019-01-04 13:00:00.000
69,70,2019-01-04 17:15:00,55,5.4,0,55,27.0,82,113,37.3,2019-01-04 13:15:00.000
70,71,2019-01-04 17:30:00,27,5.5,0,27,27.0,86,113,33.8,2019-01-04 13:30:00.000
71,72,2019-01-04 17:45:00,7,5.5,0,7,26.9,89,113,14.0,2019-01-04 13:45:00.000
72,73,2019-01-04 18:00:00,0,5.5,0,0,26.8,93,113,30.7,2019-01-04 14:00:00.000
73,74,2019-01-04 18:15:00,0,5.5,0,0,26.8,96,113,34.3,2019-01-04 14:15:00.000
74,75,2019-01-04 18:30:00,0,5.6,0,0,26.7,99,113,43.0,2019-01-04 14:30:00.000
75,76,2019-01-04 18:45:00,0,5.6,0,0,26.6,103,113,53.0,2019-01-04 14:45:00.000
76,77,2019-01-04 19:00:00,0,5.7,0,0,26.6,106,114,53.8,2019-01-04 15:00:00.000
77,78,2019-01-04 19:15:00,0,5.7,0,0,26.5,110,114,49.6,2019-01-04 15:15:00.000
78,79,2019-01-04 19:30:00,0,5.8,0,0,26.4,113,115,53.2,2019-01-04 15:30:00.000
79,80,2019-01-04 19:45:00,0,5.8,0,0,26.4,117,115,52.2,2019-01-04 15:45:00.000
80,81,2019-01-04 20:00:00,0,5.9,0,0,26.3,120,116,57.7,2019-01-04 16:00:00.000
81,82,2019-01-04 20:15:00,0,5.9,0,0,26.4,123,117,80.9,2019-01-04 16:15:00.000
82,83,2019-01-04 20:30:00,0,6.0,0,0,26.4,127,118,85.2,2019-01-04 16:30:00.000
83,84,2019-01-04 20:45:00,0,6.0,0,0,26.5,130,120,62.1,2019-01-04 16:45:00.000
84,85,2019-01-04 21:00:00,0,6.0,0,0,26.5,133,121,62.0,2019-01-04 17:00:00.000
85,86,2019-01-04 21:15:00,0,6.1,0,0,26.6,136,123,62.0,2019-01-04 17:15:00.000
86,87,2019-01-04 21:30:00,0,6.1,0,0,26.7,139,126,62.7,2019-01-04 17:30:00.000
87,88,2019-01-04 21:45:00,0,6.2,0,0,26.7,142,128,62.8,2019-01-04 17:45:00.000
88,89,2019-01-04 22:00:00,0,6.2,0,0,26.8,145,132,62.8,2019-01-04 18:00:00.000
89,90,2019-01-04 22:15:00,0,6.2,0,0,26.8,148,136,62.8,2019-01-04 18:15:00.000
90,91,2019-01-04 22:30:00,0,6.3,0,0,26.9,150,140,62.8,2019-01-04 18:30:00.000
91,92,2019-01-04 22:45:00,0,6.3,0,0,27.0,153,146,62.8,2019-01-04 18:45:00.000
92,93,2019-01-04 23:00:00,0,6.3,0,0,27.0,155,152,42.2,2019-01-04 19:00:00.000
93,94,2019-01-04 23:15:00,0,6.3,0,0,27.0,156,160,37.0,2019-01-04 19:15:00.000
94,95,2019-01-04 23:30:00,0,6.2,0,0,26.9,157,168,37.0,2019-01-04 19:30:00.000
95,96,2019-01-04 23:45:00,0,6.1,0,0,26.9,158,177,37.0,2019-01-04 19:45:00.000
