,BLOCK_ID,DATA_DATETIME,GHI,WIND_SPEED,DNI,DHI,TEMPERATURE,ZENITH,AZIMUTH,CLOUD_OPACITY,ENTRY_TIME
0,1,2019-01-27 00:00:00,0,3.5,0,0,27.1,162,-178,66.0,2019-01-26 20:00:00.000
1,2,2019-01-27 00:15:00,0,3.5,0,0,27.0,161,-167,66.0,2019-01-26 20:15:00.000
2,3,2019-01-27 00:30:00,0,3.6,0,0,26.9,160,-157,66.0,2019-01-26 20:30:00.000
3,4,2019-01-27 00:45:00,0,3.7,0,0,26.9,158,-148,66.0,2019-01-26 20:45:00.000
4,5,2019-01-27 01:00:00,0,3.8,0,0,26.8,156,-141,66.0,2019-01-26 21:00:00.000
5,6,2019-01-27 01:15:00,0,3.8,0,0,26.8,154,-135,66.0,2019-01-26 21:15:00.000
6,7,2019-01-27 01:30:00,0,3.9,0,0,26.7,151,-130,69.5,2019-01-26 21:30:00.000
7,8,2019-01-27 01:45:00,0,4.0,0,0,26.6,148,-127,72.1,2019-01-26 21:45:00.000
8,9,2019-01-27 02:00:00,0,4.0,0,0,26.6,145,-123,58.0,2019-01-26 22:00:00.000
9,10,2019-01-27 02:15:00,0,4.0,0,0,26.6,142,-121,54.6,2019-01-26 22:15:00.000
10,11,2019-01-27 02:30:00,0,4.0,0,0,26.6,138,-119,60.5,2019-01-26 22:30:00.000
11,12,2019-01-27 02:45:00,0,4.0,0,0,26.6,135,-117,70.1,2019-01-26 22:45:00.000
12,13,2019-01-27 03:00:00,0,4.0,0,0,26.5,132,-115,63.7,2019-01-26 23:00:00.000
13,14,2019-01-27 03:15:00,0,3.9,0,0,26.5,128,-114,60.2,2019-01-26 23:15:00.000
14,15,2019-01-27 03:30:00,0,3.9,0,0,26.5,125,-113,42.4,2019-01-26 23:30:00.000
15,16,2019-01-27 03:45:00,0,3.9,0,0,26.5,121,-112,45.4,2019-01-26 23:45:00.000
16,17,2019-01-27 04:00:00,0,3.9,0,0,26.5,118,-111,65.0,2019-01-27 00:00:00.000
17,18,2019-01-27 04:15:00,0,3.9,0,0,26.5,114,-111,65.0,2019-01-27 00:15:00.000
18,19,2019-01-27 04:30:00,0,3.9,0,0,26.5,111,-110,65.0,2019-01-27 00:30:00.000
19,20,2019-01-27 04:45:00,0,3.8,0,0,26.5,107,-110,65.0,2019-01-27 00:45:00.000
20,21,2019-01-27 05:00:00,0,3.8,0,0,26.4,104,-109,55.4,2019-01-27 01:00:00.000
21,22,2019-01-27 05:15:00,0,3.7,0,0,26.4,100,-109,56.0,2019-01-27 01:15:00.000
22,23,2019-01-27 05:30:00,0,3.5,0,0,26.4,97,-109,58.4,2019-01-27 01:30:00.000
23,24,2019-01-27 05:45:00,0,3.4,0,0,26.3,93,-109,52.3,2019-01-27 01:45:00.000
24,25,2019-01-27 06:00:00,3,3.2,0,3,26.3,90,-109,31.9,2019-01-27 02:00:00.000
25,26,2019-01-27 06:15:00,20,3.1,0,20,26.3,86,-109,50.3,2019-01-27 02:15:00.000
26,27,2019-01-27 06:30:00,38,2.9,0,38,26.2,83,-109,56.9,2019-01-27 02:30:00.000
27,28,2019-01-27 06:45:00,54,2.8,0,54,26.2,79,-109,62.9,2019-01-27 02:45:00.000
28,29,2019-01-27 07:00:00,78,2.6,0,78,26.1,75,-110,61.9,2019-01-27 03:00:00.000
29,30,2019-01-27 07:15:00,108,2.5,0,108,26.1,72,-110,59.7,2019-01-27 03:15:00.000
30,31,2019-01-27 07:30:00,193,2.3,0,193,26.1,68,-111,41.8,2019-01-27 03:30:00.000
31,32,2019-01-27 07:45:00,243,2.2,0,243,26.0,65,-111,38.1,2019-01-27 03:45:00.000
32,33,2019-01-27 08:00:00,285,2.1,0,285,26.0,62,-112,37.0,2019-01-27 04:00:00.000
33,34,2019-01-27 08:15:00,244,2.1,0,244,26.1,58,-113,52.3,2019-01-27 04:15:00.000
34,35,2019-01-27 08:30:00,348,2.0,8,344,26.1,55,-114,39.1,2019-01-27 04:30:00.000
35,36,2019-01-27 08:45:00,383,2.0,24,367,26.2,51,-115,38.9,2019-01-27 04:45:00.000
36,37,2019-01-27 09:00:00,460,2.0,80,406,26.2,48,-117,32.2,2019-01-27 05:00:00.000
37,38,2019-01-27 09:15:00,539,2.0,204,394,26.3,44,-118,25.9,2019-01-27 05:15:00.000
38,39,2019-01-27 09:30:00,564,2.0,184,426,26.4,41,-120,27.1,2019-01-27 05:30:00.000
39,40,2019-01-27 09:45:00,564,2.0,115,473,26.4,38,-123,30.9,2019-01-27 05:45:00.000
40,41,2019-01-27 10:00:00,642,2.0,238,447,26.5,35,-126,24.9,2019-01-27 06:00:00.000
41,42,2019-01-27 10:15:00,701,1.9,324,425,26.5,32,-129,21.2,2019-01-27 06:15:00.000
42,43,2019-01-27 10:30:00,792,1.9,512,344,26.6,29,-133,13.9,2019-01-27 06:30:00.000
43,44,2019-01-27 10:45:00,796,1.9,465,380,26.7,26,-138,15.7,2019-01-27 06:45:00.000
44,45,2019-01-27 11:00:00,879,2.0,659,278,26.7,24,-145,8.9,2019-01-27 07:00:00.000
45,46,2019-01-27 11:15:00,907,2.2,698,261,26.7,22,-152,7.5,2019-01-27 07:15:00.000
46,47,2019-01-27 11:30:00,868,2.4,554,350,26.7,21,-161,12.4,2019-01-27 07:30:00.000
47,48,2019-01-27 11:45:00,701,2.6,160,550,26.8,20,-171,29.7,2019-01-27 07:45:00.000
48,49,2019-01-27 12:00:00,707,2.8,163,553,26.8,20,178,29.3,2019-01-27 08:00:00.000
49,50,2019-01-27 12:15:00,846,3.0,483,393,26.8,20,168,15.1,2019-01-27 08:15:00.000
50,51,2019-01-27 12:30:00,895,3.2,640,298,26.8,21,158,9.4,2019-01-27 08:30:00.000
51,52,2019-01-27 12:45:00,869,3.4,595,320,26.8,23,150,10.9,2019-01-27 08:45:00.000
52,53,2019-01-27 13:00:00,776,3.6,383,428,26.8,25,143,19.0,2019-01-27 09:00:00.000
53,54,2019-01-27 13:15:00,869,3.8,703,243,26.9,27,137,7.2,2019-01-27 09:15:00.000
54,55,2019-01-27 13:30:00,745,4.0,397,400,26.9,30,132,18.1,2019-01-27 09:30:00.000
55,56,2019-01-27 13:45:00,637,4.3,182,483,26.9,33,128,27.4,2019-01-27 09:45:00.000
56,57,2019-01-27 14:00:00,619,4.4,200,457,26.9,36,125,26.4,2019-01-27 10:00:00.000
57,58,2019-01-27 14:15:00,596,4.5,213,431,26.9,39,122,25.7,2019-01-27 10:15:00.000
58,59,2019-01-27 14:30:00,579,4.5,249,394,27.0,42,120,23.7,2019-01-27 10:30:00.000
59,60,2019-01-27 14:45:00,612,4.6,472,281,27.0,45,118,14.0,2019-01-27 10:45:00.000
60,61,2019-01-27 15:00:00,645,4.6,795,122,27.0,49,116,2.3,2019-01-27 11:00:00.000
61,62,2019-01-27 15:15:00,607,4.7,845,89,27.0,52,115,0.0,2019-01-27 11:15:00.000
62,63,2019-01-27 15:30:00,551,4.7,825,85,27.1,56,114,0.0,2019-01-27 11:30:00.000
63,64,2019-01-27 15:45:00,487,4.8,762,94,27.1,59,113,1.4,2019-01-27 11:45:00.000
64,65,2019-01-27 16:00:00,385,4.9,473,165,27.1,62,112,11.2,2019-01-27 12:00:00.000
65,66,2019-01-27 16:15:00,247,4.9,16,240,27.1,66,111,33.7,2019-01-27 12:15:00.000
66,67,2019-01-27 16:30:00,139,5.0,3,138,27.2,69,110,55.7,2019-01-27 12:30:00.000
67,68,2019-01-27 16:45:00,93,5.1,0,93,27.2,73,110,62.8,2019-01-27 12:45:00.000
68,69,2019-01-27 17:00:00,93,5.1,0,93,27.2,77,110,49.1,2019-01-27 13:00:00.000
69,70,2019-01-27 17:15:00,48,5.1,0,48,27.0,80,109,62.8,2019-01-27 13:15:00.000
70,71,2019-01-27 17:30:00,28,5.1,0,28,26.9,84,109,61.0,2019-01-27 13:30:00.000
71,72,2019-01-27 17:45:00,8,5.1,0,8,26.7,87,109,61.4,2019-01-27 13:45:00.000
72,73,2019-01-27 18:00:00,1,5.1,0,1,26.6,91,109,35.0,2019-01-27 14:00:00.000
73,74,2019-01-27 18:15:00,0,5.1,0,0,26.5,94,109,41.0,2019-01-27 14:15:00.000
74,75,2019-01-27 18:30:00,0,5.1,0,0,26.3,98,109,57.4,2019-01-27 14:30:00.000
75,76,2019-01-27 18:45:00,0,5.1,0,0,26.2,101,109,56.7,2019-01-27 14:45:00.000
76,77,2019-01-27 19:00:00,0,5.1,0,0,26.0,105,109,59.8,2019-01-27 15:00:00.000
77,78,2019-01-27 19:15:00,0,5.2,0,0,25.9,108,110,70.0,2019-01-27 15:15:00.000
78,79,2019-01-27 19:30:00,0,5.2,0,0,25.8,112,110,68.4,2019-01-27 15:30:00.000
79,80,2019-01-27 19:45:00,0,5.3,0,0,25.6,115,111,64.5,2019-01-27 15:45:00.000
80,81,2019-01-27 20:00:00,0,5.3,0,0,25.5,119,111,65.8,2019-01-27 16:00:00.000
81,82,2019-01-27 20:15:00,0,5.4,0,0,25.7,122,112,67.0,2019-01-27 16:15:00.000
82,83,2019-01-27 20:30:00,0,5.5,0,0,25.8,126,113,67.0,2019-01-27 16:30:00.000
83,84,2019-01-27 20:45:00,0,5.6,0,0,25.9,129,114,52.3,2019-01-27 16:45:00.000
84,85,2019-01-27 21:00:00,0,5.7,0,0,26.1,133,115,66.3,2019-01-27 17:00:00.000
85,86,2019-01-27 21:15:00,0,5.8,0,0,26.2,136,117,67.0,2019-01-27 17:15:00.000
86,87,2019-01-27 21:30:00,0,5.9,0,0,26.3,139,119,67.0,2019-01-27 17:30:00.000
87,88,2019-01-27 21:45:00,0,6.0,0,0,26.5,143,121,65.3,2019-01-27 17:45:00.000
88,89,2019-01-27 22:00:00,0,6.1,0,0,26.6,146,124,49.2,2019-01-27 18:00:00.000
89,90,2019-01-27 22:15:00,0,6.2,0,0,26.7,149,127,52.9,2019-01-27 18:15:00.000
90,91,2019-01-27 22:30:00,0,6.3,0,0,26.9,152,131,82.9,2019-01-27 18:30:00.000
91,92,2019-01-27 22:45:00,0,6.4,0,0,27.0,155,137,73.1,2019-01-27 18:45:00.000
92,93,2019-01-27 23:00:00,0,6.5,0,0,27.1,157,143,67.5,2019-01-27 19:00:00.000
93,94,2019-01-27 23:15:00,0,6.5,0,0,27.1,159,151,67.8,2019-01-27 19:15:00.000
94,95,2019-01-27 23:30:00,0,6.4,0,0,27.0,161,160,68.0,2019-01-27 19:30:00.000
95,96,2019-01-27 23:45:00,0,6.4,0,0,27.0,162,170,68.0,2019-01-27 19:45:00.000
