,BLOCK_ID,DATA_DATETIME,GHI,WIND_SPEED,DNI,DHI,TEMPERATURE,ZENITH,AZIMUTH,CLOUD_OPACITY,ENTRY_TIME
0,1,2019-09-24 00:00:00,0,0.5,0,0,21.8,174,-79,0.0,2019-09-23 20:00:00.000
1,2,2019-09-24 00:15:00,0,0.5,0,0,21.7,171,-84,0.0,2019-09-23 20:15:00.000
2,3,2019-09-24 00:30:00,0,0.5,0,0,21.7,167,-86,0.0,2019-09-23 20:30:00.000
3,4,2019-09-24 00:45:00,0,0.6,0,0,21.6,163,-87,0.0,2019-09-23 20:45:00.000
4,5,2019-09-24 01:00:00,0,0.7,0,0,21.5,159,-87,0.0,2019-09-23 21:00:00.000
5,6,2019-09-24 01:15:00,0,0.8,0,0,21.5,156,-88,0.0,2019-09-23 21:15:00.000
6,7,2019-09-24 01:30:00,0,0.9,0,0,21.5,152,-88,0.0,2019-09-23 21:30:00.000
7,8,2019-09-24 01:45:00,0,1.0,0,0,21.5,148,-88,0.0,2019-09-23 21:45:00.000
8,9,2019-09-24 02:00:00,0,1.1,0,0,21.5,144,-89,0.0,2019-09-23 22:00:00.000
9,10,2019-09-24 02:15:00,0,1.1,0,0,21.4,141,-89,0.0,2019-09-23 22:15:00.000
10,11,2019-09-24 02:30:00,0,1.2,0,0,21.4,137,-89,0.0,2019-09-23 22:30:00.000
11,12,2019-09-24 02:45:00,0,1.2,0,0,21.3,133,-89,0.0,2019-09-23 22:45:00.000
12,13,2019-09-24 03:00:00,0,1.2,0,0,21.3,130,-89,0.0,2019-09-23 23:00:00.000
13,14,2019-09-24 03:15:00,0,1.2,0,0,21.3,126,-89,0.0,2019-09-23 23:15:00.000
14,15,2019-09-24 03:30:00,0,1.1,0,0,21.2,122,-89,0.0,2019-09-23 23:30:00.000
15,16,2019-09-24 03:45:00,0,1.1,0,0,21.2,118,-89,0.0,2019-09-23 23:45:00.000
16,17,2019-09-24 04:00:00,0,1.0,0,0,21.1,115,-89,0.0,2019-09-24 00:00:00.000
17,18,2019-09-24 04:15:00,0,0.9,0,0,21.1,111,-89,0.0,2019-09-24 00:15:00.000
18,19,2019-09-24 04:30:00,0,0.8,0,0,21.1,107,-89,0.0,2019-09-24 00:30:00.000
19,20,2019-09-24 04:45:00,0,0.7,0,0,21.0,103,-90,0.0,2019-09-24 00:45:00.000
20,21,2019-09-24 05:00:00,0,0.7,0,0,21.0,100,-90,0.0,2019-09-24 01:00:00.000
21,22,2019-09-24 05:15:00,0,0.6,0,0,21.0,96,-90,0.0,2019-09-24 01:15:00.000
22,23,2019-09-24 05:30:00,0,0.6,0,0,21.0,92,-90,0.0,2019-09-24 01:30:00.000
23,24,2019-09-24 05:45:00,12,0.5,29,10,21.0,88,-90,0.0,2019-09-24 01:45:00.000
24,25,2019-09-24 06:00:00,50,0.5,179,31,21.2,85,-90,0.0,2019-09-24 02:00:00.000
25,26,2019-09-24 06:15:00,99,0.4,307,49,21.9,81,-90,0.0,2019-09-24 02:15:00.000
26,27,2019-09-24 06:30:00,156,0.4,406,64,22.6,77,-90,0.0,2019-09-24 02:30:00.000
27,28,2019-09-24 06:45:00,217,0.4,485,77,23.3,73,-90,0.0,2019-09-24 02:45:00.000
28,29,2019-09-24 07:00:00,280,0.4,547,88,24.1,70,-90,0.0,2019-09-24 03:00:00.000
29,30,2019-09-24 07:15:00,343,0.5,598,97,25.2,66,-90,0.0,2019-09-24 03:15:00.000
30,31,2019-09-24 07:30:00,406,0.6,641,105,26.3,62,-90,0.0,2019-09-24 03:30:00.000
31,32,2019-09-24 07:45:00,467,0.7,676,111,27.4,58,-90,0.0,2019-09-24 03:45:00.000
32,33,2019-09-24 08:00:00,529,0.8,708,117,28.3,54,-90,0.0,2019-09-24 04:00:00.000
33,34,2019-09-24 08:15:00,587,1.0,734,122,28.8,51,-90,0.0,2019-09-24 04:15:00.000
34,35,2019-09-24 08:30:00,643,1.3,756,126,29.2,47,-90,0.0,2019-09-24 04:30:00.000
35,36,2019-09-24 08:45:00,695,1.5,775,130,29.6,43,-90,0.0,2019-09-24 04:45:00.000
36,37,2019-09-24 09:00:00,744,1.8,791,133,30.0,39,-90,0.0,2019-09-24 05:00:00.000
37,38,2019-09-24 09:15:00,790,2.0,805,136,30.3,36,-90,0.0,2019-09-24 05:15:00.000
38,39,2019-09-24 09:30:00,832,2.2,817,139,30.6,32,-91,0.0,2019-09-24 05:30:00.000
39,40,2019-09-24 09:45:00,867,2.4,819,146,31.0,28,-91,0.2,2019-09-24 05:45:00.000
40,41,2019-09-24 10:00:00,852,2.6,667,245,31.3,24,-91,5.6,2019-09-24 06:00:00.000
41,42,2019-09-24 10:15:00,877,2.7,664,255,31.5,21,-91,5.9,2019-09-24 06:15:00.000
42,43,2019-09-24 10:30:00,954,2.8,837,153,31.7,17,-91,0.2,2019-09-24 06:30:00.000
43,44,2019-09-24 10:45:00,911,2.9,647,282,31.9,13,-92,6.4,2019-09-24 06:45:00.000
44,45,2019-09-24 11:00:00,959,3.0,749,220,32.1,9,-93,2.9,2019-09-24 07:00:00.000
45,46,2019-09-24 11:15:00,996,3.0,829,171,32.1,6,-95,0.0,2019-09-24 07:15:00.000
46,47,2019-09-24 11:30:00,1000,3.0,825,176,32.1,2,-105,0.0,2019-09-24 07:30:00.000
47,48,2019-09-24 11:45:00,1000,3.0,824,176,32.1,2,107,0.0,2019-09-24 07:45:00.000
48,49,2019-09-24 12:00:00,995,3.0,823,176,32.1,6,95,0.0,2019-09-24 08:00:00.000
49,50,2019-09-24 12:15:00,985,3.0,821,175,31.9,9,93,0.0,2019-09-24 08:15:00.000
50,51,2019-09-24 12:30:00,971,3.0,819,173,31.8,13,92,0.0,2019-09-24 08:30:00.000
51,52,2019-09-24 12:45:00,951,2.9,815,172,31.6,17,91,0.0,2019-09-24 08:45:00.000
52,53,2019-09-24 13:00:00,927,2.8,809,169,31.5,21,91,0.0,2019-09-24 09:00:00.000
53,54,2019-09-24 13:15:00,898,2.7,802,167,31.4,24,91,0.0,2019-09-24 09:15:00.000
54,55,2019-09-24 13:30:00,864,2.5,791,166,31.3,28,91,0.0,2019-09-24 09:30:00.000
55,56,2019-09-24 13:45:00,824,2.3,770,170,31.2,32,91,0.0,2019-09-24 09:45:00.000
56,57,2019-09-24 14:00:00,780,2.2,747,173,31.1,36,91,0.0,2019-09-24 10:00:00.000
57,58,2019-09-24 14:15:00,733,2.1,722,174,31.0,39,91,0.0,2019-09-24 10:15:00.000
58,59,2019-09-24 14:30:00,682,2.1,698,173,30.8,43,90,0.0,2019-09-24 10:30:00.000
59,60,2019-09-24 14:45:00,630,2.0,678,166,30.7,47,90,0.0,2019-09-24 10:45:00.000
60,61,2019-09-24 15:00:00,575,2.0,656,158,30.5,51,90,0.0,2019-09-24 11:00:00.000
61,62,2019-09-24 15:15:00,517,2.0,630,150,30.3,54,90,0.0,2019-09-24 11:15:00.000
62,63,2019-09-24 15:30:00,457,1.9,600,140,30.0,58,90,0.0,2019-09-24 11:30:00.000
63,64,2019-09-24 15:45:00,396,1.9,566,129,29.8,62,90,0.0,2019-09-24 11:45:00.000
64,65,2019-09-24 16:00:00,334,1.9,526,117,29.5,66,90,0.0,2019-09-24 12:00:00.000
65,66,2019-09-24 16:15:00,272,1.8,477,103,29.1,69,90,0.0,2019-09-24 12:15:00.000
66,67,2019-09-24 16:30:00,211,1.8,419,88,28.7,73,90,0.0,2019-09-24 12:30:00.000
67,68,2019-09-24 16:45:00,140,1.7,207,92,28.2,77,90,8.0,2019-09-24 12:45:00.000
68,69,2019-09-24 17:00:00,85,1.6,88,70,27.7,81,90,11.8,2019-09-24 13:00:00.000
69,70,2019-09-24 17:15:00,43,1.6,25,41,26.8,84,90,11.4,2019-09-24 13:15:00.000
70,71,2019-09-24 17:30:00,13,1.6,24,11,26.0,88,90,0.0,2019-09-24 13:30:00.000
71,72,2019-09-24 17:45:00,0,1.6,0,0,25.1,92,90,0.0,2019-09-24 13:45:00.000
72,73,2019-09-24 18:00:00,0,1.5,0,0,24.4,96,90,0.0,2019-09-24 14:00:00.000
73,74,2019-09-24 18:15:00,0,1.5,0,0,24.0,99,90,0.0,2019-09-24 14:15:00.000
74,75,2019-09-24 18:30:00,0,1.5,0,0,23.7,103,90,0.0,2019-09-24 14:30:00.000
75,76,2019-09-24 18:45:00,0,1.4,0,0,23.4,107,90,0.0,2019-09-24 14:45:00.000
76,77,2019-09-24 19:00:00,0,1.4,0,0,23.1,111,90,0.0,2019-09-24 15:00:00.000
77,78,2019-09-24 19:15:00,0,1.3,0,0,22.9,114,90,0.0,2019-09-24 15:15:00.000
78,79,2019-09-24 19:30:00,0,1.2,0,0,22.7,118,90,0.0,2019-09-24 15:30:00.000
79,80,2019-09-24 19:45:00,0,1.2,0,0,22.6,122,90,0.0,2019-09-24 15:45:00.000
80,81,2019-09-24 20:00:00,0,1.1,0,0,22.4,126,89,0.0,2019-09-24 16:00:00.000
81,82,2019-09-24 20:15:00,0,1.0,0,0,22.2,129,89,0.0,2019-09-24 16:15:00.000
82,83,2019-09-24 20:30:00,0,0.9,0,0,22.1,133,89,0.0,2019-09-24 16:30:00.000
83,84,2019-09-24 20:45:00,0,0.8,0,0,22.0,137,89,0.0,2019-09-24 16:45:00.000
84,85,2019-09-24 21:00:00,0,0.7,0,0,21.8,141,89,0.0,2019-09-24 17:00:00.000
85,86,2019-09-24 21:15:00,0,0.6,0,0,21.7,144,89,0.0,2019-09-24 17:15:00.000
86,87,2019-09-24 21:30:00,0,0.6,0,0,21.6,148,89,0.0,2019-09-24 17:30:00.000
87,88,2019-09-24 21:45:00,0,0.5,0,0,21.5,152,89,0.0,2019-09-24 17:45:00.000
88,89,2019-09-24 22:00:00,0,0.5,0,0,21.4,156,89,0.0,2019-09-24 18:00:00.000
89,90,2019-09-24 22:15:00,0,0.4,0,0,21.4,159,88,0.0,2019-09-24 18:15:00.000
90,91,2019-09-24 22:30:00,0,0.4,0,0,21.3,163,88,0.0,2019-09-24 18:30:00.000
91,92,2019-09-24 22:45:00,0,0.4,0,0,21.2,167,87,0.0,2019-09-24 18:45:00.000
92,93,2019-09-24 23:00:00,0,0.4,0,0,21.2,171,86,0.0,2019-09-24 19:00:00.000
93,94,2019-09-24 23:15:00,0,0.4,0,0,21.1,174,83,0.0,2019-09-24 19:15:00.000
94,95,2019-09-24 23:30:00,0,0.4,0,0,21.0,178,69,0.0,2019-09-24 19:30:00.000
95,96,2019-09-24 23:45:00,0,0.3,0,0,20.9,178,-66,0.0,2019-09-24 19:45:00.000
