,BLOCK_ID,DATA_DATETIME,GHI,WIND_SPEED,DNI,DHI,TEMPERATURE,ZENITH,AZIMUTH,CLOUD_OPACITY,ENTRY_TIME
0,1,2021-01-31 00:00:00,0,2.4,0,0,22.4,163,-179,42.0,2021-01-30 20:00:00.000
1,2,2021-01-31 00:15:00,0,2.5,0,0,22.4,162,-167,60.1,2021-01-30 20:15:00.000
2,3,2021-01-31 00:30:00,0,2.7,0,0,22.4,161,-156,72.8,2021-01-30 20:30:00.000
3,4,2021-01-31 00:45:00,0,2.8,0,0,22.4,159,-147,70.9,2021-01-30 20:45:00.000
4,5,2021-01-31 01:00:00,0,2.8,0,0,22.3,157,-140,73.8,2021-01-30 21:00:00.000
5,6,2021-01-31 01:15:00,0,2.5,0,0,22.2,154,-134,74.0,2021-01-30 21:15:00.000
6,7,2021-01-31 01:30:00,0,2.2,0,0,22.1,152,-129,74.0,2021-01-30 21:30:00.000
7,8,2021-01-31 01:45:00,0,1.8,0,0,22.0,149,-125,79.3,2021-01-30 21:45:00.000
8,9,2021-01-31 02:00:00,0,1.6,0,0,21.9,145,-122,79.2,2021-01-30 22:00:00.000
9,10,2021-01-31 02:15:00,0,1.6,0,0,21.8,142,-119,77.1,2021-01-30 22:15:00.000
10,11,2021-01-31 02:30:00,0,1.5,0,0,21.7,139,-117,74.2,2021-01-30 22:30:00.000
11,12,2021-01-31 02:45:00,0,1.5,0,0,21.6,136,-115,75.6,2021-01-30 22:45:00.000
12,13,2021-01-31 03:00:00,0,1.5,0,0,21.5,132,-114,73.2,2021-01-30 23:00:00.000
13,14,2021-01-31 03:15:00,0,1.5,0,0,21.5,129,-113,74.2,2021-01-30 23:15:00.000
14,15,2021-01-31 03:30:00,0,1.5,0,0,21.4,125,-112,67.0,2021-01-30 23:30:00.000
15,16,2021-01-31 03:45:00,0,1.5,0,0,21.4,122,-111,61.3,2021-01-30 23:45:00.000
16,17,2021-01-31 04:00:00,0,1.4,0,0,21.3,118,-110,62.5,2021-01-31 00:00:00.000
17,18,2021-01-31 04:15:00,0,1.4,0,0,21.4,115,-110,70.9,2021-01-31 00:15:00.000
18,19,2021-01-31 04:30:00,0,1.3,0,0,21.4,111,-109,71.4,2021-01-31 00:30:00.000
19,20,2021-01-31 04:45:00,0,1.3,0,0,21.4,108,-109,69.4,2021-01-31 00:45:00.000
20,21,2021-01-31 05:00:00,0,1.2,0,0,21.4,104,-108,72.8,2021-01-31 01:00:00.000
21,22,2021-01-31 05:15:00,0,1.2,0,0,21.4,101,-108,97.0,2021-01-31 01:15:00.000
22,23,2021-01-31 05:30:00,0,1.2,0,0,21.4,97,-108,57.0,2021-01-31 01:30:00.000
23,24,2021-01-31 05:45:00,0,1.1,0,0,21.4,93,-108,47.2,2021-01-31 01:45:00.000
24,25,2021-01-31 06:00:00,1,1.1,0,1,21.5,90,-108,63.2,2021-01-31 02:00:00.000
25,26,2021-01-31 06:15:00,17,1.1,0,17,21.6,86,-108,51.2,2021-01-31 02:15:00.000
26,27,2021-01-31 06:30:00,47,1.1,0,47,21.7,83,-108,37.2,2021-01-31 02:30:00.000
27,28,2021-01-31 06:45:00,73,1.1,0,73,21.8,79,-108,43.2,2021-01-31 02:45:00.000
28,29,2021-01-31 07:00:00,117,1.2,0,117,22.0,76,-109,38.0,2021-01-31 03:00:00.000
29,30,2021-01-31 07:15:00,164,1.2,0,164,22.4,72,-109,34.2,2021-01-31 03:15:00.000
30,31,2021-01-31 07:30:00,241,1.2,111,199,22.9,68,-110,22.8,2021-01-31 03:30:00.000
31,32,2021-01-31 07:45:00,307,1.2,221,213,23.4,65,-110,17.7,2021-01-31 03:45:00.000
32,33,2021-01-31 08:00:00,342,1.3,179,257,23.8,61,-111,21.0,2021-01-31 04:00:00.000
33,34,2021-01-31 08:15:00,368,1.3,112,308,23.9,58,-112,25.5,2021-01-31 04:15:00.000
34,35,2021-01-31 08:30:00,430,1.4,189,321,23.9,55,-113,22.0,2021-01-31 04:30:00.000
35,36,2021-01-31 08:45:00,511,1.5,334,301,24.0,51,-114,15.7,2021-01-31 04:45:00.000
36,37,2021-01-31 09:00:00,523,1.6,238,364,24.1,48,-115,20.6,2021-01-31 05:00:00.000
37,38,2021-01-31 09:15:00,541,1.6,242,369,24.3,44,-117,23.5,2021-01-31 05:15:00.000
38,39,2021-01-31 09:30:00,585,1.7,247,398,24.5,41,-119,22.6,2021-01-31 05:30:00.000
39,40,2021-01-31 09:45:00,701,1.7,458,338,24.7,38,-121,12.0,2021-01-31 05:45:00.000
40,41,2021-01-31 10:00:00,760,1.8,542,313,24.9,35,-124,9.0,2021-01-31 06:00:00.000
41,42,2021-01-31 10:15:00,794,1.8,557,320,25.4,32,-127,8.6,2021-01-31 06:15:00.000
42,43,2021-01-31 10:30:00,789,1.9,463,383,25.8,29,-131,12.1,2021-01-31 06:30:00.000
43,44,2021-01-31 10:45:00,771,1.9,354,453,26.2,26,-137,16.5,2021-01-31 06:45:00.000
44,45,2021-01-31 11:00:00,731,1.9,218,531,26.6,23,-143,22.5,2021-01-31 07:00:00.000
45,46,2021-01-31 11:15:00,622,2.0,5,618,27.0,21,-150,35.1,2021-01-31 07:15:00.000
46,47,2021-01-31 11:30:00,750,2.1,217,546,27.3,20,-159,22.6,2021-01-31 07:30:00.000
47,48,2021-01-31 11:45:00,822,2.2,368,474,27.7,19,-170,15.7,2021-01-31 07:45:00.000
48,49,2021-01-31 12:00:00,861,2.2,466,420,28.0,18,179,11.8,2021-01-31 08:00:00.000
49,50,2021-01-31 12:15:00,816,2.3,354,482,28.3,19,168,16.1,2021-01-31 08:15:00.000
50,51,2021-01-31 12:30:00,845,2.4,444,428,28.7,20,158,12.4,2021-01-31 08:30:00.000
51,52,2021-01-31 12:45:00,849,2.5,487,398,29.0,22,149,10.8,2021-01-31 08:45:00.000
52,53,2021-01-31 13:00:00,853,2.6,539,360,29.3,24,142,8.8,2021-01-31 09:00:00.000
53,54,2021-01-31 13:15:00,829,2.8,524,360,29.3,26,135,9.3,2021-01-31 09:15:00.000
54,55,2021-01-31 13:30:00,778,3.1,440,393,29.4,29,131,12.4,2021-01-31 09:30:00.000
55,56,2021-01-31 13:45:00,757,3.3,454,372,29.4,32,127,11.9,2021-01-31 09:45:00.000
56,57,2021-01-31 14:00:00,631,3.4,188,476,29.4,35,123,23.6,2021-01-31 10:00:00.000
57,58,2021-01-31 14:15:00,493,3.3,69,440,29.2,38,121,37.2,2021-01-31 10:15:00.000
58,59,2021-01-31 14:30:00,565,3.1,168,439,28.9,42,118,24.3,2021-01-31 10:30:00.000
59,60,2021-01-31 14:45:00,309,2.9,0,309,28.7,45,116,55.8,2021-01-31 10:45:00.000
60,61,2021-01-31 15:00:00,229,2.7,0,229,28.5,48,115,64.8,2021-01-31 11:00:00.000
61,62,2021-01-31 15:15:00,205,2.6,0,205,28.2,52,113,65.6,2021-01-31 11:15:00.000
62,63,2021-01-31 15:30:00,140,2.5,0,140,28.0,55,112,74.2,2021-01-31 11:30:00.000
63,64,2021-01-31 15:45:00,151,2.4,0,151,27.8,59,111,68.7,2021-01-31 11:45:00.000
64,65,2021-01-31 16:00:00,142,2.3,0,142,27.5,62,111,66.4,2021-01-31 12:00:00.000
65,66,2021-01-31 16:15:00,129,2.3,0,129,27.2,66,110,64.4,2021-01-31 12:15:00.000
66,67,2021-01-31 16:30:00,123,2.2,0,123,26.9,69,109,59.0,2021-01-31 12:30:00.000
67,68,2021-01-31 16:45:00,134,2.2,0,134,26.6,73,109,43.8,2021-01-31 12:45:00.000
68,69,2021-01-31 17:00:00,97,2.1,0,97,26.2,76,108,45.8,2021-01-31 13:00:00.000
69,70,2021-01-31 17:15:00,88,2.0,0,88,25.7,80,108,26.9,2021-01-31 13:15:00.000
70,71,2021-01-31 17:30:00,42,2.0,0,42,25.2,83,108,41.2,2021-01-31 13:30:00.000
71,72,2021-01-31 17:45:00,16,1.9,0,16,24.7,87,108,50.1,2021-01-31 13:45:00.000
72,73,2021-01-31 18:00:00,0,1.9,0,0,24.3,91,108,97.0,2021-01-31 14:00:00.000
73,74,2021-01-31 18:15:00,0,1.9,0,0,24.0,94,108,77.8,2021-01-31 14:15:00.000
74,75,2021-01-31 18:30:00,0,1.9,0,0,23.8,98,108,53.8,2021-01-31 14:30:00.000
75,76,2021-01-31 18:45:00,0,1.9,0,0,23.6,101,108,36.9,2021-01-31 14:45:00.000
76,77,2021-01-31 19:00:00,0,1.8,0,0,23.4,105,108,16.8,2021-01-31 15:00:00.000
77,78,2021-01-31 19:15:00,0,1.8,0,0,23.4,108,109,23.6,2021-01-31 15:15:00.000
78,79,2021-01-31 19:30:00,0,1.7,0,0,23.4,112,109,23.6,2021-01-31 15:30:00.000
79,80,2021-01-31 19:45:00,0,1.6,0,0,23.3,115,109,27.0,2021-01-31 15:45:00.000
80,81,2021-01-31 20:00:00,0,1.6,0,0,23.3,119,110,31.0,2021-01-31 16:00:00.000
81,82,2021-01-31 20:15:00,0,1.6,0,0,23.3,122,111,18.9,2021-01-31 16:15:00.000
82,83,2021-01-31 20:30:00,0,1.6,0,0,23.2,126,112,21.0,2021-01-31 16:30:00.000
83,84,2021-01-31 20:45:00,0,1.6,0,0,23.2,129,113,20.9,2021-01-31 16:45:00.000
84,85,2021-01-31 21:00:00,0,1.7,0,0,23.2,133,114,30.2,2021-01-31 17:00:00.000
85,86,2021-01-31 21:15:00,0,1.7,0,0,23.2,136,115,48.4,2021-01-31 17:15:00.000
86,87,2021-01-31 21:30:00,0,1.7,0,0,23.2,140,117,51.6,2021-01-31 17:30:00.000
87,88,2021-01-31 21:45:00,0,1.7,0,0,23.2,143,119,49.8,2021-01-31 17:45:00.000
88,89,2021-01-31 22:00:00,0,1.8,0,0,23.2,146,122,47.0,2021-01-31 18:00:00.000
89,90,2021-01-31 22:15:00,0,1.8,0,0,23.2,149,125,47.7,2021-01-31 18:15:00.000
90,91,2021-01-31 22:30:00,0,1.8,0,0,23.2,152,129,41.4,2021-01-31 18:30:00.000
91,92,2021-01-31 22:45:00,0,1.8,0,0,23.2,155,134,46.4,2021-01-31 18:45:00.000
92,93,2021-01-31 23:00:00,0,1.9,0,0,23.2,158,141,54.6,2021-01-31 19:00:00.000
93,94,2021-01-31 23:15:00,0,1.9,0,0,23.2,160,149,47.4,2021-01-31 19:15:00.000
94,95,2021-01-31 23:30:00,0,1.9,0,0,23.2,161,158,49.2,2021-01-31 19:30:00.000
95,96,2021-01-31 23:45:00,0,1.9,0,0,23.2,163,169,47.2,2021-01-31 19:45:00.000
