,BLOCK_ID,DATA_DATETIME,GHI,WIND_SPEED,DNI,DHI,TEMPERATURE,ZENITH,AZIMUTH,CLOUD_OPACITY,ENTRY_TIME
0,1,2020-08-18 00:00:00,0,1.4,0,0,23.2,166,-10,16.6,2020-08-17 20:00:00.000
1,2,2020-08-18 00:15:00,0,1.4,0,0,23.1,165,-24,14.6,2020-08-17 20:15:00.000
2,3,2020-08-18 00:30:00,0,1.5,0,0,23.0,163,-35,14.4,2020-08-17 20:30:00.000
3,4,2020-08-18 00:45:00,0,1.5,0,0,22.9,160,-44,27.8,2020-08-17 20:45:00.000
4,5,2020-08-18 01:00:00,0,1.5,0,0,22.9,158,-50,16.4,2020-08-17 21:00:00.000
5,6,2020-08-18 01:15:00,0,1.4,0,0,22.8,155,-55,16.6,2020-08-17 21:15:00.000
6,7,2020-08-18 01:30:00,0,1.4,0,0,22.7,151,-60,14.8,2020-08-17 21:30:00.000
7,8,2020-08-18 01:45:00,0,1.3,0,0,22.7,148,-63,19.8,2020-08-17 21:45:00.000
8,9,2020-08-18 02:00:00,0,1.3,0,0,22.6,145,-65,20.8,2020-08-17 22:00:00.000
9,10,2020-08-18 02:15:00,0,1.3,0,0,22.6,141,-67,21.4,2020-08-17 22:15:00.000
10,11,2020-08-18 02:30:00,0,1.3,0,0,22.5,138,-69,22.2,2020-08-17 22:30:00.000
11,12,2020-08-18 02:45:00,0,1.3,0,0,22.5,134,-70,34.3,2020-08-17 22:45:00.000
12,13,2020-08-18 03:00:00,0,1.3,0,0,22.4,131,-72,57.8,2020-08-17 23:00:00.000
13,14,2020-08-18 03:15:00,0,1.4,0,0,22.4,127,-73,23.5,2020-08-17 23:15:00.000
14,15,2020-08-18 03:30:00,0,1.4,0,0,22.4,124,-73,32.4,2020-08-17 23:30:00.000
15,16,2020-08-18 03:45:00,0,1.5,0,0,22.4,120,-74,15.4,2020-08-17 23:45:00.000
16,17,2020-08-18 04:00:00,0,1.5,0,0,22.4,116,-75,14.0,2020-08-18 00:00:00.000
17,18,2020-08-18 04:15:00,0,1.4,0,0,22.3,113,-75,15.7,2020-08-18 00:15:00.000
18,19,2020-08-18 04:30:00,0,1.4,0,0,22.3,109,-76,19.0,2020-08-18 00:30:00.000
19,20,2020-08-18 04:45:00,0,1.4,0,0,22.2,106,-76,15.4,2020-08-18 00:45:00.000
20,21,2020-08-18 05:00:00,0,1.3,0,0,22.2,102,-76,14.8,2020-08-18 01:00:00.000
21,22,2020-08-18 05:15:00,0,1.3,0,0,22.1,98,-76,13.0,2020-08-18 01:15:00.000
22,23,2020-08-18 05:30:00,0,1.3,0,0,22.1,95,-77,13.0,2020-08-18 01:30:00.000
23,24,2020-08-18 05:45:00,1,1.4,2,1,22.1,91,-77,0.0,2020-08-18 01:45:00.000
24,25,2020-08-18 06:00:00,22,1.4,94,14,22.2,87,-77,0.0,2020-08-18 02:00:00.000
25,26,2020-08-18 06:15:00,65,1.5,322,29,22.7,84,-77,0.0,2020-08-18 02:15:00.000
26,27,2020-08-18 06:30:00,116,1.5,440,40,23.1,80,-77,0.0,2020-08-18 02:30:00.000
27,28,2020-08-18 06:45:00,173,1.6,528,49,23.6,76,-76,0.0,2020-08-18 02:45:00.000
28,29,2020-08-18 07:00:00,232,1.7,595,56,24.1,73,-76,0.0,2020-08-18 03:00:00.000
29,30,2020-08-18 07:15:00,292,1.9,647,61,24.7,69,-76,0.0,2020-08-18 03:15:00.000
30,31,2020-08-18 07:30:00,352,2.1,689,66,25.3,66,-76,0.0,2020-08-18 03:30:00.000
31,32,2020-08-18 07:45:00,401,2.3,660,91,25.9,62,-75,2.4,2020-08-18 03:45:00.000
32,33,2020-08-18 08:00:00,463,2.5,710,89,26.4,58,-75,1.6,2020-08-18 04:00:00.000
33,34,2020-08-18 08:15:00,527,2.7,775,78,26.7,55,-74,0.0,2020-08-18 04:15:00.000
34,35,2020-08-18 08:30:00,525,2.8,536,189,27.0,51,-73,9.6,2020-08-18 04:30:00.000
35,36,2020-08-18 08:45:00,607,3.0,692,138,27.3,47,-72,4.2,2020-08-18 04:45:00.000
36,37,2020-08-18 09:00:00,682,3.1,827,86,27.6,44,-71,0.0,2020-08-18 05:00:00.000
37,38,2020-08-18 09:15:00,621,3.1,436,288,27.8,40,-70,14.8,2020-08-18 05:15:00.000
38,39,2020-08-18 09:30:00,660,3.2,453,298,28.1,37,-68,14.4,2020-08-18 05:30:00.000
39,40,2020-08-18 09:45:00,641,3.2,321,374,28.4,33,-66,20.8,2020-08-18 05:45:00.000
40,41,2020-08-18 10:00:00,697,3.2,399,351,28.6,30,-64,17.6,2020-08-18 06:00:00.000
41,42,2020-08-18 10:15:00,800,3.3,619,248,28.8,27,-60,8.7,2020-08-18 06:15:00.000
42,43,2020-08-18 10:30:00,817,3.3,598,268,29.0,23,-56,9.6,2020-08-18 06:30:00.000
43,44,2020-08-18 10:45:00,860,3.3,672,230,29.2,20,-51,7.1,2020-08-18 06:45:00.000
44,45,2020-08-18 11:00:00,874,3.3,666,240,29.4,18,-43,7.4,2020-08-18 07:00:00.000
45,46,2020-08-18 11:15:00,917,3.3,764,181,29.5,15,-34,4.2,2020-08-18 07:15:00.000
46,47,2020-08-18 11:30:00,835,3.3,511,339,29.5,14,-21,13.6,2020-08-18 07:30:00.000
47,48,2020-08-18 11:45:00,916,3.3,725,209,29.6,13,-5,5.6,2020-08-18 07:45:00.000
48,49,2020-08-18 12:00:00,970,3.2,894,98,29.7,13,11,0.0,2020-08-18 08:00:00.000
49,50,2020-08-18 12:15:00,917,3.3,744,196,29.7,14,26,4.9,2020-08-18 08:15:00.000
50,51,2020-08-18 12:30:00,954,3.3,891,99,29.7,16,38,0.0,2020-08-18 08:30:00.000
51,52,2020-08-18 12:45:00,939,3.4,887,99,29.7,19,47,0.0,2020-08-18 08:45:00.000
52,53,2020-08-18 13:00:00,920,3.4,882,99,29.7,22,53,0.0,2020-08-18 09:00:00.000
53,54,2020-08-18 13:15:00,895,3.3,876,99,29.6,25,58,0.0,2020-08-18 09:15:00.000
54,55,2020-08-18 13:30:00,867,3.2,868,99,29.5,28,62,0.0,2020-08-18 09:30:00.000
55,56,2020-08-18 13:45:00,833,3.1,859,99,29.5,31,65,0.0,2020-08-18 09:45:00.000
56,57,2020-08-18 14:00:00,797,3.1,849,98,29.4,35,67,0.0,2020-08-18 10:00:00.000
57,58,2020-08-18 14:15:00,756,3.0,838,97,29.3,38,69,0.0,2020-08-18 10:15:00.000
58,59,2020-08-18 14:30:00,712,3.0,825,96,29.2,42,71,0.0,2020-08-18 10:30:00.000
59,60,2020-08-18 14:45:00,665,2.9,810,94,29.1,45,72,0.0,2020-08-18 10:45:00.000
60,61,2020-08-18 15:00:00,614,2.9,793,92,28.9,49,73,0.0,2020-08-18 11:00:00.000
61,62,2020-08-18 15:15:00,561,2.8,772,90,28.7,52,74,0.0,2020-08-18 11:15:00.000
62,63,2020-08-18 15:30:00,505,2.6,748,87,28.5,56,74,0.0,2020-08-18 11:30:00.000
63,64,2020-08-18 15:45:00,448,2.5,719,84,28.3,60,75,0.0,2020-08-18 11:45:00.000
64,65,2020-08-18 16:00:00,389,2.4,686,79,28.1,63,75,0.0,2020-08-18 12:00:00.000
65,66,2020-08-18 16:15:00,328,2.2,645,75,27.8,67,76,0.0,2020-08-18 12:15:00.000
66,67,2020-08-18 16:30:00,267,2.0,594,69,27.4,70,76,0.0,2020-08-18 12:30:00.000
67,68,2020-08-18 16:45:00,207,1.8,532,61,27.1,74,76,0.0,2020-08-18 12:45:00.000
68,69,2020-08-18 17:00:00,148,1.7,452,53,26.6,78,77,0.0,2020-08-18 13:00:00.000
69,70,2020-08-18 17:15:00,93,1.6,346,41,25.9,81,77,0.0,2020-08-18 13:15:00.000
70,71,2020-08-18 17:30:00,41,1.6,87,32,25.2,85,77,9.6,2020-08-18 13:30:00.000
71,72,2020-08-18 17:45:00,8,1.5,0,8,24.5,89,77,18.3,2020-08-18 13:45:00.000
72,73,2020-08-18 18:00:00,0,1.5,0,0,23.9,92,77,19.8,2020-08-18 14:00:00.000
73,74,2020-08-18 18:15:00,0,1.5,0,0,23.6,96,77,20.3,2020-08-18 14:15:00.000
74,75,2020-08-18 18:30:00,0,1.5,0,0,23.4,100,76,19.7,2020-08-18 14:30:00.000
75,76,2020-08-18 18:45:00,0,1.5,0,0,23.1,103,76,21.6,2020-08-18 14:45:00.000
76,77,2020-08-18 19:00:00,0,1.5,0,0,22.9,107,76,11.8,2020-08-18 15:00:00.000
77,78,2020-08-18 19:15:00,0,1.5,0,0,22.8,111,76,56.5,2020-08-18 15:15:00.000
78,79,2020-08-18 19:30:00,0,1.5,0,0,22.7,114,75,29.2,2020-08-18 15:30:00.000
79,80,2020-08-18 19:45:00,0,1.4,0,0,22.7,118,75,21.0,2020-08-18 15:45:00.000
80,81,2020-08-18 20:00:00,0,1.4,0,0,22.6,121,74,12.2,2020-08-18 16:00:00.000
81,82,2020-08-18 20:15:00,0,1.4,0,0,22.5,125,73,10.0,2020-08-18 16:15:00.000
82,83,2020-08-18 20:30:00,0,1.4,0,0,22.4,129,72,9.2,2020-08-18 16:30:00.000
83,84,2020-08-18 20:45:00,0,1.4,0,0,22.3,132,71,17.2,2020-08-18 16:45:00.000
84,85,2020-08-18 21:00:00,0,1.4,0,0,22.2,136,70,4.0,2020-08-18 17:00:00.000
85,86,2020-08-18 21:15:00,0,1.4,0,0,22.1,139,69,3.0,2020-08-18 17:15:00.000
86,87,2020-08-18 21:30:00,0,1.3,0,0,22.0,143,67,11.6,2020-08-18 17:30:00.000
87,88,2020-08-18 21:45:00,0,1.3,0,0,21.9,146,65,12.1,2020-08-18 17:45:00.000
88,89,2020-08-18 22:00:00,0,1.2,0,0,21.8,150,62,10.0,2020-08-18 18:00:00.000
89,90,2020-08-18 22:15:00,0,1.2,0,0,21.7,153,59,11.4,2020-08-18 18:15:00.000
90,91,2020-08-18 22:30:00,0,1.2,0,0,21.6,156,54,2.0,2020-08-18 18:30:00.000
91,92,2020-08-18 22:45:00,0,1.1,0,0,21.5,159,49,8.4,2020-08-18 18:45:00.000
92,93,2020-08-18 23:00:00,0,1.1,0,0,21.4,162,41,2.4,2020-08-18 19:00:00.000
93,94,2020-08-18 23:15:00,0,1.1,0,0,21.3,164,32,3.6,2020-08-18 19:15:00.000
94,95,2020-08-18 23:30:00,0,1.1,0,0,21.3,165,19,2.4,2020-08-18 19:30:00.000
95,96,2020-08-18 23:45:00,0,1.1,0,0,21.2,166,5,0.0,2020-08-18 19:45:00.000
