,BLOCK_ID,DATA_DATETIME,GHI,WIND_SPEED,DNI,DHI,TEMPERATURE,ZENITH,AZIMUTH,CLOUD_OPACITY,ENTRY_TIME
0,1,2020-04-22 00:00:00,0,0.9,0,0,23.5,167,-17,37.0,2020-04-21 20:00:00.000
1,2,2020-04-22 00:15:00,0,0.9,0,0,23.5,165,-31,0.0,2020-04-21 20:15:00.000
2,3,2020-04-22 00:30:00,0,1.0,0,0,23.4,163,-42,0.0,2020-04-21 20:30:00.000
3,4,2020-04-22 00:45:00,0,1.0,0,0,23.4,160,-50,0.0,2020-04-21 20:45:00.000
4,5,2020-04-22 01:00:00,0,1.0,0,0,23.3,157,-56,0.0,2020-04-21 21:00:00.000
5,6,2020-04-22 01:15:00,0,1.0,0,0,23.3,154,-60,0.0,2020-04-21 21:15:00.000
6,7,2020-04-22 01:30:00,0,1.0,0,0,23.3,151,-64,0.0,2020-04-21 21:30:00.000
7,8,2020-04-22 01:45:00,0,1.0,0,0,23.2,148,-66,0.0,2020-04-21 21:45:00.000
8,9,2020-04-22 02:00:00,0,1.0,0,0,23.2,144,-69,0.0,2020-04-21 22:00:00.000
9,10,2020-04-22 02:15:00,0,1.0,0,0,23.2,141,-70,0.0,2020-04-21 22:15:00.000
10,11,2020-04-22 02:30:00,0,1.0,0,0,23.1,137,-72,0.0,2020-04-21 22:30:00.000
11,12,2020-04-22 02:45:00,0,1.1,0,0,23.1,133,-73,0.0,2020-04-21 22:45:00.000
12,13,2020-04-22 03:00:00,0,1.1,0,0,23.1,130,-74,0.0,2020-04-21 23:00:00.000
13,14,2020-04-22 03:15:00,0,1.0,0,0,23.1,126,-75,0.0,2020-04-21 23:15:00.000
14,15,2020-04-22 03:30:00,0,1.0,0,0,23.0,123,-75,0.0,2020-04-21 23:30:00.000
15,16,2020-04-22 03:45:00,0,1.0,0,0,23.0,119,-76,0.0,2020-04-21 23:45:00.000
16,17,2020-04-22 04:00:00,0,0.9,0,0,23.0,115,-77,0.0,2020-04-22 00:00:00.000
17,18,2020-04-22 04:15:00,0,0.9,0,0,23.0,112,-77,0.0,2020-04-22 00:15:00.000
18,19,2020-04-22 04:30:00,0,0.9,0,0,23.0,108,-77,0.0,2020-04-22 00:30:00.000
19,20,2020-04-22 04:45:00,0,0.9,0,0,22.9,104,-78,0.0,2020-04-22 00:45:00.000
20,21,2020-04-22 05:00:00,0,0.9,0,0,22.9,101,-78,0.0,2020-04-22 01:00:00.000
21,22,2020-04-22 05:15:00,0,0.9,0,0,22.9,97,-78,0.0,2020-04-22 01:15:00.000
22,23,2020-04-22 05:30:00,0,0.9,0,0,23.0,93,-78,0.0,2020-04-22 01:30:00.000
23,24,2020-04-22 05:45:00,4,0.9,7,4,23.0,90,-78,0.0,2020-04-22 01:45:00.000
24,25,2020-04-22 06:00:00,30,0.9,40,27,23.1,86,-78,6.4,2020-04-22 02:00:00.000
25,26,2020-04-22 06:15:00,40,0.9,0,40,23.4,82,-78,47.0,2020-04-22 02:15:00.000
26,27,2020-04-22 06:30:00,88,0.9,0,88,23.8,79,-78,32.6,2020-04-22 02:30:00.000
27,28,2020-04-22 06:45:00,95,0.9,0,95,24.2,75,-78,49.9,2020-04-22 02:45:00.000
28,29,2020-04-22 07:00:00,180,0.9,46,165,24.6,71,-78,27.3,2020-04-22 03:00:00.000
29,30,2020-04-22 07:15:00,259,1.0,229,170,25.2,68,-77,16.0,2020-04-22 03:15:00.000
30,31,2020-04-22 07:30:00,334,1.0,396,161,25.9,64,-77,9.0,2020-04-22 03:30:00.000
31,32,2020-04-22 07:45:00,331,1.1,217,226,26.5,60,-77,22.1,2020-04-22 03:45:00.000
32,33,2020-04-22 08:00:00,342,1.2,72,302,27.1,57,-76,29.8,2020-04-22 04:00:00.000
33,34,2020-04-22 08:15:00,434,1.0,226,298,27.5,53,-75,20.0,2020-04-22 04:15:00.000
34,35,2020-04-22 08:30:00,463,0.9,191,339,27.9,49,-75,22.4,2020-04-22 04:30:00.000
35,36,2020-04-22 08:45:00,648,0.7,744,130,28.4,46,-74,0.0,2020-04-22 04:45:00.000
36,37,2020-04-22 09:00:00,663,0.6,624,202,28.8,42,-73,4.8,2020-04-22 05:00:00.000
37,38,2020-04-22 09:15:00,728,0.4,721,166,29.2,39,-71,1.8,2020-04-22 05:15:00.000
38,39,2020-04-22 09:30:00,774,0.2,749,161,29.6,35,-70,1.2,2020-04-22 05:30:00.000
39,40,2020-04-22 09:45:00,806,0.2,741,176,30.0,32,-68,1.8,2020-04-22 05:45:00.000
40,41,2020-04-22 10:00:00,769,0.3,519,313,30.3,28,-65,10.0,2020-04-22 06:00:00.000
41,42,2020-04-22 10:15:00,814,0.5,577,291,30.4,25,-62,8.0,2020-04-22 06:15:00.000
42,43,2020-04-22 10:30:00,822,0.7,537,323,30.4,22,-58,9.6,2020-04-22 06:30:00.000
43,44,2020-04-22 10:45:00,836,0.9,526,338,30.5,19,-52,10.0,2020-04-22 06:45:00.000
44,45,2020-04-22 11:00:00,829,1.0,468,379,30.4,16,-43,12.2,2020-04-22 07:00:00.000
45,46,2020-04-22 11:15:00,779,0.9,317,471,30.2,13,-32,18.4,2020-04-22 07:15:00.000
46,47,2020-04-22 11:30:00,613,0.8,70,545,29.9,12,-17,36.2,2020-04-22 07:30:00.000
47,48,2020-04-22 11:45:00,607,0.8,112,497,29.7,11,1,37.0,2020-04-22 07:45:00.000
48,49,2020-04-22 12:00:00,884,0.8,579,317,29.5,12,19,8.0,2020-04-22 08:00:00.000
49,50,2020-04-22 12:15:00,939,0.8,763,198,29.3,14,34,1.5,2020-04-22 08:15:00.000
50,51,2020-04-22 12:30:00,849,0.9,526,343,29.2,16,45,9.8,2020-04-22 08:30:00.000
51,52,2020-04-22 12:45:00,693,0.9,292,417,29.1,19,52,25.1,2020-04-22 08:45:00.000
52,53,2020-04-22 13:00:00,457,1.0,0,457,29.0,22,58,49.4,2020-04-22 09:00:00.000
53,54,2020-04-22 13:15:00,561,1.0,11,551,28.9,25,62,36.1,2020-04-22 09:15:00.000
54,55,2020-04-22 13:30:00,453,0.9,0,453,28.8,29,66,46.6,2020-04-22 09:30:00.000
55,56,2020-04-22 13:45:00,461,0.9,0,461,28.6,32,68,43.3,2020-04-22 09:45:00.000
56,57,2020-04-22 14:00:00,526,0.9,94,450,28.5,36,70,31.8,2020-04-22 10:00:00.000
57,58,2020-04-22 14:15:00,226,0.9,0,226,28.4,39,72,69.1,2020-04-22 10:15:00.000
58,59,2020-04-22 14:30:00,200,0.8,0,200,28.3,43,73,70.8,2020-04-22 10:30:00.000
59,60,2020-04-22 14:45:00,82,0.8,0,82,28.2,46,74,87.2,2020-04-22 10:45:00.000
60,61,2020-04-22 15:00:00,29,0.7,0,29,28.1,50,75,95.1,2020-04-22 11:00:00.000
61,62,2020-04-22 15:15:00,23,0.7,0,23,28.0,54,75,95.6,2020-04-22 11:15:00.000
62,63,2020-04-22 15:30:00,28,0.8,0,28,27.9,57,76,94.0,2020-04-22 11:30:00.000
63,64,2020-04-22 15:45:00,42,0.8,0,42,27.8,61,77,89.7,2020-04-22 11:45:00.000
64,65,2020-04-22 16:00:00,78,0.8,0,78,27.7,64,77,78.0,2020-04-22 12:00:00.000
65,66,2020-04-22 16:15:00,82,0.8,0,82,27.4,68,77,72.3,2020-04-22 12:15:00.000
66,67,2020-04-22 16:30:00,95,0.8,0,95,27.2,72,78,59.4,2020-04-22 12:30:00.000
67,68,2020-04-22 16:45:00,67,0.9,0,67,27.0,75,78,62.8,2020-04-22 12:45:00.000
68,69,2020-04-22 17:00:00,39,0.9,0,39,26.7,79,78,67.8,2020-04-22 13:00:00.000
69,70,2020-04-22 17:15:00,46,0.9,0,46,26.3,83,78,35.7,2020-04-22 13:15:00.000
70,71,2020-04-22 17:30:00,16,0.9,0,16,25.9,86,78,45.2,2020-04-22 13:30:00.000
71,72,2020-04-22 17:45:00,1,1.0,0,1,25.5,90,78,53.1,2020-04-22 13:45:00.000
72,73,2020-04-22 18:00:00,0,1.0,0,0,25.2,94,78,49.0,2020-04-22 14:00:00.000
73,74,2020-04-22 18:15:00,0,1.0,0,0,25.0,97,78,44.3,2020-04-22 14:15:00.000
74,75,2020-04-22 18:30:00,0,1.0,0,0,24.9,101,78,38.4,2020-04-22 14:30:00.000
75,76,2020-04-22 18:45:00,0,1.0,0,0,24.8,105,77,37.8,2020-04-22 14:45:00.000
76,77,2020-04-22 19:00:00,0,1.0,0,0,24.7,108,77,42.0,2020-04-22 15:00:00.000
77,78,2020-04-22 19:15:00,0,0.9,0,0,24.6,112,77,42.0,2020-04-22 15:15:00.000
78,79,2020-04-22 19:30:00,0,0.9,0,0,24.6,116,76,49.2,2020-04-22 15:30:00.000
79,80,2020-04-22 19:45:00,0,0.9,0,0,24.5,119,76,51.0,2020-04-22 15:45:00.000
80,81,2020-04-22 20:00:00,0,0.9,0,0,24.5,123,75,39.8,2020-04-22 16:00:00.000
81,82,2020-04-22 20:15:00,0,0.9,0,0,24.4,127,74,0.0,2020-04-22 16:15:00.000
82,83,2020-04-22 20:30:00,0,0.9,0,0,24.4,130,74,0.0,2020-04-22 16:30:00.000
83,84,2020-04-22 20:45:00,0,0.9,0,0,24.3,134,72,11.1,2020-04-22 16:45:00.000
84,85,2020-04-22 21:00:00,0,0.9,0,0,24.3,137,71,7.4,2020-04-22 17:00:00.000
85,86,2020-04-22 21:15:00,0,0.9,0,0,24.2,141,70,37.0,2020-04-22 17:15:00.000
86,87,2020-04-22 21:30:00,0,0.9,0,0,24.2,144,68,7.4,2020-04-22 17:30:00.000
87,88,2020-04-22 21:45:00,0,0.9,0,0,24.1,148,66,0.0,2020-04-22 17:45:00.000
88,89,2020-04-22 22:00:00,0,0.9,0,0,24.0,151,63,0.0,2020-04-22 18:00:00.000
89,90,2020-04-22 22:15:00,0,0.8,0,0,23.9,154,59,0.0,2020-04-22 18:15:00.000
90,91,2020-04-22 22:30:00,0,0.7,0,0,23.9,158,55,0.0,2020-04-22 18:30:00.000
91,92,2020-04-22 22:45:00,0,0.7,0,0,23.8,161,48,0.0,2020-04-22 18:45:00.000
92,93,2020-04-22 23:00:00,0,0.6,0,0,23.7,163,40,0.0,2020-04-22 19:00:00.000
93,94,2020-04-22 23:15:00,0,0.6,0,0,23.7,165,29,0.0,2020-04-22 19:15:00.000
94,95,2020-04-22 23:30:00,0,0.6,0,0,23.7,167,15,0.0,2020-04-22 19:30:00.000
95,96,2020-04-22 23:45:00,0,0.6,0,0,23.6,167,-1,0.0,2020-04-22 19:45:00.000
