,BLOCK_ID,DATA_DATETIME,GHI,WIND_SPEED,DNI,DHI,TEMPERATURE,ZENITH,AZIMUTH,CLOUD_OPACITY,ENTRY_TIME
0,1,2021-04-05 00:00:00,0,1.6,0,0,23.4,173,-24,41.2,2021-04-04 20:00:00.000
1,2,2021-04-05 00:15:00,0,1.5,0,0,23.3,171,-47,43.0,2021-04-04 20:15:00.000
2,3,2021-04-05 00:30:00,0,1.5,0,0,23.3,168,-60,55.0,2021-04-04 20:30:00.000
3,4,2021-04-05 00:45:00,0,1.5,0,0,23.2,165,-67,49.2,2021-04-04 20:45:00.000
4,5,2021-04-05 01:00:00,0,1.5,0,0,23.2,161,-71,49.8,2021-04-04 21:00:00.000
5,6,2021-04-05 01:15:00,0,1.5,0,0,23.2,158,-74,50.4,2021-04-04 21:15:00.000
6,7,2021-04-05 01:30:00,0,1.5,0,0,23.3,154,-76,52.8,2021-04-04 21:30:00.000
7,8,2021-04-05 01:45:00,0,1.5,0,0,23.3,150,-78,67.9,2021-04-04 21:45:00.000
8,9,2021-04-05 02:00:00,0,1.5,0,0,23.3,147,-79,55.0,2021-04-04 22:00:00.000
9,10,2021-04-05 02:15:00,0,1.5,0,0,23.3,143,-80,37.8,2021-04-04 22:15:00.000
10,11,2021-04-05 02:30:00,0,1.5,0,0,23.2,139,-81,54.8,2021-04-04 22:30:00.000
11,12,2021-04-05 02:45:00,0,1.4,0,0,23.2,136,-82,48.8,2021-04-04 22:45:00.000
12,13,2021-04-05 03:00:00,0,1.4,0,0,23.1,132,-82,45.2,2021-04-04 23:00:00.000
13,14,2021-04-05 03:15:00,0,1.5,0,0,23.1,128,-83,45.3,2021-04-04 23:15:00.000
14,15,2021-04-05 03:30:00,0,1.5,0,0,23.1,125,-83,47.4,2021-04-04 23:30:00.000
15,16,2021-04-05 03:45:00,0,1.5,0,0,23.0,121,-83,41.2,2021-04-04 23:45:00.000
16,17,2021-04-05 04:00:00,0,1.6,0,0,23.0,117,-84,38.4,2021-04-05 00:00:00.000
17,18,2021-04-05 04:15:00,0,1.6,0,0,23.0,113,-84,23.7,2021-04-05 00:15:00.000
18,19,2021-04-05 04:30:00,0,1.7,0,0,23.0,110,-84,25.4,2021-04-05 00:30:00.000
19,20,2021-04-05 04:45:00,0,1.7,0,0,23.1,106,-84,26.8,2021-04-05 00:45:00.000
20,21,2021-04-05 05:00:00,0,1.8,0,0,23.1,102,-84,47.8,2021-04-05 01:00:00.000
21,22,2021-04-05 05:15:00,0,1.8,0,0,23.1,98,-84,67.4,2021-04-05 01:15:00.000
22,23,2021-04-05 05:30:00,0,1.8,0,0,23.1,95,-85,49.0,2021-04-05 01:30:00.000
23,24,2021-04-05 05:45:00,1,1.8,0,1,23.1,91,-85,42.0,2021-04-05 01:45:00.000
24,25,2021-04-05 06:00:00,14,1.8,0,14,23.2,87,-85,42.0,2021-04-05 02:00:00.000
25,26,2021-04-05 06:15:00,43,1.8,0,43,23.6,84,-85,39.6,2021-04-05 02:15:00.000
26,27,2021-04-05 06:30:00,89,1.7,8,88,23.9,80,-85,29.2,2021-04-05 02:30:00.000
27,28,2021-04-05 06:45:00,132,1.7,85,109,24.3,76,-85,30.1,2021-04-05 02:45:00.000
28,29,2021-04-05 07:00:00,224,1.7,388,105,24.7,72,-85,10.0,2021-04-05 03:00:00.000
29,30,2021-04-05 07:15:00,298,1.9,568,93,25.2,69,-84,4.2,2021-04-05 03:15:00.000
30,31,2021-04-05 07:30:00,344,2.0,495,133,25.7,65,-84,8.4,2021-04-05 03:30:00.000
31,32,2021-04-05 07:45:00,405,2.1,539,145,26.2,61,-84,7.6,2021-04-05 03:45:00.000
32,33,2021-04-05 08:00:00,456,2.2,524,172,26.7,57,-84,9.0,2021-04-05 04:00:00.000
33,34,2021-04-05 08:15:00,477,2.4,397,242,27.2,54,-84,14.9,2021-04-05 04:15:00.000
34,35,2021-04-05 08:30:00,542,2.5,476,235,27.7,50,-83,12.2,2021-04-05 04:30:00.000
35,36,2021-04-05 08:45:00,548,2.6,336,314,28.2,46,-83,18.6,2021-04-05 04:45:00.000
36,37,2021-04-05 09:00:00,588,2.7,341,337,28.6,42,-83,18.6,2021-04-05 05:00:00.000
37,38,2021-04-05 09:15:00,669,2.8,478,297,28.9,39,-82,13.2,2021-04-05 05:15:00.000
38,39,2021-04-05 09:30:00,679,2.9,394,356,29.1,35,-81,16.8,2021-04-05 05:30:00.000
39,40,2021-04-05 09:45:00,672,3.0,304,411,29.4,31,-81,21.6,2021-04-05 05:45:00.000
40,41,2021-04-05 10:00:00,820,3.1,630,262,29.6,28,-79,8.2,2021-04-05 06:00:00.000
41,42,2021-04-05 10:15:00,743,3.2,339,433,29.7,24,-78,19.6,2021-04-05 06:15:00.000
42,43,2021-04-05 10:30:00,752,3.2,309,462,29.8,20,-76,21.0,2021-04-05 06:30:00.000
43,44,2021-04-05 10:45:00,823,3.3,440,401,29.9,17,-73,15.6,2021-04-05 06:45:00.000
44,45,2021-04-05 11:00:00,888,3.3,573,330,30.0,13,-68,10.6,2021-04-05 07:00:00.000
45,46,2021-04-05 11:15:00,971,3.3,782,201,30.2,10,-60,3.5,2021-04-05 07:15:00.000
46,47,2021-04-05 11:30:00,1015,3.4,892,129,30.3,7,-44,0.0,2021-04-05 07:30:00.000
47,48,2021-04-05 11:45:00,983,3.4,782,204,30.5,5,-11,3.5,2021-04-05 07:45:00.000
48,49,2021-04-05 12:00:00,1017,3.4,892,130,30.6,6,29,0.0,2021-04-05 08:00:00.000
49,50,2021-04-05 12:15:00,1004,3.5,867,146,30.6,8,53,0.7,2021-04-05 08:15:00.000
50,51,2021-04-05 12:30:00,1000,3.5,887,130,30.7,11,64,0.0,2021-04-05 08:30:00.000
51,52,2021-04-05 12:45:00,912,3.5,659,275,30.7,15,71,7.3,2021-04-05 08:45:00.000
52,53,2021-04-05 13:00:00,847,3.6,525,349,30.7,18,74,12.0,2021-04-05 09:00:00.000
53,54,2021-04-05 13:15:00,739,3.6,298,464,30.6,22,77,21.1,2021-04-05 09:15:00.000
54,55,2021-04-05 13:30:00,778,3.6,459,365,30.5,26,79,14.2,2021-04-05 09:30:00.000
55,56,2021-04-05 13:45:00,808,3.6,639,252,30.5,29,80,7.3,2021-04-05 09:45:00.000
56,57,2021-04-05 14:00:00,831,3.6,836,130,30.3,33,81,0.2,2021-04-05 10:00:00.000
57,58,2021-04-05 14:15:00,765,3.6,737,176,30.2,37,82,3.0,2021-04-05 10:15:00.000
58,59,2021-04-05 14:30:00,626,3.5,392,326,30.0,41,82,15.8,2021-04-05 10:30:00.000
59,60,2021-04-05 14:45:00,563,3.5,311,341,29.9,44,83,18.6,2021-04-05 10:45:00.000
60,61,2021-04-05 15:00:00,561,3.4,445,263,29.7,48,83,12.2,2021-04-05 11:00:00.000
61,62,2021-04-05 15:15:00,525,3.4,487,222,29.4,52,83,9.9,2021-04-05 11:15:00.000
62,63,2021-04-05 15:30:00,432,3.4,293,265,29.2,55,84,17.6,2021-04-05 11:30:00.000
63,64,2021-04-05 15:45:00,342,3.4,112,284,28.9,59,84,26.2,2021-04-05 11:45:00.000
64,65,2021-04-05 16:00:00,278,3.3,28,265,28.6,63,84,30.6,2021-04-05 12:00:00.000
65,66,2021-04-05 16:15:00,191,3.2,0,191,28.2,67,84,43.7,2021-04-05 12:15:00.000
66,67,2021-04-05 16:30:00,147,3.1,0,147,27.8,70,84,46.0,2021-04-05 12:30:00.000
67,68,2021-04-05 16:45:00,124,3.0,0,124,27.5,74,84,40.7,2021-04-05 12:45:00.000
68,69,2021-04-05 17:00:00,79,2.9,0,79,27.0,78,84,47.2,2021-04-05 13:00:00.000
69,70,2021-04-05 17:15:00,49,2.8,0,49,26.5,82,84,46.7,2021-04-05 13:15:00.000
70,71,2021-04-05 17:30:00,13,2.8,0,13,26.0,85,84,72.4,2021-04-05 13:30:00.000
71,72,2021-04-05 17:45:00,2,2.7,0,2,25.5,89,84,81.2,2021-04-05 13:45:00.000
72,73,2021-04-05 18:00:00,0,2.6,0,0,25.1,93,84,74.4,2021-04-05 14:00:00.000
73,74,2021-04-05 18:15:00,0,2.6,0,0,24.9,96,84,77.1,2021-04-05 14:15:00.000
74,75,2021-04-05 18:30:00,0,2.5,0,0,24.7,100,84,74.2,2021-04-05 14:30:00.000
75,76,2021-04-05 18:45:00,0,2.5,0,0,24.6,104,84,80.2,2021-04-05 14:45:00.000
76,77,2021-04-05 19:00:00,0,2.4,0,0,24.4,108,84,97.0,2021-04-05 15:00:00.000
77,78,2021-04-05 19:15:00,0,2.3,0,0,24.3,111,84,61.1,2021-04-05 15:15:00.000
78,79,2021-04-05 19:30:00,0,2.2,0,0,24.3,115,84,53.4,2021-04-05 15:30:00.000
79,80,2021-04-05 19:45:00,0,2.2,0,0,24.2,119,83,64.6,2021-04-05 15:45:00.000
80,81,2021-04-05 20:00:00,0,2.1,0,0,24.1,123,83,59.6,2021-04-05 16:00:00.000
81,82,2021-04-05 20:15:00,0,2.0,0,0,24.0,126,83,58.9,2021-04-05 16:15:00.000
82,83,2021-04-05 20:30:00,0,2.0,0,0,23.9,130,82,94.6,2021-04-05 16:30:00.000
83,84,2021-04-05 20:45:00,0,1.9,0,0,23.8,134,82,85.0,2021-04-05 16:45:00.000
84,85,2021-04-05 21:00:00,0,1.9,0,0,23.7,137,81,73.4,2021-04-05 17:00:00.000
85,86,2021-04-05 21:15:00,0,1.8,0,0,23.6,141,80,64.8,2021-04-05 17:15:00.000
86,87,2021-04-05 21:30:00,0,1.8,0,0,23.6,145,79,63.4,2021-04-05 17:30:00.000
87,88,2021-04-05 21:45:00,0,1.7,0,0,23.5,148,78,55.4,2021-04-05 17:45:00.000
88,89,2021-04-05 22:00:00,0,1.7,0,0,23.5,152,77,57.2,2021-04-05 18:00:00.000
89,90,2021-04-05 22:15:00,0,1.6,0,0,23.4,156,75,60.5,2021-04-05 18:15:00.000
90,91,2021-04-05 22:30:00,0,1.6,0,0,23.4,159,72,63.2,2021-04-05 18:30:00.000
91,92,2021-04-05 22:45:00,0,1.6,0,0,23.3,163,68,59.5,2021-04-05 18:45:00.000
92,93,2021-04-05 23:00:00,0,1.6,0,0,23.3,166,63,70.6,2021-04-05 19:00:00.000
93,94,2021-04-05 23:15:00,0,1.6,0,0,23.2,169,53,70.6,2021-04-05 19:15:00.000
94,95,2021-04-05 23:30:00,0,1.6,0,0,23.2,172,36,79.8,2021-04-05 19:30:00.000
95,96,2021-04-05 23:45:00,0,1.6,0,0,23.1,174,9,83.8,2021-04-05 19:45:00.000
