<?xml version="1.0" standalone="no"?>
<!DOCTYPE svg PUBLIC "-//W3C//DTD SVG 1.1//EN" "http://www.w3.org/Graphics/SVG/1.1/DTD/svg11.dtd">
<svg xmlns="http://www.w3.org/2000/svg">
<metadata>Copyright (C) 2014 by original authors @ fontello.com</metadata>
<defs>
<font id="ztjalali" horiz-adv-x="1000" >
<font-face font-family="ztjalali" font-weight="400" font-stretch="normal" units-per-em="1000" ascent="850" descent="-150" />
<missing-glyph horiz-adv-x="1000" />
<glyph glyph-name="ere" unicode="&#xe800;" d="m501 741c-216 0-392-176-392-392 0-216 176-392 392-392 216 0 392 176 392 392 0 216-176 392-392 392z m292-334c-8-20-95-21-124 3-29 24-3 71 37 73 40 2 95-55 87-76z m-151-311c-132-82-306 5-311-2-4-7 92-68 198-102-10 0-19-1-28-1-104 0-198 45-263 116 25 1 212 7 253 43 30 17 75 91 70 174-6 113-68 237-140 229-83-9-131-147-120-231 5-39 37-56 61-60 72-11 131 25 136 23-15-80-205-82-205-82l-117-3c0 0 0 0 0 0-21 45-32 96-32 149 0 131 70 245 175 307l105-60 64 110c4 0 9 0 13 0 110 0 208-49 274-127-12 8-25 13-39 14-73 8-167-245-86-292 66-39 134 2 165 11 13-16-41-135-173-216z m-161 282c-3-11-62-25-115-10-53 16-21 79 25 80 46 1 92-60 90-70z" horiz-adv-x="1000" />
<glyph glyph-name="zakrot" unicode="&#xe801;" d="m502 741c-217 0-393-176-393-393 0-217 176-392 393-392 217 0 392 175 392 392 0 217-175 393-392 393z m-314-326c72-10 192-30 310-61 74-20 147-45 208-67-58-3-126-8-194-15-124-12-246-32-309-43-14 37-22 77-22 119 0 23 2 46 7 67z m84-291c46-9 103-21 159-36 57-16 113-33 158-49-28-8-57-12-87-12-90 0-172 37-230 97z m408-42c-41 15-135 49-230 74-35 9-70 18-102 25 52 7 112 15 171 21 104 10 209 16 277 19-24-57-65-105-116-139z m-162 340c-116 31-235 51-308 61 51 110 163 186 292 186 177 0 321-143 321-321 0-10-1-20-2-30-67 27-183 72-303 104z" horiz-adv-x="1000" />
</font>
</defs>
</svg>