<svg xmlns="http://www.w3.org/2000/svg" width="33" height="33" viewBox="0 0 33 33">
  <g id="Group_11334" data-name="Group 11334" transform="translate(-303 -640)">
    <g id="Group_11335" data-name="Group 11335">
      <rect id="Rectangle_134" data-name="Rectangle 134" width="13" height="8" rx="1" transform="translate(313 640)" fill="#393939"/>
      <rect id="Rectangle_135" data-name="Rectangle 135" width="9" height="5" rx="1" transform="translate(315 642)" fill="#f9f9f9"/>
    </g>
    <g id="Group_11333" data-name="Group 11333">
      <rect id="Rectangle_131" data-name="Rectangle 131" width="33" height="27" rx="4" transform="translate(303 646)" fill="#393939"/>
    </g>
    <g id="Rectangle_132" data-name="Rectangle 132" transform="translate(328 646)" fill="#f9f9f9" stroke="#f9f9f9" stroke-width="1">
      <rect width="3" height="27" stroke="none"/>
      <rect x="0.5" y="0.5" width="2" height="26" fill="none"/>
    </g>
    <g id="Rectangle_133" data-name="Rectangle 133" transform="translate(308 646)" fill="#f9f9f9" stroke="#f9f9f9" stroke-width="1">
      <rect width="3" height="27" stroke="none"/>
      <rect x="0.5" y="0.5" width="2" height="26" fill="none"/>
    </g>
  </g>
</svg>
