{'id': '15887', 'customer_id': '528', 'accepted': False}
{'id': '30081', 'customer_id': '154', 'accepted': False}
{'id': '26540', 'customer_id': '426', 'accepted': True}
{'id': '10694', 'customer_id': '1', 'accepted': False}
{'id': '15089', 'customer_id': '205', 'accepted': True}
{'id': '3211', 'customer_id': '409', 'accepted': True}
{'id': '27106', 'customer_id': '630', 'accepted': True}
{'id': '7528', 'customer_id': '273', 'accepted': False}
{'id': '27947', 'customer_id': '800', 'accepted': False}
{'id': '20790', 'customer_id': '647', 'accepted': False}
{'id': '12408', 'customer_id': '698', 'accepted': False}
{'id': '11429', 'customer_id': '528', 'accepted': False}
{'id': '16631', 'customer_id': '630', 'accepted': False}
{'id': '22413', 'customer_id': '443', 'accepted': False}
{'id': '26078', 'customer_id': '800', 'accepted': False}
{'id': '11353', 'customer_id': '154', 'accepted': False}
{'id': '19189', 'customer_id': '358', 'accepted': False}
{'id': '18705', 'customer_id': '1', 'accepted': False}
{'id': '25703', 'customer_id': '647', 'accepted': False}
{'id': '20510', 'customer_id': '18', 'accepted': True}
{'id': '28266', 'customer_id': '103', 'accepted': True}
{'id': '3202', 'customer_id': '188', 'accepted': False}
{'id': '31563', 'customer_id': '783', 'accepted': True}
{'id': '9718', 'customer_id': '35', 'accepted': True}
{'id': '5577', 'customer_id': '749', 'accepted': False}
{'id': '10420', 'customer_id': '783', 'accepted': True}
{'id': '27137', 'customer_id': '52', 'accepted': False}
{'id': '22059', 'customer_id': '698', 'accepted': True}
{'id': '5891', 'customer_id': '732', 'accepted': False}
{'id': '21336', 'customer_id': '477', 'accepted': False}
{'id': '27940', 'customer_id': '120', 'accepted': False}
{'id': '7843', 'customer_id': '35', 'accepted': False}
{'id': '15425', 'customer_id': '817', 'accepted': True}
{'id': '21757', 'customer_id': '256', 'accepted': False}
{'id': '15410', 'customer_id': '171', 'accepted': False}
{'id': '11632', 'customer_id': '681', 'accepted': False}
{'id': '6591', 'customer_id': '52', 'accepted': True}
{'id': '23297', 'customer_id': '579', 'accepted': True}
{'id': '29271', 'customer_id': '630', 'accepted': False}
{'id': '13802', 'customer_id': '443', 'accepted': True}
{'id': '20066', 'customer_id': '494', 'accepted': True}
{'id': '27086', 'customer_id': '732', 'accepted': True}
{'id': '22052', 'customer_id': '528', 'accepted': False}
{'id': '13710', 'customer_id': '596', 'accepted': True}
{'id': '25528', 'customer_id': '834', 'accepted': True}
{'id': '29903', 'customer_id': '579', 'accepted': False}
{'id': '21612', 'customer_id': '800', 'accepted': False}
{'id': '5839', 'customer_id': '273', 'accepted': False}
{'id': '3051', 'customer_id': '613', 'accepted': False}
{'id': '1351', 'customer_id': '681', 'accepted': False}
{'id': '24305', 'customer_id': '239', 'accepted': True}
{'id': '20090', 'customer_id': '18', 'accepted': False}
{'id': '27767', 'customer_id': '137', 'accepted': False}
{'id': '4154', 'customer_id': '477', 'accepted': False}
{'id': '1342', 'customer_id': '392', 'accepted': True}
{'id': '27968', 'customer_id': '732', 'accepted': False}
{'id': '6535', 'customer_id': '171', 'accepted': True}
{'id': '25162', 'customer_id': '69', 'accepted': True}
{'id': '21371', 'customer_id': '256', 'accepted': False}
{'id': '1513', 'customer_id': '511', 'accepted': False}
{'id': '12720', 'customer_id': '154', 'accepted': True}
{'id': '16984', 'customer_id': '341', 'accepted': False}
{'id': '16565', 'customer_id': '171', 'accepted': False}
{'id': '23920', 'customer_id': '494', 'accepted': True}
{'id': '11695', 'customer_id': '103', 'accepted': True}
{'id': '11456', 'customer_id': '1', 'accepted': False}
{'id': '30831', 'customer_id': '715', 'accepted': False}
{'id': '25320', 'customer_id': '613', 'accepted': False}
{'id': '3447', 'customer_id': '205', 'accepted': False}
{'id': '4611', 'customer_id': '647', 'accepted': True}
{'id': '2318', 'customer_id': '647', 'accepted': True}
{'id': '5807', 'customer_id': '324', 'accepted': True}
{'id': '30675', 'customer_id': '35', 'accepted': True}
{'id': '10795', 'customer_id': '52', 'accepted': False}
{'id': '30470', 'customer_id': '732', 'accepted': True}
{'id': '26632', 'customer_id': '613', 'accepted': False}
{'id': '5922', 'customer_id': '171', 'accepted': True}
{'id': '6060', 'customer_id': '188', 'accepted': True}
{'id': '24954', 'customer_id': '494', 'accepted': False}
{'id': '5551', 'customer_id': '171', 'accepted': False}
{'id': '23516', 'customer_id': '120', 'accepted': False}
{'id': '4637', 'customer_id': '664', 'accepted': True}
{'id': '4804', 'customer_id': '188', 'accepted': False}
{'id': '15215', 'customer_id': '154', 'accepted': False}
{'id': '11040', 'customer_id': '239', 'accepted': False}
{'id': '8000', 'customer_id': '681', 'accepted': True}
{'id': '14235', 'customer_id': '392', 'accepted': True}
{'id': '24390', 'customer_id': '358', 'accepted': False}
{'id': '4070', 'customer_id': '324', 'accepted': False}
{'id': '5472', 'customer_id': '647', 'accepted': False}
{'id': '16174', 'customer_id': '766', 'accepted': False}
{'id': '25293', 'customer_id': '409', 'accepted': True}
{'id': '29352', 'customer_id': '817', 'accepted': False}
{'id': '6371', 'customer_id': '375', 'accepted': True}
{'id': '15265', 'customer_id': '18', 'accepted': True}
{'id': '8592', 'customer_id': '494', 'accepted': True}
{'id': '16721', 'customer_id': '528', 'accepted': True}
{'id': '5343', 'customer_id': '188', 'accepted': True}
{'id': '7859', 'customer_id': '273', 'accepted': False}
{'id': '1008', 'customer_id': '137', 'accepted': False}
{'id': '12774', 'customer_id': '52', 'accepted': True}
{'id': '11874', 'customer_id': '426', 'accepted': True}
{'id': '12286', 'customer_id': '630', 'accepted': True}
{'id': '14658', 'customer_id': '239', 'accepted': False}
{'id': '3723', 'customer_id': '783', 'accepted': False}
{'id': '23657', 'customer_id': '630', 'accepted': False}
{'id': '20531', 'customer_id': '664', 'accepted': False}
{'id': '6928', 'customer_id': '562', 'accepted': False}
{'id': '1477', 'customer_id': '443', 'accepted': True}
{'id': '6051', 'customer_id': '613', 'accepted': False}
{'id': '8789', 'customer_id': '205', 'accepted': False}
{'id': '17430', 'customer_id': '630', 'accepted': False}
{'id': '29159', 'customer_id': '477', 'accepted': True}
{'id': '29418', 'customer_id': '35', 'accepted': False}
{'id': '15653', 'customer_id': '358', 'accepted': False}
{'id': '11081', 'customer_id': '341', 'accepted': False}
{'id': '1509', 'customer_id': '443', 'accepted': False}
{'id': '3695', 'customer_id': '103', 'accepted': True}
{'id': '24477', 'customer_id': '579', 'accepted': True}
{'id': '22175', 'customer_id': '477', 'accepted': True}
{'id': '31808', 'customer_id': '511', 'accepted': False}
{'id': '558', 'customer_id': '256', 'accepted': False}
{'id': '29023', 'customer_id': '715', 'accepted': True}
{'id': '28972', 'customer_id': '392', 'accepted': False}
{'id': '13527', 'customer_id': '137', 'accepted': False}
{'id': '25513', 'customer_id': '817', 'accepted': True}
{'id': '31306', 'customer_id': '409', 'accepted': False}
{'id': '16332', 'customer_id': '528', 'accepted': False}
{'id': '31654', 'customer_id': '35', 'accepted': True}
{'id': '28686', 'customer_id': '511', 'accepted': False}
{'id': '12604', 'customer_id': '205', 'accepted': False}
{'id': '12398', 'customer_id': '732', 'accepted': True}
{'id': '20922', 'customer_id': '256', 'accepted': False}
{'id': '806', 'customer_id': '749', 'accepted': False}
{'id': '31420', 'customer_id': '409', 'accepted': True}
{'id': '4007', 'customer_id': '154', 'accepted': False}
{'id': '24853', 'customer_id': '120', 'accepted': True}
{'id': '1740', 'customer_id': '426', 'accepted': True}
{'id': '18545', 'customer_id': '239', 'accepted': True}
{'id': '27131', 'customer_id': '528', 'accepted': False}
{'id': '21629', 'customer_id': '596', 'accepted': False}
{'id': '5092', 'customer_id': '766', 'accepted': True}
{'id': '12377', 'customer_id': '426', 'accepted': False}
{'id': '27017', 'customer_id': '392', 'accepted': True}
{'id': '27780', 'customer_id': '120', 'accepted': True}
{'id': '22474', 'customer_id': '103', 'accepted': False}
{'id': '10894', 'customer_id': '392', 'accepted': False}
{'id': '3574', 'customer_id': '562', 'accepted': False}
{'id': '5395', 'customer_id': '511', 'accepted': False}
{'id': '7650', 'customer_id': '392', 'accepted': False}
{'id': '17645', 'customer_id': '460', 'accepted': False}
{'id': '198', 'customer_id': '137', 'accepted': False}
{'id': '31354', 'customer_id': '494', 'accepted': False}
{'id': '21326', 'customer_id': '630', 'accepted': False}
{'id': '23267', 'customer_id': '358', 'accepted': True}
{'id': '19488', 'customer_id': '834', 'accepted': False}
{'id': '16401', 'customer_id': '409', 'accepted': False}
{'id': '21596', 'customer_id': '392', 'accepted': False}
{'id': '12110', 'customer_id': '426', 'accepted': False}
{'id': '23214', 'customer_id': '222', 'accepted': True}
{'id': '29446', 'customer_id': '426', 'accepted': True}
{'id': '13063', 'customer_id': '749', 'accepted': True}
{'id': '13488', 'customer_id': '630', 'accepted': False}
{'id': '3026', 'customer_id': '426', 'accepted': False}
{'id': '11114', 'customer_id': '1', 'accepted': False}
{'id': '23300', 'customer_id': '443', 'accepted': False}
{'id': '10619', 'customer_id': '579', 'accepted': False}
{'id': '1045', 'customer_id': '222', 'accepted': False}
{'id': '4239', 'customer_id': '715', 'accepted': False}
{'id': '18574', 'customer_id': '358', 'accepted': True}
{'id': '7485', 'customer_id': '1', 'accepted': False}
{'id': '12560', 'customer_id': '239', 'accepted': True}
{'id': '23582', 'customer_id': '324', 'accepted': False}
{'id': '18516', 'customer_id': '222', 'accepted': False}
{'id': '13555', 'customer_id': '18', 'accepted': False}
{'id': '8217', 'customer_id': '222', 'accepted': False}
{'id': '25179', 'customer_id': '545', 'accepted': False}
{'id': '29740', 'customer_id': '562', 'accepted': False}
{'id': '7552', 'customer_id': '579', 'accepted': False}
{'id': '4647', 'customer_id': '630', 'accepted': False}
{'id': '18346', 'customer_id': '205', 'accepted': False}
{'id': '3356', 'customer_id': '69', 'accepted': False}
{'id': '17223', 'customer_id': '664', 'accepted': True}
{'id': '13339', 'customer_id': '239', 'accepted': True}
{'id': '21953', 'customer_id': '324', 'accepted': False}
{'id': '27985', 'customer_id': '749', 'accepted': True}
{'id': '5401', 'customer_id': '222', 'accepted': False}
{'id': '8184', 'customer_id': '120', 'accepted': False}
{'id': '28721', 'customer_id': '562', 'accepted': True}
{'id': '17540', 'customer_id': '256', 'accepted': True}
{'id': '6591', 'customer_id': '715', 'accepted': True}
{'id': '23707', 'customer_id': '18', 'accepted': False}
{'id': '16516', 'customer_id': '766', 'accepted': False}
{'id': '7755', 'customer_id': '562', 'accepted': False}
{'id': '11694', 'customer_id': '681', 'accepted': False}
{'id': '29417', 'customer_id': '681', 'accepted': False}
{'id': '2370', 'customer_id': '239', 'accepted': True}
{'id': '20476', 'customer_id': '307', 'accepted': True}
{'id': '8825', 'customer_id': '783', 'accepted': False}
{'id': '30243', 'customer_id': '205', 'accepted': True}
{'id': '28713', 'customer_id': '358', 'accepted': True}
{'id': '10870', 'customer_id': '732', 'accepted': False}
{'id': '5841', 'customer_id': '613', 'accepted': False}
{'id': '23585', 'customer_id': '817', 'accepted': False}
{'id': '24718', 'customer_id': '137', 'accepted': False}
{'id': '15815', 'customer_id': '596', 'accepted': False}
{'id': '356', 'customer_id': '817', 'accepted': False}
{'id': '25099', 'customer_id': '409', 'accepted': False}
{'id': '25161', 'customer_id': '18', 'accepted': False}
{'id': '10524', 'customer_id': '715', 'accepted': False}
{'id': '7063', 'customer_id': '307', 'accepted': True}
{'id': '31350', 'customer_id': '817', 'accepted': False}
{'id': '3390', 'customer_id': '35', 'accepted': True}
{'id': '26760', 'customer_id': '834', 'accepted': False}
{'id': '28351', 'customer_id': '171', 'accepted': False}
{'id': '2722', 'customer_id': '18', 'accepted': True}
{'id': '30013', 'customer_id': '579', 'accepted': False}
{'id': '15817', 'customer_id': '817', 'accepted': False}
{'id': '12053', 'customer_id': '681', 'accepted': False}
{'id': '29006', 'customer_id': '18', 'accepted': False}
{'id': '13577', 'customer_id': '358', 'accepted': False}
{'id': '25407', 'customer_id': '290', 'accepted': False}
{'id': '16907', 'customer_id': '1', 'accepted': False}
{'id': '28835', 'customer_id': '766', 'accepted': False}
{'id': '24904', 'customer_id': '511', 'accepted': False}
{'id': '4775', 'customer_id': '35', 'accepted': True}
{'id': '21453', 'customer_id': '120', 'accepted': True}
{'id': '13201', 'customer_id': '392', 'accepted': True}
{'id': '31045', 'customer_id': '1', 'accepted': False}
{'id': '6138', 'customer_id': '834', 'accepted': True}
{'id': '5775', 'customer_id': '256', 'accepted': False}
{'id': '12860', 'customer_id': '681', 'accepted': False}
{'id': '14551', 'customer_id': '732', 'accepted': False}
{'id': '15281', 'customer_id': '477', 'accepted': True}
{'id': '4615', 'customer_id': '494', 'accepted': False}
{'id': '23648', 'customer_id': '188', 'accepted': True}
{'id': '836', 'customer_id': '732', 'accepted': True}
{'id': '29836', 'customer_id': '171', 'accepted': False}
{'id': '4128', 'customer_id': '562', 'accepted': False}
{'id': '30779', 'customer_id': '205', 'accepted': False}
{'id': '13787', 'customer_id': '732', 'accepted': True}
{'id': '7723', 'customer_id': '392', 'accepted': False}
{'id': '28277', 'customer_id': '681', 'accepted': False}
{'id': '5847', 'customer_id': '18', 'accepted': True}
{'id': '28659', 'customer_id': '120', 'accepted': False}
{'id': '16152', 'customer_id': '783', 'accepted': True}
{'id': '1237', 'customer_id': '647', 'accepted': False}
{'id': '25138', 'customer_id': '715', 'accepted': False}
{'id': '30144', 'customer_id': '800', 'accepted': False}
{'id': '3727', 'customer_id': '137', 'accepted': True}
{'id': '1352', 'customer_id': '69', 'accepted': False}
{'id': '31438', 'customer_id': '18', 'accepted': False}
{'id': '23780', 'customer_id': '647', 'accepted': False}
{'id': '4641', 'customer_id': '358', 'accepted': True}
{'id': '3636', 'customer_id': '460', 'accepted': False}
{'id': '29044', 'customer_id': '579', 'accepted': False}
{'id': '24523', 'customer_id': '817', 'accepted': False}
{'id': '10362', 'customer_id': '766', 'accepted': True}
{'id': '27107', 'customer_id': '494', 'accepted': False}
{'id': '15495', 'customer_id': '545', 'accepted': False}
{'id': '28989', 'customer_id': '477', 'accepted': False}
{'id': '30915', 'customer_id': '698', 'accepted': True}
{'id': '1920', 'customer_id': '239', 'accepted': True}
{'id': '14804', 'customer_id': '52', 'accepted': True}
{'id': '8879', 'customer_id': '171', 'accepted': False}
{'id': '10385', 'customer_id': '256', 'accepted': False}
{'id': '29325', 'customer_id': '222', 'accepted': True}
{'id': '25380', 'customer_id': '18', 'accepted': False}
{'id': '26832', 'customer_id': '205', 'accepted': True}
{'id': '19438', 'customer_id': '239', 'accepted': True}
{'id': '27809', 'customer_id': '647', 'accepted': False}
{'id': '26587', 'customer_id': '103', 'accepted': False}
{'id': '1244', 'customer_id': '137', 'accepted': False}
{'id': '7243', 'customer_id': '783', 'accepted': False}
{'id': '4344', 'customer_id': '392', 'accepted': True}
{'id': '7806', 'customer_id': '1', 'accepted': False}
{'id': '21378', 'customer_id': '222', 'accepted': False}
{'id': '31140', 'customer_id': '188', 'accepted': False}
{'id': '4444', 'customer_id': '477', 'accepted': False}
{'id': '26383', 'customer_id': '205', 'accepted': False}
{'id': '8971', 'customer_id': '596', 'accepted': True}
{'id': '29004', 'customer_id': '137', 'accepted': True}
{'id': '23816', 'customer_id': '562', 'accepted': True}
{'id': '17556', 'customer_id': '783', 'accepted': False}
{'id': '23317', 'customer_id': '273', 'accepted': False}
{'id': '21203', 'customer_id': '460', 'accepted': False}
{'id': '30784', 'customer_id': '188', 'accepted': False}
{'id': '2111', 'customer_id': '494', 'accepted': False}
{'id': '17650', 'customer_id': '69', 'accepted': True}
{'id': '17247', 'customer_id': '698', 'accepted': True}
{'id': '13464', 'customer_id': '630', 'accepted': False}
{'id': '8403', 'customer_id': '120', 'accepted': True}
{'id': '11617', 'customer_id': '647', 'accepted': False}
{'id': '19366', 'customer_id': '443', 'accepted': True}
{'id': '9585', 'customer_id': '86', 'accepted': False}
{'id': '21341', 'customer_id': '494', 'accepted': False}
{'id': '26319', 'customer_id': '69', 'accepted': False}
{'id': '7836', 'customer_id': '562', 'accepted': True}
{'id': '5330', 'customer_id': '52', 'accepted': True}
{'id': '13672', 'customer_id': '120', 'accepted': False}
{'id': '17691', 'customer_id': '817', 'accepted': False}
{'id': '5472', 'customer_id': '630', 'accepted': False}
{'id': '15004', 'customer_id': '494', 'accepted': False}
{'id': '22118', 'customer_id': '664', 'accepted': True}
{'id': '13650', 'customer_id': '137', 'accepted': True}
{'id': '6817', 'customer_id': '477', 'accepted': False}
{'id': '10269', 'customer_id': '222', 'accepted': True}
{'id': '5952', 'customer_id': '171', 'accepted': True}
{'id': '209', 'customer_id': '375', 'accepted': False}
{'id': '13388', 'customer_id': '630', 'accepted': True}
{'id': '21933', 'customer_id': '307', 'accepted': False}
{'id': '6966', 'customer_id': '562', 'accepted': False}
{'id': '11521', 'customer_id': '409', 'accepted': False}
{'id': '146', 'customer_id': '817', 'accepted': False}
{'id': '21963', 'customer_id': '69', 'accepted': True}
{'id': '25859', 'customer_id': '698', 'accepted': True}
{'id': '16999', 'customer_id': '800', 'accepted': False}
{'id': '13925', 'customer_id': '834', 'accepted': False}
{'id': '20830', 'customer_id': '477', 'accepted': False}
{'id': '19602', 'customer_id': '290', 'accepted': True}
{'id': '14972', 'customer_id': '528', 'accepted': True}
{'id': '15605', 'customer_id': '545', 'accepted': False}
{'id': '30593', 'customer_id': '596', 'accepted': False}
{'id': '24816', 'customer_id': '426', 'accepted': True}
{'id': '18076', 'customer_id': '256', 'accepted': False}
{'id': '2641', 'customer_id': '749', 'accepted': False}
{'id': '31158', 'customer_id': '239', 'accepted': False}
{'id': '12237', 'customer_id': '681', 'accepted': True}
{'id': '20411', 'customer_id': '749', 'accepted': True}
{'id': '9011', 'customer_id': '409', 'accepted': True}
{'id': '20182', 'customer_id': '715', 'accepted': False}
{'id': '18470', 'customer_id': '443', 'accepted': False}
{'id': '21185', 'customer_id': '205', 'accepted': False}
{'id': '10822', 'customer_id': '222', 'accepted': False}
{'id': '8964', 'customer_id': '120', 'accepted': False}
{'id': '9154', 'customer_id': '35', 'accepted': True}
{'id': '20529', 'customer_id': '800', 'accepted': True}
{'id': '5349', 'customer_id': '579', 'accepted': True}
{'id': '22496', 'customer_id': '290', 'accepted': False}
{'id': '12972', 'customer_id': '375', 'accepted': True}
{'id': '7893', 'customer_id': '817', 'accepted': False}
{'id': '16934', 'customer_id': '766', 'accepted': False}
{'id': '28775', 'customer_id': '86', 'accepted': False}
{'id': '1827', 'customer_id': '698', 'accepted': True}
{'id': '31916', 'customer_id': '766', 'accepted': False}
{'id': '18610', 'customer_id': '715', 'accepted': False}
{'id': '25203', 'customer_id': '732', 'accepted': False}
{'id': '23929', 'customer_id': '69', 'accepted': True}
{'id': '28437', 'customer_id': '681', 'accepted': False}
{'id': '5140', 'customer_id': '52', 'accepted': True}
{'id': '11526', 'customer_id': '766', 'accepted': False}
{'id': '13865', 'customer_id': '715', 'accepted': False}
{'id': '2192', 'customer_id': '35', 'accepted': True}
{'id': '23481', 'customer_id': '647', 'accepted': False}
{'id': '25684', 'customer_id': '647', 'accepted': False}
{'id': '28467', 'customer_id': '579', 'accepted': False}
{'id': '28306', 'customer_id': '426', 'accepted': False}
{'id': '24527', 'customer_id': '273', 'accepted': False}
{'id': '28107', 'customer_id': '358', 'accepted': False}
{'id': '20805', 'customer_id': '86', 'accepted': False}
{'id': '17513', 'customer_id': '511', 'accepted': False}
{'id': '16075', 'customer_id': '171', 'accepted': False}
{'id': '10912', 'customer_id': '273', 'accepted': False}
{'id': '7488', 'customer_id': '494', 'accepted': True}
{'id': '10083', 'customer_id': '545', 'accepted': False}
{'id': '24269', 'customer_id': '800', 'accepted': True}
{'id': '17359', 'customer_id': '358', 'accepted': False}
{'id': '4555', 'customer_id': '749', 'accepted': False}
{'id': '20574', 'customer_id': '222', 'accepted': False}
{'id': '17709', 'customer_id': '800', 'accepted': False}
{'id': '20025', 'customer_id': '86', 'accepted': False}
{'id': '16192', 'customer_id': '528', 'accepted': False}
{'id': '21107', 'customer_id': '171', 'accepted': False}
{'id': '18680', 'customer_id': '358', 'accepted': False}
{'id': '7275', 'customer_id': '256', 'accepted': False}
{'id': '14130', 'customer_id': '562', 'accepted': False}
{'id': '13856', 'customer_id': '35', 'accepted': False}
{'id': '3099', 'customer_id': '664', 'accepted': False}
{'id': '12343', 'customer_id': '630', 'accepted': True}
{'id': '5335', 'customer_id': '545', 'accepted': False}
{'id': '26134', 'customer_id': '358', 'accepted': False}
{'id': '22501', 'customer_id': '273', 'accepted': False}
{'id': '3115', 'customer_id': '477', 'accepted': False}
{'id': '3722', 'customer_id': '817', 'accepted': False}
{'id': '4956', 'customer_id': '698', 'accepted': False}
{'id': '19702', 'customer_id': '834', 'accepted': True}
{'id': '29312', 'customer_id': '188', 'accepted': False}
{'id': '17214', 'customer_id': '273', 'accepted': False}
{'id': '24401', 'customer_id': '103', 'accepted': True}
{'id': '1440', 'customer_id': '579', 'accepted': False}
{'id': '31955', 'customer_id': '358', 'accepted': False}
{'id': '19006', 'customer_id': '834', 'accepted': False}
{'id': '6166', 'customer_id': '511', 'accepted': True}
{'id': '757', 'customer_id': '494', 'accepted': False}
{'id': '5814', 'customer_id': '18', 'accepted': False}
{'id': '10285', 'customer_id': '171', 'accepted': False}
{'id': '7558', 'customer_id': '800', 'accepted': False}
{'id': '20212', 'customer_id': '205', 'accepted': False}
{'id': '5719', 'customer_id': '715', 'accepted': True}
{'id': '4830', 'customer_id': '86', 'accepted': True}
{'id': '9937', 'customer_id': '273', 'accepted': True}
{'id': '25048', 'customer_id': '630', 'accepted': False}
{'id': '7087', 'customer_id': '613', 'accepted': False}
{'id': '18615', 'customer_id': '579', 'accepted': False}
{'id': '11233', 'customer_id': '613', 'accepted': True}
{'id': '21114', 'customer_id': '800', 'accepted': False}
{'id': '6918', 'customer_id': '749', 'accepted': True}
{'id': '11734', 'customer_id': '664', 'accepted': False}
{'id': '18774', 'customer_id': '528', 'accepted': False}
{'id': '19904', 'customer_id': '783', 'accepted': False}
{'id': '1006', 'customer_id': '715', 'accepted': False}
{'id': '22417', 'customer_id': '715', 'accepted': False}
{'id': '8075', 'customer_id': '834', 'accepted': True}
{'id': '17341', 'customer_id': '392', 'accepted': True}
{'id': '14821', 'customer_id': '256', 'accepted': True}
{'id': '17876', 'customer_id': '579', 'accepted': False}
{'id': '152', 'customer_id': '647', 'accepted': True}
{'id': '25760', 'customer_id': '528', 'accepted': False}
{'id': '71', 'customer_id': '35', 'accepted': True}
{'id': '15309', 'customer_id': '103', 'accepted': True}
{'id': '21852', 'customer_id': '290', 'accepted': True}
{'id': '11784', 'customer_id': '171', 'accepted': False}
{'id': '10041', 'customer_id': '239', 'accepted': False}
{'id': '2', 'customer_id': '86', 'accepted': True}
{'id': '21973', 'customer_id': '800', 'accepted': False}
{'id': '29910', 'customer_id': '545', 'accepted': True}
{'id': '20784', 'customer_id': '52', 'accepted': True}
{'id': '31281', 'customer_id': '205', 'accepted': False}
{'id': '30556', 'customer_id': '834', 'accepted': False}
{'id': '11669', 'customer_id': '341', 'accepted': False}
{'id': '10422', 'customer_id': '324', 'accepted': False}
{'id': '11192', 'customer_id': '426', 'accepted': False}
{'id': '17901', 'customer_id': '783', 'accepted': False}
{'id': '8116', 'customer_id': '834', 'accepted': False}
{'id': '8421', 'customer_id': '562', 'accepted': False}
{'id': '10047', 'customer_id': '137', 'accepted': False}
{'id': '30142', 'customer_id': '817', 'accepted': True}
{'id': '2715', 'customer_id': '528', 'accepted': False}
{'id': '11375', 'customer_id': '324', 'accepted': True}
{'id': '10150', 'customer_id': '766', 'accepted': True}
{'id': '976', 'customer_id': '171', 'accepted': True}
{'id': '4490', 'customer_id': '800', 'accepted': False}
{'id': '2008', 'customer_id': '137', 'accepted': False}
{'id': '26068', 'customer_id': '630', 'accepted': True}
{'id': '28671', 'customer_id': '239', 'accepted': True}
{'id': '26538', 'customer_id': '698', 'accepted': True}
{'id': '30226', 'customer_id': '749', 'accepted': True}
{'id': '15754', 'customer_id': '698', 'accepted': False}
{'id': '19467', 'customer_id': '528', 'accepted': False}
{'id': '31652', 'customer_id': '409', 'accepted': False}
{'id': '10002', 'customer_id': '35', 'accepted': True}
{'id': '13474', 'customer_id': '188', 'accepted': False}
{'id': '26529', 'customer_id': '409', 'accepted': False}
{'id': '21666', 'customer_id': '460', 'accepted': True}
{'id': '24929', 'customer_id': '69', 'accepted': False}
{'id': '20106', 'customer_id': '443', 'accepted': True}
{'id': '9797', 'customer_id': '222', 'accepted': False}
{'id': '26143', 'customer_id': '171', 'accepted': True}
{'id': '15906', 'customer_id': '528', 'accepted': False}
{'id': '22570', 'customer_id': '120', 'accepted': False}
{'id': '27788', 'customer_id': '596', 'accepted': True}
{'id': '24460', 'customer_id': '579', 'accepted': False}
{'id': '14423', 'customer_id': '664', 'accepted': False}
{'id': '28249', 'customer_id': '545', 'accepted': False}
{'id': '9597', 'customer_id': '426', 'accepted': False}
{'id': '18131', 'customer_id': '69', 'accepted': True}
{'id': '13543', 'customer_id': '613', 'accepted': True}
{'id': '20671', 'customer_id': '681', 'accepted': False}
{'id': '21814', 'customer_id': '681', 'accepted': False}
{'id': '9594', 'customer_id': '698', 'accepted': False}
{'id': '5298', 'customer_id': '256', 'accepted': False}
{'id': '20950', 'customer_id': '528', 'accepted': False}
{'id': '7290', 'customer_id': '307', 'accepted': False}
{'id': '4824', 'customer_id': '766', 'accepted': True}
{'id': '4930', 'customer_id': '341', 'accepted': False}
{'id': '30654', 'customer_id': '460', 'accepted': True}
{'id': '11975', 'customer_id': '18', 'accepted': False}
{'id': '7113', 'customer_id': '324', 'accepted': False}
{'id': '6877', 'customer_id': '358', 'accepted': False}
{'id': '27963', 'customer_id': '817', 'accepted': True}
{'id': '7719', 'customer_id': '817', 'accepted': True}
{'id': '13620', 'customer_id': '137', 'accepted': False}
{'id': '5094', 'customer_id': '205', 'accepted': False}
{'id': '2325', 'customer_id': '528', 'accepted': False}
{'id': '3340', 'customer_id': '528', 'accepted': False}
{'id': '4111', 'customer_id': '562', 'accepted': True}
{'id': '4102', 'customer_id': '35', 'accepted': True}
{'id': '17688', 'customer_id': '392', 'accepted': True}
{'id': '25873', 'customer_id': '511', 'accepted': True}
{'id': '20148', 'customer_id': '256', 'accepted': False}
{'id': '1087', 'customer_id': '647', 'accepted': False}
{'id': '15280', 'customer_id': '511', 'accepted': False}
{'id': '12385', 'customer_id': '817', 'accepted': False}
{'id': '5897', 'customer_id': '205', 'accepted': False}
{'id': '19254', 'customer_id': '307', 'accepted': True}
{'id': '10262', 'customer_id': '1', 'accepted': True}
{'id': '29519', 'customer_id': '579', 'accepted': False}
{'id': '19749', 'customer_id': '1', 'accepted': False}
{'id': '27290', 'customer_id': '86', 'accepted': False}
{'id': '7009', 'customer_id': '477', 'accepted': False}
{'id': '13460', 'customer_id': '137', 'accepted': False}
{'id': '19265', 'customer_id': '681', 'accepted': False}
{'id': '20916', 'customer_id': '834', 'accepted': False}
{'id': '16412', 'customer_id': '426', 'accepted': False}
{'id': '24323', 'customer_id': '324', 'accepted': True}
{'id': '3111', 'customer_id': '545', 'accepted': False}
{'id': '20486', 'customer_id': '443', 'accepted': False}
{'id': '24130', 'customer_id': '358', 'accepted': True}
{'id': '24973', 'customer_id': '137', 'accepted': True}
{'id': '14981', 'customer_id': '630', 'accepted': False}
{'id': '21581', 'customer_id': '460', 'accepted': False}
{'id': '21191', 'customer_id': '749', 'accepted': True}
{'id': '903', 'customer_id': '154', 'accepted': True}
{'id': '19377', 'customer_id': '545', 'accepted': False}
{'id': '26629', 'customer_id': '18', 'accepted': False}
{'id': '24174', 'customer_id': '392', 'accepted': False}
{'id': '1617', 'customer_id': '664', 'accepted': True}
{'id': '11628', 'customer_id': '256', 'accepted': False}
{'id': '20731', 'customer_id': '766', 'accepted': False}
{'id': '10707', 'customer_id': '341', 'accepted': True}
{'id': '19600', 'customer_id': '86', 'accepted': True}
{'id': '29340', 'customer_id': '443', 'accepted': False}
{'id': '29776', 'customer_id': '834', 'accepted': True}
{'id': '1136', 'customer_id': '426', 'accepted': False}
{'id': '13154', 'customer_id': '290', 'accepted': False}
{'id': '31646', 'customer_id': '562', 'accepted': False}
{'id': '29415', 'customer_id': '545', 'accepted': False}
{'id': '8836', 'customer_id': '545', 'accepted': False}
{'id': '31831', 'customer_id': '732', 'accepted': False}
{'id': '17317', 'customer_id': '222', 'accepted': False}
{'id': '11594', 'customer_id': '307', 'accepted': False}
{'id': '20200', 'customer_id': '426', 'accepted': False}
{'id': '4133', 'customer_id': '562', 'accepted': False}
{'id': '11634', 'customer_id': '443', 'accepted': False}
{'id': '30131', 'customer_id': '154', 'accepted': False}
{'id': '31986', 'customer_id': '783', 'accepted': True}
{'id': '8348', 'customer_id': '715', 'accepted': True}
{'id': '2030', 'customer_id': '443', 'accepted': False}
{'id': '16202', 'customer_id': '256', 'accepted': True}
{'id': '28452', 'customer_id': '307', 'accepted': False}
{'id': '10321', 'customer_id': '579', 'accepted': False}
{'id': '11327', 'customer_id': '35', 'accepted': True}
{'id': '5524', 'customer_id': '579', 'accepted': False}
{'id': '8027', 'customer_id': '596', 'accepted': False}
{'id': '31471', 'customer_id': '375', 'accepted': False}
{'id': '221', 'customer_id': '171', 'accepted': True}
{'id': '28502', 'customer_id': '205', 'accepted': False}
{'id': '9291', 'customer_id': '154', 'accepted': True}
{'id': '4687', 'customer_id': '290', 'accepted': True}
{'id': '3462', 'customer_id': '1', 'accepted': False}
{'id': '2462', 'customer_id': '460', 'accepted': True}
{'id': '22494', 'customer_id': '290', 'accepted': False}
{'id': '23505', 'customer_id': '630', 'accepted': False}
{'id': '6216', 'customer_id': '732', 'accepted': False}
{'id': '9004', 'customer_id': '120', 'accepted': False}
{'id': '5538', 'customer_id': '409', 'accepted': True}
{'id': '21721', 'customer_id': '698', 'accepted': False}
{'id': '15677', 'customer_id': '732', 'accepted': False}
{'id': '1849', 'customer_id': '103', 'accepted': False}
{'id': '29831', 'customer_id': '103', 'accepted': False}
{'id': '7118', 'customer_id': '596', 'accepted': False}
{'id': '4105', 'customer_id': '52', 'accepted': False}
{'id': '23233', 'customer_id': '630', 'accepted': False}
{'id': '11303', 'customer_id': '545', 'accepted': False}
{'id': '24140', 'customer_id': '477', 'accepted': True}
{'id': '20412', 'customer_id': '698', 'accepted': False}
{'id': '19437', 'customer_id': '443', 'accepted': False}
{'id': '22825', 'customer_id': '732', 'accepted': True}
{'id': '14837', 'customer_id': '86', 'accepted': True}
{'id': '25624', 'customer_id': '766', 'accepted': False}
{'id': '9928', 'customer_id': '715', 'accepted': False}
{'id': '24016', 'customer_id': '545', 'accepted': False}
{'id': '23826', 'customer_id': '715', 'accepted': False}
{'id': '21227', 'customer_id': '273', 'accepted': False}
{'id': '7185', 'customer_id': '137', 'accepted': True}
{'id': '18363', 'customer_id': '341', 'accepted': False}
{'id': '19328', 'customer_id': '443', 'accepted': False}
{'id': '6587', 'customer_id': '443', 'accepted': False}
{'id': '7140', 'customer_id': '273', 'accepted': False}
{'id': '27165', 'customer_id': '86', 'accepted': True}
{'id': '25688', 'customer_id': '171', 'accepted': True}
{'id': '3219', 'customer_id': '52', 'accepted': False}
{'id': '12252', 'customer_id': '579', 'accepted': True}
{'id': '22004', 'customer_id': '222', 'accepted': False}
{'id': '30675', 'customer_id': '630', 'accepted': True}
{'id': '19254', 'customer_id': '834', 'accepted': True}
{'id': '23254', 'customer_id': '392', 'accepted': True}
{'id': '29071', 'customer_id': '766', 'accepted': False}
{'id': '310', 'customer_id': '800', 'accepted': False}
{'id': '18206', 'customer_id': '375', 'accepted': False}
{'id': '4966', 'customer_id': '171', 'accepted': False}
{'id': '30696', 'customer_id': '375', 'accepted': False}
{'id': '5787', 'customer_id': '392', 'accepted': False}
{'id': '7117', 'customer_id': '460', 'accepted': False}
{'id': '27594', 'customer_id': '698', 'accepted': True}
{'id': '17202', 'customer_id': '154', 'accepted': False}
{'id': '21313', 'customer_id': '86', 'accepted': False}
{'id': '27196', 'customer_id': '613', 'accepted': False}
{'id': '27230', 'customer_id': '171', 'accepted': False}
{'id': '22638', 'customer_id': '477', 'accepted': False}
{'id': '1774', 'customer_id': '732', 'accepted': True}
{'id': '1388', 'customer_id': '324', 'accepted': False}
{'id': '4057', 'customer_id': '1', 'accepted': False}
{'id': '8142', 'customer_id': '579', 'accepted': False}
{'id': '4316', 'customer_id': '766', 'accepted': False}
{'id': '20966', 'customer_id': '171', 'accepted': False}
{'id': '1312', 'customer_id': '341', 'accepted': False}
{'id': '18166', 'customer_id': '613', 'accepted': False}
{'id': '3873', 'customer_id': '256', 'accepted': True}
{'id': '27221', 'customer_id': '817', 'accepted': True}
{'id': '16189', 'customer_id': '86', 'accepted': False}
{'id': '13148', 'customer_id': '834', 'accepted': False}
{'id': '9535', 'customer_id': '545', 'accepted': False}
{'id': '30469', 'customer_id': '579', 'accepted': False}
{'id': '26586', 'customer_id': '528', 'accepted': True}
{'id': '28327', 'customer_id': '18', 'accepted': False}
{'id': '24264', 'customer_id': '579', 'accepted': False}
{'id': '5450', 'customer_id': '783', 'accepted': False}
{'id': '3325', 'customer_id': '443', 'accepted': True}
{'id': '30263', 'customer_id': '69', 'accepted': True}
{'id': '20320', 'customer_id': '528', 'accepted': False}
{'id': '3552', 'customer_id': '86', 'accepted': True}
{'id': '18870', 'customer_id': '137', 'accepted': False}
{'id': '6345', 'customer_id': '409', 'accepted': True}
{'id': '1800', 'customer_id': '86', 'accepted': False}
{'id': '16788', 'customer_id': '154', 'accepted': False}
{'id': '13234', 'customer_id': '596', 'accepted': True}
{'id': '3733', 'customer_id': '52', 'accepted': False}
{'id': '15436', 'customer_id': '749', 'accepted': True}
{'id': '1564', 'customer_id': '732', 'accepted': False}
{'id': '5903', 'customer_id': '528', 'accepted': False}
{'id': '1691', 'customer_id': '817', 'accepted': False}
{'id': '30846', 'customer_id': '103', 'accepted': False}
{'id': '16449', 'customer_id': '1', 'accepted': False}
{'id': '5924', 'customer_id': '562', 'accepted': False}
{'id': '14220', 'customer_id': '749', 'accepted': False}
{'id': '31757', 'customer_id': '460', 'accepted': False}
{'id': '31210', 'customer_id': '35', 'accepted': False}
{'id': '21892', 'customer_id': '630', 'accepted': False}
{'id': '9120', 'customer_id': '715', 'accepted': False}
{'id': '25333', 'customer_id': '341', 'accepted': False}
{'id': '3309', 'customer_id': '630', 'accepted': False}
{'id': '4755', 'customer_id': '664', 'accepted': False}
{'id': '23752', 'customer_id': '341', 'accepted': True}
{'id': '277', 'customer_id': '443', 'accepted': False}
{'id': '20291', 'customer_id': '375', 'accepted': False}
{'id': '15952', 'customer_id': '783', 'accepted': False}
{'id': '10464', 'customer_id': '171', 'accepted': False}
{'id': '19971', 'customer_id': '834', 'accepted': True}
{'id': '11441', 'customer_id': '562', 'accepted': False}
{'id': '17564', 'customer_id': '460', 'accepted': False}
{'id': '30442', 'customer_id': '290', 'accepted': True}
{'id': '31659', 'customer_id': '460', 'accepted': True}
{'id': '22594', 'customer_id': '698', 'accepted': False}
{'id': '8379', 'customer_id': '392', 'accepted': False}
{'id': '8820', 'customer_id': '290', 'accepted': False}
{'id': '19518', 'customer_id': '1', 'accepted': False}
{'id': '8666', 'customer_id': '103', 'accepted': False}
{'id': '8340', 'customer_id': '443', 'accepted': False}
{'id': '11899', 'customer_id': '477', 'accepted': True}
{'id': '13607', 'customer_id': '188', 'accepted': False}
{'id': '26935', 'customer_id': '154', 'accepted': True}
{'id': '14301', 'customer_id': '562', 'accepted': False}
{'id': '13812', 'customer_id': '528', 'accepted': True}
{'id': '24217', 'customer_id': '239', 'accepted': False}
{'id': '10118', 'customer_id': '409', 'accepted': False}
{'id': '10989', 'customer_id': '409', 'accepted': False}
{'id': '23483', 'customer_id': '732', 'accepted': True}
{'id': '30373', 'customer_id': '137', 'accepted': False}
{'id': '28832', 'customer_id': '681', 'accepted': False}
{'id': '11655', 'customer_id': '239', 'accepted': True}
{'id': '29681', 'customer_id': '511', 'accepted': False}
{'id': '27037', 'customer_id': '817', 'accepted': False}
{'id': '4034', 'customer_id': '358', 'accepted': False}
{'id': '15224', 'customer_id': '239', 'accepted': False}
{'id': '25223', 'customer_id': '375', 'accepted': False}
{'id': '18875', 'customer_id': '307', 'accepted': False}
{'id': '1583', 'customer_id': '664', 'accepted': True}
{'id': '21224', 'customer_id': '35', 'accepted': True}
{'id': '19981', 'customer_id': '647', 'accepted': False}
{'id': '31630', 'customer_id': '834', 'accepted': True}
{'id': '15466', 'customer_id': '409', 'accepted': False}
{'id': '2245', 'customer_id': '494', 'accepted': False}
{'id': '2845', 'customer_id': '1', 'accepted': False}
{'id': '19081', 'customer_id': '664', 'accepted': False}
{'id': '6928', 'customer_id': '562', 'accepted': False}
{'id': '10235', 'customer_id': '69', 'accepted': False}
{'id': '5648', 'customer_id': '766', 'accepted': True}
{'id': '19348', 'customer_id': '52', 'accepted': True}
{'id': '9904', 'customer_id': '307', 'accepted': False}
{'id': '6321', 'customer_id': '86', 'accepted': True}
{'id': '7842', 'customer_id': '579', 'accepted': False}
{'id': '22379', 'customer_id': '409', 'accepted': True}
{'id': '21037', 'customer_id': '86', 'accepted': True}
{'id': '25892', 'customer_id': '154', 'accepted': True}
{'id': '5280', 'customer_id': '392', 'accepted': False}
{'id': '20485', 'customer_id': '409', 'accepted': True}
{'id': '5915', 'customer_id': '579', 'accepted': False}
{'id': '13203', 'customer_id': '18', 'accepted': True}
{'id': '31223', 'customer_id': '1', 'accepted': False}
{'id': '1827', 'customer_id': '766', 'accepted': False}
{'id': '6969', 'customer_id': '205', 'accepted': False}
{'id': '906', 'customer_id': '494', 'accepted': False}
{'id': '23025', 'customer_id': '358', 'accepted': False}
{'id': '31671', 'customer_id': '766', 'accepted': True}
{'id': '14813', 'customer_id': '511', 'accepted': False}
{'id': '31349', 'customer_id': '154', 'accepted': True}
{'id': '31048', 'customer_id': '681', 'accepted': True}
{'id': '22729', 'customer_id': '528', 'accepted': False}
{'id': '2599', 'customer_id': '375', 'accepted': True}
{'id': '25723', 'customer_id': '596', 'accepted': False}
{'id': '810', 'customer_id': '341', 'accepted': False}
{'id': '5330', 'customer_id': '749', 'accepted': True}
{'id': '13165', 'customer_id': '35', 'accepted': True}
{'id': '13705', 'customer_id': '69', 'accepted': False}
{'id': '5985', 'customer_id': '307', 'accepted': True}
{'id': '19739', 'customer_id': '477', 'accepted': False}
{'id': '26260', 'customer_id': '783', 'accepted': False}
{'id': '30123', 'customer_id': '154', 'accepted': True}
{'id': '3602', 'customer_id': '511', 'accepted': False}
{'id': '1259', 'customer_id': '596', 'accepted': True}
{'id': '31474', 'customer_id': '732', 'accepted': False}
{'id': '25549', 'customer_id': '664', 'accepted': True}
{'id': '14775', 'customer_id': '681', 'accepted': False}
{'id': '31001', 'customer_id': '358', 'accepted': False}
{'id': '21402', 'customer_id': '103', 'accepted': True}
{'id': '28440', 'customer_id': '375', 'accepted': False}
{'id': '14640', 'customer_id': '647', 'accepted': False}
{'id': '1142', 'customer_id': '137', 'accepted': False}
{'id': '16974', 'customer_id': '698', 'accepted': False}
{'id': '64', 'customer_id': '154', 'accepted': False}
{'id': '31047', 'customer_id': '783', 'accepted': True}
{'id': '22978', 'customer_id': '562', 'accepted': True}
{'id': '14580', 'customer_id': '375', 'accepted': False}
{'id': '18237', 'customer_id': '256', 'accepted': False}
{'id': '15204', 'customer_id': '698', 'accepted': False}
{'id': '3501', 'customer_id': '120', 'accepted': True}
{'id': '30148', 'customer_id': '103', 'accepted': True}
{'id': '24407', 'customer_id': '35', 'accepted': True}
{'id': '15348', 'customer_id': '358', 'accepted': True}
{'id': '22606', 'customer_id': '239', 'accepted': False}
{'id': '16434', 'customer_id': '494', 'accepted': False}
{'id': '28278', 'customer_id': '1', 'accepted': True}
{'id': '12462', 'customer_id': '52', 'accepted': True}
{'id': '29479', 'customer_id': '307', 'accepted': True}
{'id': '17065', 'customer_id': '120', 'accepted': False}
{'id': '13642', 'customer_id': '715', 'accepted': False}
{'id': '23879', 'customer_id': '596', 'accepted': True}
{'id': '26729', 'customer_id': '222', 'accepted': False}
{'id': '12900', 'customer_id': '460', 'accepted': False}
{'id': '25316', 'customer_id': '205', 'accepted': False}
{'id': '2960', 'customer_id': '562', 'accepted': False}
{'id': '18515', 'customer_id': '103', 'accepted': True}
{'id': '25821', 'customer_id': '358', 'accepted': False}
{'id': '10449', 'customer_id': '256', 'accepted': True}
{'id': '23810', 'customer_id': '681', 'accepted': False}
{'id': '27478', 'customer_id': '120', 'accepted': False}
{'id': '7565', 'customer_id': '392', 'accepted': True}
{'id': '25477', 'customer_id': '647', 'accepted': False}
{'id': '19518', 'customer_id': '409', 'accepted': True}
{'id': '8090', 'customer_id': '528', 'accepted': True}
{'id': '6963', 'customer_id': '545', 'accepted': False}
{'id': '23969', 'customer_id': '494', 'accepted': False}
{'id': '29292', 'customer_id': '52', 'accepted': False}
{'id': '12223', 'customer_id': '290', 'accepted': True}
{'id': '4156', 'customer_id': '528', 'accepted': False}
{'id': '12754', 'customer_id': '545', 'accepted': False}
{'id': '28618', 'customer_id': '1', 'accepted': True}
{'id': '13609', 'customer_id': '749', 'accepted': True}
{'id': '19468', 'customer_id': '715', 'accepted': False}
{'id': '13437', 'customer_id': '817', 'accepted': True}
{'id': '14676', 'customer_id': '545', 'accepted': False}
{'id': '25458', 'customer_id': '766', 'accepted': False}
{'id': '11430', 'customer_id': '171', 'accepted': False}
{'id': '15838', 'customer_id': '664', 'accepted': True}
{'id': '29048', 'customer_id': '443', 'accepted': True}
{'id': '637', 'customer_id': '290', 'accepted': False}
{'id': '10908', 'customer_id': '103', 'accepted': False}
{'id': '677', 'customer_id': '273', 'accepted': False}
{'id': '24877', 'customer_id': '817', 'accepted': False}
{'id': '27021', 'customer_id': '154', 'accepted': True}
{'id': '17226', 'customer_id': '664', 'accepted': False}
{'id': '13754', 'customer_id': '392', 'accepted': False}
{'id': '13732', 'customer_id': '375', 'accepted': False}
{'id': '5872', 'customer_id': '783', 'accepted': False}
{'id': '29705', 'customer_id': '324', 'accepted': True}
{'id': '26918', 'customer_id': '35', 'accepted': False}
{'id': '20236', 'customer_id': '86', 'accepted': False}
{'id': '9338', 'customer_id': '409', 'accepted': True}
{'id': '31599', 'customer_id': '375', 'accepted': False}
{'id': '19722', 'customer_id': '647', 'accepted': True}
{'id': '30501', 'customer_id': '52', 'accepted': False}
{'id': '6682', 'customer_id': '596', 'accepted': True}
{'id': '28981', 'customer_id': '205', 'accepted': False}
{'id': '27050', 'customer_id': '35', 'accepted': True}
{'id': '21399', 'customer_id': '239', 'accepted': False}
{'id': '11006', 'customer_id': '613', 'accepted': False}
{'id': '24458', 'customer_id': '579', 'accepted': False}
{'id': '7354', 'customer_id': '103', 'accepted': True}
{'id': '29417', 'customer_id': '528', 'accepted': False}
{'id': '5710', 'customer_id': '69', 'accepted': False}
{'id': '21204', 'customer_id': '443', 'accepted': True}
{'id': '15853', 'customer_id': '358', 'accepted': False}
{'id': '28001', 'customer_id': '35', 'accepted': True}
{'id': '4617', 'customer_id': '460', 'accepted': False}
{'id': '11741', 'customer_id': '375', 'accepted': False}
{'id': '22431', 'customer_id': '528', 'accepted': False}
{'id': '12401', 'customer_id': '562', 'accepted': False}
{'id': '9230', 'customer_id': '409', 'accepted': True}
{'id': '29360', 'customer_id': '18', 'accepted': False}
{'id': '3169', 'customer_id': '511', 'accepted': False}
{'id': '16710', 'customer_id': '783', 'accepted': True}
{'id': '29332', 'customer_id': '698', 'accepted': True}
{'id': '13898', 'customer_id': '103', 'accepted': True}
{'id': '11508', 'customer_id': '528', 'accepted': True}
{'id': '1637', 'customer_id': '1', 'accepted': True}
{'id': '985', 'customer_id': '749', 'accepted': True}
{'id': '12841', 'customer_id': '426', 'accepted': False}
{'id': '20927', 'customer_id': '715', 'accepted': True}
{'id': '10041', 'customer_id': '596', 'accepted': True}
{'id': '25651', 'customer_id': '409', 'accepted': True}
{'id': '10220', 'customer_id': '460', 'accepted': False}
{'id': '27678', 'customer_id': '579', 'accepted': False}
{'id': '31834', 'customer_id': '52', 'accepted': False}
{'id': '8141', 'customer_id': '239', 'accepted': False}
{'id': '14662', 'customer_id': '205', 'accepted': False}
{'id': '1412', 'customer_id': '732', 'accepted': False}
{'id': '8562', 'customer_id': '596', 'accepted': False}
{'id': '9534', 'customer_id': '324', 'accepted': False}
{'id': '29513', 'customer_id': '290', 'accepted': True}
{'id': '2994', 'customer_id': '86', 'accepted': True}
{'id': '602', 'customer_id': '562', 'accepted': True}
{'id': '26866', 'customer_id': '205', 'accepted': False}
{'id': '17727', 'customer_id': '664', 'accepted': True}
{'id': '4771', 'customer_id': '800', 'accepted': True}
{'id': '10931', 'customer_id': '290', 'accepted': False}
{'id': '15851', 'customer_id': '630', 'accepted': True}
{'id': '25439', 'customer_id': '324', 'accepted': False}
{'id': '23059', 'customer_id': '613', 'accepted': False}
{'id': '5233', 'customer_id': '749', 'accepted': False}
{'id': '24137', 'customer_id': '477', 'accepted': False}
{'id': '8761', 'customer_id': '681', 'accepted': True}
{'id': '17330', 'customer_id': '358', 'accepted': True}
{'id': '13152', 'customer_id': '511', 'accepted': False}
{'id': '24413', 'customer_id': '171', 'accepted': False}
{'id': '26570', 'customer_id': '443', 'accepted': False}
{'id': '18786', 'customer_id': '137', 'accepted': True}
{'id': '4700', 'customer_id': '18', 'accepted': False}
{'id': '7112', 'customer_id': '715', 'accepted': False}
{'id': '21587', 'customer_id': '154', 'accepted': False}
{'id': '7518', 'customer_id': '545', 'accepted': False}
{'id': '5574', 'customer_id': '18', 'accepted': False}
{'id': '29242', 'customer_id': '69', 'accepted': True}
{'id': '9788', 'customer_id': '800', 'accepted': False}
{'id': '30772', 'customer_id': '154', 'accepted': False}
{'id': '2965', 'customer_id': '273', 'accepted': True}
{'id': '28880', 'customer_id': '392', 'accepted': True}
{'id': '26621', 'customer_id': '426', 'accepted': True}
{'id': '7219', 'customer_id': '800', 'accepted': False}
{'id': '27818', 'customer_id': '494', 'accepted': False}
{'id': '28444', 'customer_id': '647', 'accepted': False}
{'id': '20665', 'customer_id': '171', 'accepted': False}
{'id': '740', 'customer_id': '188', 'accepted': True}
{'id': '4170', 'customer_id': '392', 'accepted': False}
{'id': '4613', 'customer_id': '273', 'accepted': False}
{'id': '7871', 'customer_id': '290', 'accepted': False}
{'id': '20512', 'customer_id': '443', 'accepted': False}
{'id': '14413', 'customer_id': '426', 'accepted': False}
{'id': '18134', 'customer_id': '154', 'accepted': True}
{'id': '8320', 'customer_id': '664', 'accepted': True}
{'id': '22235', 'customer_id': '426', 'accepted': False}
{'id': '163', 'customer_id': '766', 'accepted': False}
{'id': '10442', 'customer_id': '766', 'accepted': False}
{'id': '16837', 'customer_id': '477', 'accepted': False}
{'id': '9533', 'customer_id': '273', 'accepted': False}
{'id': '21745', 'customer_id': '613', 'accepted': True}
{'id': '11371', 'customer_id': '511', 'accepted': False}
{'id': '9742', 'customer_id': '409', 'accepted': False}
{'id': '10455', 'customer_id': '222', 'accepted': False}
{'id': '17178', 'customer_id': '749', 'accepted': False}
{'id': '25301', 'customer_id': '834', 'accepted': False}
{'id': '29011', 'customer_id': '52', 'accepted': False}
{'id': '25050', 'customer_id': '460', 'accepted': True}
{'id': '9058', 'customer_id': '613', 'accepted': False}
{'id': '512', 'customer_id': '137', 'accepted': False}
{'id': '17351', 'customer_id': '1', 'accepted': True}
{'id': '2740', 'customer_id': '52', 'accepted': False}
{'id': '28489', 'customer_id': '698', 'accepted': False}
{'id': '13364', 'customer_id': '579', 'accepted': False}
{'id': '13350', 'customer_id': '222', 'accepted': False}
{'id': '15422', 'customer_id': '715', 'accepted': False}
{'id': '17031', 'customer_id': '681', 'accepted': True}
{'id': '10259', 'customer_id': '103', 'accepted': True}
{'id': '13290', 'customer_id': '817', 'accepted': True}
{'id': '5325', 'customer_id': '188', 'accepted': True}
{'id': '2173', 'customer_id': '681', 'accepted': False}
{'id': '17701', 'customer_id': '341', 'accepted': False}
{'id': '9307', 'customer_id': '528', 'accepted': False}
{'id': '30826', 'customer_id': '647', 'accepted': False}
{'id': '14467', 'customer_id': '154', 'accepted': False}
{'id': '29513', 'customer_id': '86', 'accepted': True}
{'id': '15020', 'customer_id': '18', 'accepted': True}
{'id': '905', 'customer_id': '103', 'accepted': False}
{'id': '25796', 'customer_id': '511', 'accepted': False}
{'id': '15279', 'customer_id': '562', 'accepted': True}
{'id': '7431', 'customer_id': '545', 'accepted': True}
{'id': '10382', 'customer_id': '732', 'accepted': True}
{'id': '26366', 'customer_id': '52', 'accepted': False}
{'id': '17952', 'customer_id': '732', 'accepted': False}
{'id': '29268', 'customer_id': '324', 'accepted': True}
{'id': '11673', 'customer_id': '443', 'accepted': False}
{'id': '1925', 'customer_id': '732', 'accepted': False}
{'id': '10055', 'customer_id': '460', 'accepted': False}
{'id': '2200', 'customer_id': '800', 'accepted': False}
{'id': '3828', 'customer_id': '86', 'accepted': False}
{'id': '17646', 'customer_id': '681', 'accepted': False}
{'id': '30766', 'customer_id': '35', 'accepted': False}
{'id': '4130', 'customer_id': '800', 'accepted': False}
{'id': '6091', 'customer_id': '732', 'accepted': False}
{'id': '1982', 'customer_id': '256', 'accepted': False}
{'id': '12873', 'customer_id': '137', 'accepted': False}
{'id': '9226', 'customer_id': '154', 'accepted': False}
{'id': '3288', 'customer_id': '511', 'accepted': True}
{'id': '10561', 'customer_id': '477', 'accepted': True}
{'id': '17066', 'customer_id': '647', 'accepted': False}
{'id': '25064', 'customer_id': '732', 'accepted': False}
{'id': '18555', 'customer_id': '154', 'accepted': True}
{'id': '15357', 'customer_id': '732', 'accepted': False}
{'id': '19111', 'customer_id': '579', 'accepted': False}
{'id': '6947', 'customer_id': '732', 'accepted': False}
{'id': '24291', 'customer_id': '375', 'accepted': False}
{'id': '480', 'customer_id': '766', 'accepted': False}
{'id': '20170', 'customer_id': '86', 'accepted': False}
{'id': '23876', 'customer_id': '715', 'accepted': False}
{'id': '31788', 'customer_id': '392', 'accepted': False}
{'id': '26135', 'customer_id': '766', 'accepted': False}
{'id': '11538', 'customer_id': '647', 'accepted': False}
{'id': '29328', 'customer_id': '188', 'accepted': False}
{'id': '959', 'customer_id': '511', 'accepted': False}
{'id': '7518', 'customer_id': '715', 'accepted': False}
{'id': '26990', 'customer_id': '273', 'accepted': False}
{'id': '7689', 'customer_id': '647', 'accepted': True}
{'id': '7141', 'customer_id': '18', 'accepted': False}
{'id': '3022', 'customer_id': '494', 'accepted': True}
{'id': '24488', 'customer_id': '307', 'accepted': True}
{'id': '26325', 'customer_id': '630', 'accepted': False}
{'id': '25583', 'customer_id': '715', 'accepted': False}
{'id': '5639', 'customer_id': '647', 'accepted': False}
{'id': '28463', 'customer_id': '783', 'accepted': False}
{'id': '19805', 'customer_id': '290', 'accepted': False}
{'id': '9683', 'customer_id': '681', 'accepted': True}
{'id': '20422', 'customer_id': '613', 'accepted': False}
{'id': '629', 'customer_id': '222', 'accepted': True}
{'id': '15026', 'customer_id': '511', 'accepted': True}
{'id': '30826', 'customer_id': '239', 'accepted': False}
{'id': '14585', 'customer_id': '545', 'accepted': False}
{'id': '20439', 'customer_id': '681', 'accepted': False}
{'id': '13704', 'customer_id': '494', 'accepted': False}
{'id': '30123', 'customer_id': '35', 'accepted': True}
{'id': '6460', 'customer_id': '307', 'accepted': False}
{'id': '24411', 'customer_id': '1', 'accepted': False}
{'id': '13812', 'customer_id': '426', 'accepted': False}
{'id': '13095', 'customer_id': '120', 'accepted': True}
{'id': '9925', 'customer_id': '35', 'accepted': True}
{'id': '9617', 'customer_id': '273', 'accepted': True}
{'id': '5888', 'customer_id': '494', 'accepted': False}
{'id': '25463', 'customer_id': '579', 'accepted': False}
{'id': '16052', 'customer_id': '443', 'accepted': False}
{'id': '25125', 'customer_id': '1', 'accepted': True}
{'id': '6406', 'customer_id': '171', 'accepted': False}
{'id': '4923', 'customer_id': '494', 'accepted': False}
{'id': '4393', 'customer_id': '256', 'accepted': False}
{'id': '28061', 'customer_id': '783', 'accepted': False}
{'id': '7185', 'customer_id': '681', 'accepted': False}
{'id': '18654', 'customer_id': '188', 'accepted': False}
{'id': '27723', 'customer_id': '562', 'accepted': True}
{'id': '24693', 'customer_id': '324', 'accepted': True}
{'id': '19017', 'customer_id': '341', 'accepted': False}
{'id': '23807', 'customer_id': '341', 'accepted': False}
{'id': '10470', 'customer_id': '341', 'accepted': True}
{'id': '8069', 'customer_id': '596', 'accepted': False}
{'id': '20021', 'customer_id': '545', 'accepted': True}
{'id': '18692', 'customer_id': '239', 'accepted': False}
{'id': '15451', 'customer_id': '511', 'accepted': False}
{'id': '15163', 'customer_id': '715', 'accepted': True}
{'id': '17998', 'customer_id': '154', 'accepted': True}
{'id': '19871', 'customer_id': '392', 'accepted': False}
{'id': '30071', 'customer_id': '375', 'accepted': True}
{'id': '12409', 'customer_id': '613', 'accepted': False}
{'id': '27184', 'customer_id': '358', 'accepted': False}
{'id': '9341', 'customer_id': '800', 'accepted': False}
{'id': '31187', 'customer_id': '256', 'accepted': False}
{'id': '3560', 'customer_id': '749', 'accepted': True}
{'id': '23861', 'customer_id': '528', 'accepted': True}
{'id': '6082', 'customer_id': '460', 'accepted': False}
{'id': '17742', 'customer_id': '477', 'accepted': False}
{'id': '31634', 'customer_id': '494', 'accepted': False}
{'id': '1897', 'customer_id': '409', 'accepted': False}
{'id': '29255', 'customer_id': '494', 'accepted': False}
