<svg width="64" height="64" viewBox="0 0 64 64" fill="none" xmlns="http://www.w3.org/2000/svg">
<g filter="url(#filter0_d_220_3107)">
<circle cx="32" cy="31" r="24" fill="#DC4E41"/>
</g>
<path d="M24.7806 28.8378C24.4889 29.6904 24.3406 30.5856 24.3418 31.4868C24.3418 32.4932 24.5228 33.4571 24.8573 34.3469C25.2743 35.4592 25.9293 36.4668 26.7764 37.2995C27.6236 38.1321 28.6424 38.7695 29.7617 39.1672C30.8809 39.5649 32.0736 39.7132 33.2561 39.6018C34.4387 39.4903 35.5826 39.1218 36.6079 38.522H36.6093C38.2245 37.5751 39.4656 36.1021 40.1248 34.3497H32.7934V28.9255H45.9631C46.3037 30.7196 46.2832 32.5636 45.9028 34.3497C45.2435 37.4373 43.5388 40.2028 41.0764 42.1788C38.6443 44.1373 35.6144 45.2029 32.4918 45.198C30.1375 45.1994 27.8226 44.5943 25.77 43.4413C23.7175 42.2882 21.9964 40.626 20.7728 38.6147C19.5491 36.6034 18.8641 34.3109 18.7836 31.958C18.7032 29.6051 19.23 27.2711 20.3134 25.181C21.4693 22.9487 23.2166 21.0771 25.3645 19.7711C27.5124 18.465 29.978 17.7746 32.4918 17.7755C35.8181 17.7755 38.8689 18.9602 41.2437 20.9318L36.8012 24.5681C35.7606 23.9204 34.5873 23.5156 33.3687 23.3839C32.15 23.2521 30.9173 23.3968 29.7623 23.807C28.6072 24.2173 27.5595 24.8826 26.697 25.7536C25.8346 26.6246 25.1795 27.6788 24.7806 28.8378Z" fill="white"/>
<defs>
<filter id="filter0_d_220_3107" x="0" y="0" width="64" height="64" filterUnits="userSpaceOnUse" color-interpolation-filters="sRGB">
<feFlood flood-opacity="0" result="BackgroundImageFix"/>
<feColorMatrix in="SourceAlpha" type="matrix" values="0 0 0 0 0 0 0 0 0 0 0 0 0 0 0 0 0 0 127 0" result="hardAlpha"/>
<feOffset dy="1"/>
<feGaussianBlur stdDeviation="4"/>
<feColorMatrix type="matrix" values="0 0 0 0 0.966667 0 0 0 0 0.247124 0 0 0 0 0.18125 0 0 0 0.3 0"/>
<feBlend mode="normal" in2="BackgroundImageFix" result="effect1_dropShadow_220_3107"/>
<feBlend mode="normal" in="SourceGraphic" in2="effect1_dropShadow_220_3107" result="shape"/>
</filter>
</defs>
</svg>
