%YAML 1.1
%TAG !u! tag:unity3d.com,2011:
--- !u!1045 &1
EditorBuildSettings:
  m_ObjectHideFlags: 0
  serializedVersion: 2
  m_Scenes:
  - enabled: 0
    path: Assets/Scenes/SampleScene.unity
    guid: 99c9720ab356a0642a771bea13969a05
  - enabled: 1
    path: Assets/Scenes/Main VR Scene.unity
    guid: 64ddc060da2e642a1a4077d5a993a3ae
  m_configObjects:
    Unity.XR.Oculus.Settings: {fileID: 11400000, guid: 245c6ba107d57490da2d0563ad2f36d3,
      type: 2}
    com.unity.xr.management.loader_settings: {fileID: 11400000, guid: aaee3ae11686c432fabe592428d8845b,
      type: 2}
    com.unity.xr.openxr.settings4: {fileID: 11400000, guid: 1491aa82fedac48c0bd690f22634ec0b,
      type: 2}
