<?xml version="1.0" encoding="utf-8"?>
<!-- Generator: Adobe Illustrator 21.1.0, SVG Export Plug-In . SVG Version: 6.00 Build 0)  -->
<svg version="1.1" id="Layer_1" xmlns="http://www.w3.org/2000/svg" xmlns:xlink="http://www.w3.org/1999/xlink" x="0px" y="0px"
	 viewBox="0 0 16 16" style="enable-background:new 0 0 16 16;" xml:space="preserve">
<style type="text/css">
	.st0{fill:#FFFFFF;stroke:#1E1D1C;stroke-width:0.25;stroke-linejoin:round;stroke-miterlimit:10;}
	.st1{clip-path:url(#SVGID_2_);fill:none;stroke:#1E1D1C;stroke-width:0.25;stroke-linejoin:round;stroke-miterlimit:10;}
</style>
<g>
	<path class="st0" d="M2.5,11.6c0-0.2,0.1-0.5,0.3-0.7c1.4-2,2.9-3.9,4.4-5.8C7.3,5,7.5,4.7,7.6,4.6c0.1,0,0.2,0.2,0.3,0.3
		c0.2,0.3,0.4,0.7,0.5,1.1c0,0.1,0,0.1,0,0.2c0,0.3-0.2,0.5-0.3,0.7C7.9,7.2,7.7,7.4,7.6,7.7c-0.3,0.5-0.7,1-1,1.5
		c-0.7,1-1.4,2-2.1,3c-0.2,0.2-0.3,0.4-0.5,0.6c-0.4,0.5-0.8,0.3-1.1-0.2C2.6,12.2,2.4,11.9,2.5,11.6z"/>
	<path class="st0" d="M15.2,2.5c0.7,0.3-2.9,9.7-3.4,10.8c-0.1,0.3-0.2,0.7-0.7,0.4c-0.4-0.2-0.7-0.7-1-1c-1.5-1.2-3-2.3-4.5-3.5
		C4.5,8.4,1.3,6.9,1.9,5.2c0.5-1.2,0.3-2.1,1.9-2.1c2,0,4,0,6-0.3C11.3,2.7,13.7,1.8,15.2,2.5z"/>
	<g>
		<defs>
			<path id="SVGID_1_" d="M15.2,2.5C15.2,2.5,15.2,2.5,15.2,2.5c0.1,0.1,0.1,0.2,0.1,0.3c0,0.6-0.2,1.1-0.3,1.7
				c-0.8,2.7-1.8,5.4-2.8,8c-0.2,0.5-0.5,1.5-1.1,1c-0.9-0.7-1.7-1.5-2.7-2.2C7.4,10.7,6.5,10,5.6,9.3C4.5,8.4,1.3,6.9,1.9,5.2
				c0.5-1.2,0.3-2.1,1.9-2.1c2.5,0.1,5.1,0,7.5-0.5C12.5,2.3,13.8,2,15,2.4C15.1,2.4,15.1,2.4,15.2,2.5z"/>
		</defs>
		<clipPath id="SVGID_2_">
			<use xlink:href="#SVGID_1_"  style="overflow:visible;"/>
		</clipPath>
		<path class="st1" d="M13.7,0.5c-0.5,2.5-1.5,4.9-2.3,7.3c-0.5,1.3-0.9,2.5-1.3,3.8c-0.5,1.4-0.9,2.9-1.4,4.3"/>
	</g>
	<path class="st0" d="M2.4,2.3c0.1,0,0.2,0,0.3,0c0.4,0.1,0.8,0.3,1.2,0.4C4,2.7,4,2.7,4,2.8C4.1,3,3.7,4,3.6,4.2
		c-0.2,0.5-0.3,1-0.5,1.6c-0.2,0.5-0.3,1-0.5,1.5C2.4,7.8,2.1,7.5,1.7,7.3C1.6,7.3,0.8,7.2,0.7,7C0.7,6.8,1,6.1,1.1,5.9
		C1.2,5.5,1.4,5,1.5,4.6C1.7,4,1.9,3.4,2.1,2.8C2.2,2.6,2.3,2.4,2.4,2.3z"/>
</g>
</svg>
