<?xml version="1.0" encoding="utf-8"?>
<!-- Generator: Adobe Illustrator 16.0.0, SVG Export Plug-In . SVG Version: 6.00 Build 0)  -->
<!DOCTYPE svg PUBLIC "-//W3C//DTD SVG 1.1//EN" "http://www.w3.org/Graphics/SVG/1.1/DTD/svg11.dtd">
<svg version="1.1" id="Layer_1" xmlns="http://www.w3.org/2000/svg" xmlns:xlink="http://www.w3.org/1999/xlink" x="0px" y="0px"
	 width="48px" height="36px" viewBox="0 0 48 36" enable-background="new 0 0 48 36" xml:space="preserve">
<path fill="#FFFFFF" d="M21.805,0c4.919,0,9.368,1.994,12.593,5.219c3.221,3.222,5.215,7.673,5.215,12.59
	c0,4.916-1.994,9.368-5.215,12.589c-1.733,1.732-3.82,3.108-6.145,4.012h15.701c0.33,0,0.602,0.268,0.602,0.602
	s-0.271,0.602-0.602,0.602H21.98h-0.175h-0.171h-0.196c-0.024,0-0.048-0.003-0.069-0.003c-4.744-0.117-9.028-2.087-12.153-5.212
	C5.995,27.176,4,22.724,4,17.808c0-4.917,1.994-9.368,5.215-12.59C12.437,1.994,16.889,0,21.805,0 M21.805,14.879
	c0.808,0,1.54,0.33,2.069,0.859c0.53,0.529,0.86,1.261,0.86,2.069c0,0.808-0.33,1.54-0.86,2.07
	c-0.525,0.528-1.261,0.855-2.069,0.855s-1.54-0.327-2.07-0.855h0.004c-0.533-0.533-0.859-1.266-0.859-2.07
	c0-0.805,0.326-1.537,0.855-2.067l0.004-0.002C20.269,15.209,21,14.879,21.805,14.879 M26.426,11.114l-1.582,2.929l0.725,0.726
	l2.93-1.582c-0.278-0.405-0.595-0.783-0.942-1.131C27.209,11.709,26.831,11.393,26.426,11.114 M7.586,13.225l1.98,0.591l0.588,0.179
	l2.785,0.833l0.594,0.179l4.236,1.264l0.429,0.131v0.447v1.917v0.014v0.434l-0.395,0.117c-0.021,0.01-0.045,0.017-0.068,0.021
	l-4.202,1.258l-0.594,0.18l-2.785,0.831l-0.588,0.176l-2.011,0.602c-0.31,0.093-0.636-0.076-0.739-0.378
	c-0.537-1.313-0.812-2.675-0.815-4.081c-0.004-1.412,0.268-2.863,0.818-4.355C6.937,13.273,7.277,13.115,7.586,13.225
	 M35.127,10.977l-1.843,0.997l-0.543,0.292l-2.555,1.379l-0.55,0.295l-3.892,2.097L25.35,16.25l-0.316-0.316l-1.355-1.355
	l-0.315-0.315l0.192-0.358c0.011-0.024,0.024-0.048,0.038-0.072l2.083-3.858l0.297-0.547l1.378-2.557l0.292-0.543l0.994-1.843
	c0.147-0.275,0.478-0.389,0.759-0.271c1.32,0.55,2.489,1.32,3.493,2.321c1.001,0.993,1.836,2.213,2.499,3.665
	C35.521,10.489,35.401,10.829,35.127,10.977 M14.978,4.486l0.993,1.846l0.292,0.54l1.379,2.557l0.295,0.547l2.101,3.892l0.213,0.396
	l-0.317,0.315l-1.357,1.355l-0.313,0.316l-0.357-0.192c-0.027-0.011-0.052-0.024-0.076-0.038l-3.853-2.08l-0.551-0.295l-2.554-1.379
	l-0.543-0.292l-1.842-0.997c-0.275-0.148-0.389-0.479-0.272-0.76c0.547-1.32,1.321-2.489,2.321-3.492
	c0.994-0.998,2.214-1.833,3.661-2.5c0.292-0.13,0.63-0.013,0.777,0.262H14.978z M18.77,14.043l-1.582-2.929
	c-0.406,0.278-0.787,0.595-1.131,0.941h-0.003c-0.344,0.348-0.661,0.726-0.942,1.131l2.933,1.582L18.77,14.043z M14.937,6.938
	L14.19,5.559c-1.093,0.561-2.028,1.231-2.805,2.011c-0.76,0.764-1.372,1.637-1.839,2.616l1.393,0.75
	c0.508-0.805,1.106-1.55,1.776-2.222C13.382,8.048,14.128,7.45,14.937,6.938 M26.388,3.589l-0.591,1.98l-0.176,0.584l-0.836,2.786
	L24.61,9.533l-1.268,4.239l-0.127,0.429h-0.003h-0.447h-1.918h-0.01h-0.437l-0.117-0.396c-0.006-0.024-0.017-0.044-0.02-0.068
	l-1.258-4.205l-0.176-0.594l-0.835-2.786l-0.175-0.584l-0.602-2.011c-0.093-0.31,0.075-0.636,0.381-0.739
	c1.311-0.54,2.672-0.815,4.077-0.818c1.413-0.004,2.868,0.268,4.356,0.822C26.34,2.936,26.498,3.279,26.388,3.589 M24.631,5.263
	l0.451-1.499c-1.173-0.381-2.311-0.567-3.408-0.564c-1.075,0-2.127,0.186-3.149,0.547l0.454,1.516c0.365-0.083,0.735-0.148,1.11-0.2
	c0.571-0.075,1.146-0.117,1.716-0.117c0.574,0,1.148,0.042,1.719,0.117C23.898,5.115,24.266,5.18,24.631,5.263 M32.676,10.936
	l1.379-0.742c-0.561-1.097-1.231-2.028-2.012-2.806c-0.764-0.763-1.637-1.375-2.613-1.842l-0.752,1.393
	c0.808,0.508,1.551,1.107,2.221,1.776C31.568,9.382,32.163,10.127,32.676,10.936 M36.024,22.391l-1.978-0.595L33.46,21.62
	l-2.785-0.831l-0.595-0.18l-4.236-1.269l-0.433-0.127v-0.447v-1.917v-0.014v-0.433l0.396-0.121c0.024-0.007,0.049-0.013,0.072-0.021
	l7.581-2.265l0.587-0.179l2.008-0.599c0.313-0.092,0.637,0.076,0.743,0.378c0.536,1.313,0.812,2.675,0.814,4.081
	c0.003,1.414-0.269,2.864-0.821,4.355C36.678,22.343,36.337,22.501,36.024,22.391 M34.35,20.634l1.499,0.446
	c0.382-1.172,0.567-2.306,0.567-3.403c-0.003-1.079-0.188-2.127-0.547-3.149l-1.52,0.454c0.083,0.365,0.151,0.736,0.199,1.111
	c0.076,0.567,0.117,1.141,0.117,1.715c0,0.57-0.041,1.145-0.117,1.715C34.501,19.898,34.433,20.27,34.35,20.634 M28.637,31.129
	l-0.994-1.846l-0.292-0.54l-1.378-2.558l-0.297-0.546l-2.1-3.896l-0.213-0.392l0.315-0.316l1.355-1.357l0.316-0.313l0.357,0.189
	c0.024,0.014,0.051,0.027,0.075,0.041l3.854,2.08l0.55,0.295l2.555,1.379l0.543,0.292l1.843,0.997
	c0.274,0.145,0.389,0.479,0.271,0.757c-0.551,1.323-1.32,2.488-2.321,3.496c-0.992,0.997-2.214,1.833-3.664,2.499
	C29.124,31.521,28.784,31.404,28.637,31.129 M24.844,21.572l1.582,2.93c0.405-0.282,0.787-0.599,1.131-0.942l0.004-0.004
	c0.344-0.344,0.66-0.722,0.938-1.127l-2.93-1.582L24.844,21.572z M28.678,28.675l0.742,1.379c1.097-0.557,2.031-1.228,2.809-2.008
	c0.76-0.767,1.372-1.637,1.839-2.616l-1.392-0.75c-0.509,0.805-1.107,1.551-1.777,2.221C30.231,27.567,29.485,28.166,28.678,28.675
	 M31.617,24.105l-2.053-1.106c-0.341,0.505-0.729,0.977-1.159,1.406v0.003c-0.433,0.431-0.903,0.818-1.405,1.155l1.106,2.053
	c0.702-0.451,1.351-0.977,1.942-1.567C30.637,25.461,31.163,24.811,31.617,24.105 M17.226,32.026l0.591-1.98l0.175-0.587
	l2.279-7.615l0.127-0.43h0.447h1.918h0.014h0.433h0.003l0.117,0.396c0.007,0.023,0.014,0.044,0.021,0.068l1.257,4.204l0.175,0.592
	l0.836,2.785l0.176,0.587l0.602,2.012c0.092,0.31-0.079,0.636-0.382,0.739c-1.313,0.54-2.671,0.814-4.077,0.818
	c-1.417,0-2.868-0.269-4.355-0.822C17.274,32.68,17.115,32.336,17.226,32.026 M18.979,30.353l-0.446,1.499
	c1.172,0.378,2.306,0.567,3.407,0.563c1.075-0.003,2.125-0.186,3.148-0.547l-0.453-1.516c-0.365,0.083-0.736,0.147-1.111,0.199
	c-0.57,0.076-1.145,0.113-1.719,0.113c-0.57,0-1.145-0.037-1.716-0.113C19.714,30.5,19.344,30.436,18.979,30.353 M8.487,24.639
	l2.34-1.266l0.045-0.023l2.554-1.379l0.551-0.295l3.891-2.101l0.395-0.21l0.313,0.313l1.357,1.357l0.317,0.316l-0.193,0.357
	c-0.014,0.024-0.024,0.048-0.041,0.072l-2.081,3.857l-0.295,0.546l-1.379,2.558l-0.007,0.011l-0.285,0.533v-0.004l-0.993,1.846
	c-0.147,0.272-0.478,0.386-0.76,0.269c-1.324-0.547-2.489-1.32-3.493-2.32c-1-0.993-1.836-2.211-2.5-3.661
	C8.091,25.127,8.208,24.786,8.487,24.639 M10.939,24.68L9.56,25.423c0.557,1.093,1.23,2.028,2.011,2.806
	c0.763,0.76,1.637,1.375,2.613,1.842l0.749-1.392c-0.804-0.513-1.55-1.111-2.217-1.778C12.045,26.23,11.451,25.488,10.939,24.68
	 M15.507,27.616l1.107-2.053c-0.505-0.337-0.979-0.725-1.409-1.155c-0.427-0.43-0.815-0.9-1.155-1.409l-2.053,1.106
	c0.451,0.702,0.977,1.352,1.568,1.943C14.152,26.64,14.805,27.165,15.507,27.616 M9.264,14.981l-1.499-0.45
	c-0.382,1.175-0.567,2.31-0.567,3.407c0.003,1.076,0.185,2.128,0.547,3.149l1.519-0.454c-0.083-0.364-0.151-0.735-0.2-1.11
	c-0.078-0.571-0.116-1.146-0.116-1.715c0-0.574,0.038-1.148,0.116-1.715C9.112,15.718,9.181,15.346,9.264,14.981 M30.049,9.568
	C29.461,8.977,28.809,8.45,28.106,8L27,10.049c0.506,0.339,0.976,0.729,1.405,1.158c0.431,0.429,0.818,0.9,1.159,1.405l2.053-1.106
	C31.166,10.809,30.641,10.155,30.049,9.568 M33.359,16.248c-0.041-0.309-0.093-0.619-0.161-0.921l-2.234,0.67
	c0.038,0.199,0.071,0.403,0.099,0.612c0.053,0.403,0.08,0.805,0.08,1.2c0,0.395-0.027,0.794-0.08,1.2
	c-0.027,0.206-0.061,0.412-0.099,0.612l2.234,0.67c0.068-0.303,0.12-0.611,0.161-0.925c0.069-0.502,0.104-1.021,0.104-1.557
	c0-0.537-0.034-1.056-0.104-1.558V16.248z M23.366,29.362c0.313-0.041,0.618-0.097,0.921-0.161l-0.667-2.238
	c-0.203,0.042-0.406,0.072-0.612,0.1c-0.405,0.052-0.808,0.079-1.203,0.079c-0.392,0-0.794-0.027-1.2-0.079
	c-0.207-0.027-0.413-0.058-0.613-0.1l-0.67,2.238c0.306,0.064,0.612,0.12,0.925,0.161h0.004c0.499,0.065,1.018,0.101,1.554,0.101
	c0.537,0,1.059-0.035,1.558-0.101H23.366z M10.25,19.365c0.044,0.313,0.097,0.622,0.162,0.925l2.238-0.67
	c-0.038-0.2-0.071-0.406-0.1-0.612c-0.052-0.406-0.079-0.805-0.079-1.2c0-0.396,0.027-0.797,0.079-1.2
	c0.028-0.209,0.062-0.413,0.1-0.612l-2.238-0.67c-0.065,0.302-0.117,0.612-0.162,0.921v0.003c-0.065,0.501-0.1,1.021-0.1,1.558
	C10.151,18.344,10.186,18.863,10.25,19.365 M21.805,8.474c0.396,0,0.798,0.023,1.203,0.079c0.206,0.024,0.409,0.058,0.612,0.096
	l0.667-2.234c-0.303-0.065-0.609-0.121-0.921-0.162h-0.003c-0.499-0.069-1.021-0.103-1.558-0.103c-0.536,0-1.055,0.034-1.554,0.103
	h-0.004c-0.313,0.041-0.619,0.096-0.925,0.162l0.67,2.234c0.2-0.038,0.406-0.071,0.613-0.096
	C21.011,8.498,21.414,8.474,21.805,8.474 M22.857,9.739c-0.333-0.042-0.684-0.063-1.052-0.063c-0.364,0-0.715,0.021-1.049,0.063
	c-0.14,0.021-0.278,0.042-0.416,0.065l0.953,3.194h1.024l0.957-3.194C23.135,9.781,22.995,9.76,22.857,9.739 M29.874,16.756
	c-0.018-0.138-0.042-0.278-0.065-0.417l-3.193,0.957v1.024l3.193,0.955c0.023-0.141,0.048-0.278,0.065-0.419
	c0.041-0.33,0.065-0.681,0.065-1.048S29.915,17.089,29.874,16.756 M14.049,12.613L14.049,12.613
	c0.337-0.501,0.725-0.972,1.155-1.401l0.003-0.004c0.43-0.43,0.901-0.819,1.406-1.158l-1.107-2.054
	c-0.702,0.451-1.351,0.981-1.942,1.568c-0.588,0.591-1.114,1.241-1.568,1.942L14.049,12.613z M13.74,18.856
	c0.017,0.141,0.042,0.278,0.065,0.419l3.191-0.955v-1.024l-3.191-0.957c-0.024,0.138-0.048,0.278-0.065,0.417
	c-0.041,0.333-0.065,0.685-0.065,1.052S13.699,18.526,13.74,18.856 M16.057,23.556c0.347,0.348,0.725,0.664,1.131,0.946l1.582-2.93
	l-0.726-0.726l-2.933,1.578C15.393,22.83,15.709,23.209,16.057,23.556 M22.857,25.873c0.138-0.017,0.278-0.038,0.417-0.065
	l-0.957-3.19h-1.024l-0.953,3.19c0.138,0.027,0.276,0.049,0.416,0.065c0.334,0.045,0.685,0.065,1.049,0.065
	C22.173,25.938,22.524,25.918,22.857,25.873 M23.025,16.588c-0.309-0.313-0.743-0.506-1.22-0.506c-0.478,0-0.908,0.193-1.217,0.506
	h-0.003c-0.309,0.309-0.501,0.743-0.501,1.22s0.193,0.908,0.501,1.217h0.003c0.31,0.313,0.743,0.505,1.217,0.505
	c0.478,0,0.908-0.192,1.22-0.505c0.313-0.31,0.506-0.743,0.506-1.217C23.531,17.331,23.338,16.901,23.025,16.588 M21.647,34.409
	h0.32c4.521-0.041,8.611-1.895,11.579-4.861c3.004-3.004,4.864-7.157,4.864-11.74c0-4.587-1.86-8.736-4.864-11.741
	c-3.006-3.004-7.155-4.864-11.741-4.864c-4.583,0-8.736,1.86-11.737,4.864c-3.005,3.005-4.865,7.154-4.865,11.741
	c0,4.583,1.86,8.736,4.865,11.74C13.035,32.515,17.126,34.368,21.647,34.409"/>
</svg>
