<?xml version="1.0" encoding="utf-8"?>
<!-- Generator: Adobe Illustrator 21.1.0, SVG Export Plug-In . SVG Version: 6.00 Build 0)  -->
<svg version="1.1" id="Layer_1" xmlns="http://www.w3.org/2000/svg" xmlns:xlink="http://www.w3.org/1999/xlink" x="0px" y="0px"
	 viewBox="0 0 70 30" style="enable-background:new 0 0 70 30;" xml:space="preserve">
<style type="text/css">
	.st0{fill:#FFFFFF;}
</style>
<polygon class="st0" points="3.7,8.9 2.3,18.8 1,18.8 3.3,3.6 7.1,15.7 11,3.6 13.2,18.8 11.9,18.8 10.5,8.9 7.1,19.4 "/>
<rect x="14" y="4.2" class="st0" width="1.3" height="14.7"/>
<path class="st0" d="M17.1,4.2h2.1c2.1,0,3.7,0,5,1.4c1.3,1.3,1.9,3.3,1.9,6c0,2.6-0.7,4.7-1.9,6c-1.3,1.3-2.7,1.4-4.5,1.4h-2.6V4.2
	z M19.2,17.2c1.9,0,3.2,0,4.1-1c0.9-1,1.4-2.6,1.4-4.7c0-2.1-0.5-3.6-1.4-4.6c-0.9-1-2.2-1.1-4.1-1.1h-0.8v11.4H19.2z"/>
<polygon class="st0" points="30.2,5.8 27.1,5.8 27.1,4.2 34.6,4.2 34.6,5.8 31.5,5.8 31.5,18.8 30.2,18.8 "/>
<path class="st0" d="M44.8,17c-1.1,1.5-2.6,2.3-4.2,2.3c-1.6,0-3.1-0.8-4.2-2.3c-1.1-1.5-1.7-3.3-1.7-5.4s0.6-4,1.7-5.5
	c1.1-1.4,2.6-2.2,4.2-2.2s3.1,0.8,4.2,2.2c1.1,1.5,1.7,3.4,1.7,5.5S45.9,15.5,44.8,17 M43.8,15.8c0.9-1.1,1.3-2.6,1.3-4.3
	s-0.5-3.2-1.3-4.3c-0.9-1.2-2-1.8-3.2-1.8c-1.2,0-2.3,0.6-3.2,1.8c-0.9,1.2-1.3,2.7-1.3,4.3s0.5,3.1,1.3,4.3c0.9,1.2,2,1.8,3.2,1.8
	C41.8,17.6,42.9,17,43.8,15.8"/>
<polygon class="st0" points="47.1,4.2 49.9,15 52.8,3.6 55.8,15 58.6,4.2 60,4.2 55.7,19.4 52.8,8.1 50,19.4 45.7,4.2 "/>
<polygon class="st0" points="60.3,3.6 68.3,15.3 68.3,4.2 69.6,4.2 69.6,19.4 61.6,7.8 61.6,18.8 60.3,18.8 "/>
<path class="st0" d="M2.1,24.3h1.2c0,0.3,0,0.5,0,0.7c0,0.2-0.1,0.3-0.1,0.4c-0.1,0.3-0.2,0.5-0.4,0.6c-0.2,0.2-0.5,0.3-0.8,0.3
	c-0.2,0-0.5-0.1-0.7-0.2c-0.3-0.2-0.5-0.5-0.6-0.8c-0.1-0.3-0.2-0.6-0.2-0.9c0-0.4,0.1-0.7,0.2-1.1C0.9,23,1,22.8,1.3,22.6
	c0.2-0.1,0.4-0.2,0.7-0.2c0.3,0,0.6,0.1,0.9,0.4C2.9,22.9,3,23,3.1,23.2l-0.3,0.4C2.6,23.2,2.3,23,2,23c-0.3,0-0.6,0.1-0.8,0.4
	c-0.2,0.3-0.3,0.6-0.3,1c0,0.4,0.1,0.8,0.3,1c0.2,0.3,0.4,0.4,0.7,0.4c0.2,0,0.4-0.1,0.6-0.3c0.2-0.2,0.3-0.4,0.3-0.7H2.1V24.3z"/>
<path class="st0" d="M12.8,25.4h-1.2l-0.3,0.9h-0.5l1.4-4l1.4,4h-0.5L12.8,25.4z M12.7,24.8l-0.4-1.3l-0.4,1.3H12.7z"/>
<polygon class="st0" points="21.9,22.5 21.9,25.8 22.7,25.8 22.7,26.3 21.4,26.3 21.4,22.5 "/>
<polygon class="st0" points="31,22.5 31,25.8 31.9,25.8 31.9,26.3 30.6,26.3 30.6,22.5 "/>
<polygon class="st0" points="41.3,23 40.2,23 40.2,23.9 41.3,23.9 41.3,24.5 40.2,24.5 40.2,25.8 41.3,25.8 41.3,26.3 39.7,26.3 
	39.7,22.5 41.3,22.5 "/>
<path class="st0" d="M50.3,24.7l0.9,1.6h-0.5l-0.8-1.6h-0.1v1.6h-0.4v-3.8h0.5c0.2,0,0.3,0,0.4,0.1c0.1,0,0.2,0.1,0.3,0.2
	c0.1,0.1,0.2,0.2,0.3,0.4c0.1,0.2,0.1,0.3,0.1,0.5c0,0.3-0.1,0.5-0.2,0.7C50.7,24.5,50.5,24.6,50.3,24.7 M49.8,24.2h0.1
	c0.2,0,0.3,0,0.4-0.1c0.1-0.1,0.2-0.3,0.2-0.5c0-0.2-0.1-0.3-0.2-0.4c-0.1-0.1-0.2-0.1-0.4-0.1h-0.2V24.2z"/>
<rect x="59.1" y="22.5" class="st0" width="0.4" height="3.8"/>
<path class="st0" d="M69.4,25.4h-1.2l-0.3,0.9h-0.5l1.4-4l1.4,4h-0.5L69.4,25.4z M69.2,24.8l-0.4-1.3l-0.4,1.3H69.2z"/>
</svg>
