<?xml version="1.0" encoding="utf-8"?>
<!-- Generator: Adobe Illustrator 16.0.0, SVG Export Plug-In . SVG Version: 6.00 Build 0)  -->
<!DOCTYPE svg PUBLIC "-//W3C//DTD SVG 1.1//EN" "http://www.w3.org/Graphics/SVG/1.1/DTD/svg11.dtd">
<svg version="1.1" id="Layer_1" xmlns="http://www.w3.org/2000/svg" xmlns:xlink="http://www.w3.org/1999/xlink" x="0px" y="0px"
	 width="48px" height="36px" viewBox="0 0 48 36" enable-background="new 0 0 48 36" xml:space="preserve">
<path fill-rule="evenodd" clip-rule="evenodd" fill="#FFFFFF" d="M47.029,29.171H1.303v5.694h45.727V29.171z M8.409,33.039H6.289
	v-2.125h2.121V33.039z M2.824,33.57v-3.183l2.307,1.589L2.824,33.57z M11.124,33.457H9.821v-2.956h1.303V33.457z M13.253,33.457
	h-1.302v-2.956h1.302V33.457z M23.801,32.631c-0.25,0.576-0.826,0.977-1.494,0.977c-0.667,0-1.239-0.4-1.489-0.977h-4.821v-1.304
	h4.821c0.25-0.576,0.822-0.976,1.489-0.976c0.668,0,1.244,0.399,1.494,0.976h21.676v1.304H23.801z M0,28.518V0.649
	C0,0.29,0.295,0,0.654,0h47.028c0.358,0,0.649,0.291,0.649,0.649v27.869v0.004v6.992c0,0.363-0.291,0.654-0.649,0.654H0.654
	C0.295,36.168,0,35.877,0,35.514V28.518z M21.026,20.281c-0.063,0-0.123-0.019-0.177-0.05c-0.108-0.064-0.177-0.178-0.177-0.305
	V8.862c0-0.127,0.068-0.245,0.177-0.309c0.109-0.063,0.246-0.063,0.354,0l9.581,5.535c0.108,0.063,0.177,0.182,0.177,0.305
	c0,0.127-0.068,0.245-0.177,0.309l-9.581,5.53C21.149,20.263,21.086,20.281,21.026,20.281"/>
</svg>
