{
    "common": {
        "logging": "DEBUG",
        "timeout": 60,
        "ssl": false,
        "firefox_debug": false
    },
    "servers": {
        "soar": {
            "url": "https://app.stage.devo.com",
            "domain": "luna_automation",
            "username": "rish.test.user.1@gmail.com",
            "password": "testUser1",
            "authorization": "ee2d1d9406717cc88012492dfdef9f76"
        },
        "portal": {
            "url": "https://us.devo.com",
            "domain": "soardev",
            "api_key": "",
            "api_secret": "",
            "deployment": "Behavior Analytics (Dev)"
        }
    },
    "driver": {
        "connect": "standalone",
        "grid": {
            "hub": "localhost",
            "port": "4444",
            "browser": "chrome",
            "node": {
                "version": "",
                "platform": "linux",
                "name": ""
            }
        },
        "standalone": {
            "browser": "chrome",
            "headless": true
        },
        "width": "1920",
        "height": "1080",
        "ui": {
            "lighthouse": [
                {"url": "/home", "report_name": "home"},
                {"url": "/home/thwarted-attacks", "report_name": "thwarted_attacks"}
            ]
        }
    },
    "performance": {
        "urls": [
            {
                "path": "/#/cases",
                "name": "case_listing_page",
                "category": "case_management"
            },
            {
                "path": "/#/admin/cases",
                "name": "case_configuration_page",
                "category": "case_management"
            },
            {
                "path": "/#/automations/playbooks",
                "name": "playbook_listing_page",
                "category": "automations"
            },
            {
                "path": "/#/automations/streams",
                "name": "stream_listing_page",
                "category": "automations"
            },
            {
                "path": "/#/automations/commands",
                "name": "command_listing_page",
                "category": "automations"
            },
            {
                "path": "/#/automations/integrations",
                "name": "integration_listing_page",
                "category": "automations"
            },
            {
                "path": "/#/automations/configuration-lists",
                "name": "custom_list_listing_page",
                "category": "automations"
            },
            {
                "path": "/#/automations/scripts",
                "name": "script_listing_page",
                "category": "automations"
            },
            {
                "path": "/#/home",
                "name": "home_page",
                "category": "other"
            }
        ]
    },
    "lighthouse": {
        "ci": {
            "collect": {
                "settings": {
                    "preset": "desktop",
                    "disable-storage-reset": true
                }
            },
            "upload": {
                "target": "filesystem"
            }
        }
    },
    "metrics": {
        "thresholds": {
            "performance": {
                "ranges": [[0, 49], [50, 89], [90, 100]],
                "colors": ["#CC0000", "#FFA500", "#008800"]
            },
            "accessibility": {
                "ranges": [[0, 49], [50, 89], [90, 100]],
                "colors": ["#CC0000", "#FFA500", "#008800"]
            },
            "best-practices": {
                "ranges": [[0, 49], [50, 89], [90, 100]],
                "colors": ["#CC0000", "#FFA500", "#008800"]
            },
            "seo": {
                "ranges": [[0, 49], [50, 89], [90, 100]],
                "colors": ["#CC0000", "#FFA500", "#008800"]
            },
            "fcp": {
                "ranges": [[0, 0.9], [0.9, 1.6], [1.6, "inf"]],
                "colors": ["#008800", "#FFA500", "#CC0000"]
            },
            "lcp": {
                "ranges": [[0, 1.2], [1.2, 2.4], [2.4, "inf"]],
                "colors": ["#008800", "#FFA500", "#CC0000"]
            },
            "tbt": {
                "ranges": [[0, 150], [150, 350], [350, "inf"]],
                "colors": ["#008800", "#FFA500", "#CC0000"]
            },
            "cls": {
                "ranges": [[0, 0.1], [0.1, 0.25], [0.25, "inf"]],
                "colors": ["#008800", "#FFA500", "#CC0000"]
            },
            "si": {
                "ranges": [[0, 1.3], [1.3, 2.3], [2.3, "inf"]],
                "colors": ["#008800", "#FFA500", "#CC0000"]
            }
        }
    },
    "artifacts": {
        "screenshots": {
            "path": "o/output/ui/screenshots",
            "enabled": true,
            "onlyOnFailure": false
        },
        "videos": {
            "path": "o/output/ui/videos",
            "enabled": true,
            "onlyOnFailure": true
        }
    }
}