<?xml version="1.0" encoding="UTF-8"?>
<svg width="158px" height="104px" viewBox="0 0 158 104" version="1.1" xmlns="http://www.w3.org/2000/svg" xmlns:xlink="http://www.w3.org/1999/xlink">
    <!-- Generator: Sketch 54.1 (76490) - https://sketchapp.com -->
    <title>azmoon</title>
    <desc>Created with Sketch.</desc>
    <g id="00.Home-Page" stroke="none" stroke-width="1" fill="none" fill-rule="evenodd">
        <g id="00.01.02.Home-Page.Light-Mode" transform="translate(-1017.000000, -2666.000000)" fill-rule="nonzero">
            <g id="Group-35" transform="translate(1008.000000, 2630.000000)">
                <g id="azmoon" transform="translate(9.000000, 36.000000)">
                    <path d="M49.0910351,8.96695039 L109.756929,8.96695039 C120.134267,8.94697475 130.105065,12.9984153 137.525407,20.250134 C144.854815,27.3494043 149.003091,37.1082087 149.028048,47.3100588 L149.028048,56.6860615 C149.003091,66.8879115 144.854815,76.6467159 137.525407,83.7459862 C130.105065,90.9977049 120.134267,95.0491455 109.756929,95.0291698 L49.0910351,95.0291698 C38.7147062,95.0486642 28.7450514,90.9972347 21.3256631,83.7459862 C13.9352188,76.6703497 9.71085302,66.9149673 9.60792447,56.6860615 L9.60792447,47.3100588 C9.71085302,37.0811529 13.9352188,27.3257705 21.3256631,20.250134 C28.7458193,12.9981319 38.7167377,8.94664213 49.0941412,8.96695039 M109.760035,1.74241426e-05 L49.0910351,1.74241426e-05 C36.3640919,-0.010752275 24.1411625,4.97135074 15.0505772,13.8750111 C6.28673374,22.4522799 0,34.2896871 0,47.3100588 L0,56.6860615 C0,69.7087618 6.28983983,81.5438403 15.0505772,90.1203329 C24.1402732,99.0259102 36.363384,104.009759 49.0910351,103.999984 L109.756929,103.999984 C122.484169,104.010334 134.707278,99.0279928 143.798163,90.124214 C152.851317,81.3515691 157.973122,69.2937064 158,56.6899426 L158,47.3100588 C157.973154,34.7060616 152.851361,22.6479458 143.798163,13.8750111 C134.707014,4.97172878 122.48401,-0.0102906763 109.756929,1.74241426e-05" id="Path_1" fill="#E0007A"></path>
                    <path d="M49.3656819,9.00007435 L109.847993,9.00007435 C120.193525,8.9805198 130.133647,13.0289941 137.531246,20.2750809 C144.838927,27.3690249 148.975003,37.1208064 149,47.3153949 L149,56.6846027 C148.97465,66.8791187 144.838631,76.6307686 137.531246,83.7249166 C130.133641,90.9714749 120.193083,95.0200134 109.847219,94.9999232 L49.3656819,94.9999232 C39.0192977,95.020337 29.0781405,90.9717806 21.6801063,83.7249166 C14.3133018,76.6536578 10.102623,66.9056233 10,56.6846027 L10,47.3153949 C10.1022728,37.0942997 14.313008,27.346135 21.6801063,20.2750809 C29.0783258,13.0285001 39.0193622,8.97999295 49.3656819,9.00007435" id="Path_2" fill="#FFFFFF"></path>
                    <path d="M133.316096,54.6013612 L132.625197,60.0709183 C132.618581,60.2474484 132.57323,60.4204281 132.492302,60.5778153 C132.292419,60.7197314 132.056154,60.8027819 131.810729,60.8173973 L118.932345,62.9913537 C122.271041,65.4262054 123.939612,67.9583792 123.938058,70.5878752 C123.938058,74.4828162 121.865621,77.2199058 117.720746,78.7991441 C115.115125,79.7404234 112.356622,80.1969325 109.583839,80.1457337 L78.1413394,80.1611409 L78.1413394,80.1411115 L76.53261,80.1411115 C68.3516639,80.1452201 64.2611909,77.5275363 64.2611909,72.2880601 C64.2611909,70.0493935 64.129332,67.1150916 63.8656144,63.4851546 C63.7411872,60.9262699 63.4449501,58.378442 62.9788703,55.858589 C62.7837373,55.3495814 63.0113015,54.7769758 63.5042331,54.536651 L73.0244918,50.4244684 C73.4435356,50.2098797 73.89589,50.066404 74.3627682,50 C74.6425472,50 74.7870997,50.154072 74.7870997,50.4783937 L74.7964257,68.1481446 C74.7964257,69.9353802 75.9748653,70.9044932 78.3317446,71.0554838 L107.346384,71.040847 C109.717337,71.0769925 112.088285,70.9684232 114.445777,70.715755 C115.145225,70.6217711 115.494949,70.4207071 115.494949,70.112563 C115.494949,69.9407727 115.353505,69.7451012 115.06984,69.5309411 C112.295105,67.6562045 109.421192,65.9299293 106.460417,64.3595133 L107.998425,59.3267504 C108.050169,59.2020819 108.140163,59.0967054 108.255666,59.0255396 L132.75576,54.2007739 C132.926091,54.1510219 133.104985,54.1368566 133.281123,54.1591745 C133.333597,54.3016596 133.345428,54.4557259 133.315319,54.6044427 L133.316096,54.6013612 Z M134,50.9136471 L133.644059,52.7833112 L108.49581,57.7798672 L109.117541,55.6159255 L133.998446,50.9167286 L134,50.9136471 Z M60.1740855,55.4356613 L57.631205,60.8320342 L55.4660262,60.8320342 C51.1054925,60.717204 46.7675577,61.4904097 42.720537,63.1038263 C38.6243648,64.8725732 36.5752424,67.3063977 36.57317,70.4052999 C36.57317,73.4867405 38.4720406,75.5782683 42.2697819,76.6798833 C45.2864545,77.4050671 48.388389,77.7214855 51.4908324,77.6204931 L54.4277351,77.6204931 L57.0172455,77.5981526 C59.7632248,77.5693925 61.1362145,77.9430172 61.1362145,78.7190267 C61.1362145,79.4578021 60.0652826,80.1226229 57.9342989,80.7265852 C54.9204571,81.5703864 50.3325991,81.9948548 44.170725,81.9999906 C38.1870805,82.003072 33.3342096,81.2501734 29.6121123,79.7412946 C25.2024839,77.9633034 22.9984469,75.3425381 23.0000012,71.8789988 C22.9968925,67.0118634 29.1421871,63.3369886 41.435885,60.8543746 C36.8806679,60.4948732 34.2124049,60.3151225 33.431096,60.3151225 C31.9531445,60.2720888 30.4793133,60.4909672 29.0789778,60.9614547 C28.3278549,61.2718852 27.6130572,61.6624474 26.947217,62.1262392 C26.4077448,62.5183231 25.7628167,62.7425008 25.0944581,62.7702603 C23.8890768,62.7702603 23.2859975,62.339629 23.2852204,61.4698924 C23.2852204,60.1702948 23.9427011,58.6904329 25.2475594,57.0326179 C27.2334724,54.5335695 30.0571682,53.2817343 33.7186467,53.2771121 C35.5714056,53.2771121 38.3404408,53.4119251 42.0459587,53.6761587 C45.7514765,53.9403922 48.5104086,54.0775163 50.3616132,54.076746 L59.124137,54.076746 C60.0404133,54.076746 60.4981629,54.2123293 60.4981629,54.4935108 C60.4530081,54.826089 60.3432145,55.1468307 60.1748627,55.4379724 L60.1740855,55.4356613 Z M55.3377941,69.8575738 C55.6486597,70.035527 55.6393337,70.2204134 55.3152564,70.4191663 L50.9304972,73.1269823 C50.6399186,73.3173018 50.2635697,73.32032 49.9699225,73.1346859 L45.5035612,70.4807951 C45.1460658,70.2689461 45.1794838,70.0285937 45.5913807,69.7751452 L49.7103498,67.2267938 C50.0473183,67.0004707 50.4893888,67.0004707 50.8263572,67.2267938 L55.3377941,69.8529516 L55.3377941,69.8575738 Z" id="Path_3" fill="#0E5F69"></path>
                    <path d="M27.8688907,28.3089494 L41.1009556,28.1533074 C42.8325969,28.1735409 44.2842997,28.6669261 44.815112,30.1315175 C45.0603263,31.0712322 45.061644,32.0596119 44.8189363,33 C44.1733951,31.8 42.9266746,31.3922179 41.1277256,31.3447471 C36.7106635,31.2249027 32.0633787,31.5206226 27.6394329,31.4949416 C25.2507775,31.4817121 23.2904432,31.3330739 24.248047,28.1151751 C25.1781158,24.9914397 25.7188713,24.6396887 29.6617207,23.1346304 C30.4835445,22.8895969 31.2591608,22.5060677 31.9562984,22 L31.4828506,24.6941634 C31.1524314,26.3750973 26.5380356,25.8614786 25.7181065,27.6319066 L25.7509954,27.7385214 L25.7509954,27.7424125 L25.7509954,27.7470817 L25.7509954,27.7470817 L25.7509954,27.7470817 L25.7509954,27.751751 L25.7509954,27.751751 L25.7838844,27.8007782 L25.7838844,27.8007782 L25.7953572,27.8155642 L25.7953572,27.8194553 L25.7953572,27.8194553 L25.7953572,27.8194553 L25.7953572,27.8233463 L25.7999464,27.8233463 L25.8427785,27.8684825 L25.8519568,27.8770428 L25.856546,27.8770428 C26.459668,28.2254423 27.1564449,28.3685935 27.84518,28.2856031" id="Path_4" fill="#275C1B"></path>
                    <path d="M97.7148393,38.0784902 C97.4294086,37.5971229 97.0500861,37.1771672 96.5991016,36.843234 L95.3550735,35.8573451 L95.3550735,36.3977697 C95.4618712,37.1650885 95.1144951,37.9249488 94.4624833,38.3502466 L95.8270266,38.8435771 L97.1682445,39.258932 C97.5281804,38.9719238 97.7300439,38.5326735 97.7125068,38.0746301 M93.8404692,35.2397169 C93.0409544,35.004649 92.1767588,35.2527059 91.6268766,35.8751019 C91.1448157,36.4618486 91.3446377,36.7899635 91.8889,37.1875617 C92.2599288,37.4268607 92.6559097,37.6256552 93.0699492,37.7804847 C93.9672087,37.2728119 94.3060655,36.1557808 93.8404692,35.240489 M82.6900894,28.5137465 L81.3177708,31.5447566 C80.9053112,31.3876714 80.4680402,31.3045457 80.0263141,31.2992494 C78.6869105,31.2992494 77.5942391,32.2689256 76.7482999,34.2082779 C76.781474,34.4882694 77.2288058,34.751276 78.0902953,34.9972979 L80.5005998,35.6874973 C81.3721971,35.9376367 81.7663985,36.427107 81.7663985,36.9227536 C81.7256523,37.682168 81.600755,38.4348119 81.3939676,39.1670598 C81.2152693,39.9114233 80.9914551,40.6443898 80.7237474,41.3619558 C80.4004288,41.5779956 80.0597646,41.7672674 79.7051993,41.9278576 C77.3261096,43.1843717 74.6925272,43.8926153 72,44 L72,40.7203946 L72.6033537,40.7203946 C73.9497999,40.6816457 75.2870974,40.4870645 76.5881313,40.1405962 C77.8887626,39.8859348 79.1419016,39.4330585 80.3031104,38.798027 C79.0792977,37.9572807 77.7645154,37.8623204 76.4155224,37.3836586 C75.8567797,37.2198881 75.3539174,36.9072145 74.9615645,36.4796054 C75.0407742,35.6589547 75.2073148,34.8489448 75.4583983,34.0631353 C75.8191241,32.6278961 76.4324249,31.2672391 77.2700142,30.0439202 C78.0323079,28.7784587 79.3867822,27.9809722 80.8706982,27.9239116 C81.4771353,27.9577572 82.0757458,28.0762712 82.648881,28.2759597 L84.8189326,26 C85.1839667,26.6409702 85.3889952,27.3594668 85.4168436,28.0953035 C85.4945953,29.2224748 85.5637944,30.3967403 85.5637944,31.5239116 L85.5637944,35.0752734 C85.5327394,35.8538076 85.6080663,36.6329302 85.7877195,37.3913789 C85.9504854,38.1658904 86.6548073,38.7089617 87.4508296,38.6737294 L90.3649655,38.6737294 C89.6669499,38.3037543 89.1877745,37.626174 89.0742863,36.8486382 C89.1406427,36.2620161 89.4457166,35.7278567 89.9186704,35.3701909 C90.3750745,34.9674458 90.9065457,34.6574212 91.4830358,34.4576453 L92.3523005,34.1364787 L90.9107829,33.2988205 L91.2101272,29.9203946 L91.5825581,30.1419687 L92.6252092,30.807463 L93.5193544,31.4250911 L94.3131999,31.991765 L95.7788205,33.1274287 C96.945073,34.0221016 98.010967,35.0388073 98.95809,36.1599828 C99.1007924,37.4926502 98.877524,38.8388212 98.3119729,40.0556723 C98.077029,40.5987152 97.7400604,41.0923506 97.3190829,41.5101866 C96.8850428,41.4805971 96.4533923,41.4230885 96.0268487,41.3380227 L95.3325254,41.1890199 L94.9103334,41.0662664 C94.174548,40.8560053 93.4526533,40.6004825 92.7488345,40.3011795 L91.755167,40.8941025 L90.9356635,41.3380227 C90.2483934,41.7365898 89.4710319,41.9567097 88.6754198,41.9780399 L87.2043565,41.9780399 C86.3069923,42.0423509 85.4236857,41.7294488 84.7699489,41.1156766 C84.2096221,40.3762405 83.8657676,39.4975527 83.7762815,38.5764529 C83.5935904,37.1622474 83.5187358,35.7363602 83.5523564,34.3109586 C83.5712011,33.2898367 83.5299223,32.268494 83.4287311,31.2521553 C83.298367,30.3148632 83.0510297,29.3973248 82.6924219,28.5206948" id="Path_5" fill="#275C1B"></path>
                    <path d="M54.9961244,37.1954419 C54.8822411,38.6644965 54.4421023,40.0884079 53.7086523,41.3605973 C53.0720023,42.702783 52.2255018,43.9317752 51.2019184,45 L50.8616413,44.9497038 C49.4666198,44.6465828 48.150607,44.0477366 47,43.1924797 C48.3551921,42.5120566 49.6550094,41.7237053 50.8872202,40.8348446 C51.9644888,40.160336 52.8051356,39.159277 53.2900882,37.9734615 C52.8572388,36.854667 52.0736911,35.9111328 51.0600717,35.2881151 L52.7180506,32 C53.4062917,32.6724483 53.9462542,33.4850644 54.3023932,34.384355 C54.7245076,35.2622619 54.9620659,36.2195305 55,37.1954419" id="Path_6" fill="#275C1B"></path>
                    <path d="M29.9984493,37.2047244 C29.884904,38.6766992 29.4446118,40.1034529 28.7106028,41.3779528 C28.083602,42.7132719 27.247526,43.9364971 26.2349292,45 C24.6809321,44.8411857 23.2077007,44.2199389 22,43.2141732 C23.355539,42.5328031 24.6555051,41.7429056 25.8875751,40.8519685 C26.965053,40.1760297 27.8059122,39.1730687 28.2911417,37.9850394 C27.8587699,36.8644265 27.0758484,35.9191078 26.0628029,35.2944882 L27.7220392,32 C28.4097145,32.674242 28.9494915,33.4883151 29.3060671,34.3889764 C29.7269629,35.268881 29.9632667,36.2279912 30,37.2055118" id="Path_7" fill="#275C1B"></path>
                    <path d="M45.9877473,35.9866229 C45.8988059,36.3689262 45.78926,36.7460481 45.6595978,37.1163072 L45.2940546,38.1943972 L45.0986912,38.7111103 L44.9773522,38.9552207 C44.6775326,39.52502 44.2422506,40.0108217 43.7105426,40.3690588 C43.2212707,40.7528872 42.6249804,40.9721287 42.0056917,40.9958911 C41.369308,40.9572064 40.773956,40.6659647 40.3496816,40.1857835 C39.9200399,39.7304139 39.6319316,39.1580697 39.5209134,38.539386 C39.3772714,39.1636702 39.0747833,39.7393669 38.6433043,40.2096554 C38.0928501,40.7529147 37.3417349,41.0381519 36.5729101,40.9958911 C35.4694122,40.9958911 34.5844261,40.1770561 33.917952,38.539386 C33.6545026,39.1635037 33.2744069,39.7305862 32.7984281,40.2096554 C32.3122395,40.6989627 31.6579747,40.9805278 30.9714751,40.9958911 L30,40.9958911 L30,37.7030962 L31.2172056,37.7030962 C31.9848197,37.6809083 32.6697886,37.2109021 32.9724237,36.4987156 C33.2562975,35.9621346 33.3992226,35.3611202 33.3875709,34.7529799 L34.4338335,34.7529799 C34.4338335,36.7207508 35.1644112,37.7041229 36.6255667,37.7030962 C37.7854673,37.717941 38.7946328,36.9048927 39.0370837,35.760224 C39.1203501,35.4311045 39.1618913,35.0926531 39.1607121,34.7529799 L40.2291057,34.7529799 C40.1820185,35.4872734 40.3165484,36.2218627 40.6205957,36.8906783 C40.9265741,37.432767 41.5142759,37.7489128 42.1308464,37.7030962 C42.5695976,37.6949743 43.0046335,37.6202093 43.4213132,37.4813177 C43.7792158,37.3828238 44.1115253,37.2067517 44.3950777,36.9653746 C44.2238899,36.4586329 43.9689649,35.9847724 43.641097,35.5638576 L42.8855901,34.4087611 L44.7117801,32 C45.625858,33.1148766 46.0824103,34.5404987 45.9877473,35.9843127" id="Path_8" fill="#275C1B"></path>
                    <path d="M49.7035124,25 C49.9176292,26.3779388 50.0161377,27.7737344 49.9978523,29.1705866 C50.0030033,29.7790276 49.9890221,30.3874686 49.965475,30.9951195 C49.9220598,32.132193 49.8852673,33.2716371 49.818305,34.4079204 C49.78372,35.364042 49.6998332,36.2964581 49.5843047,37.2430975 L49.4893801,38.0143163 L49.1840024,40.1335874 L48.0331332,42 L48.0103219,37.3845403 C48.0112039,35.6995768 47.9326126,34.0156466 47.7748499,32.339221 C47.6497554,31.2329646 47.5482081,30.4259242 47.4702081,29.9180998 C47.3606376,29.109647 47.2035884,28.3094399 47,27.5222646 C47.9006802,26.6820365 48.8011152,25.8412816 49.7013048,25" id="Path_9" fill="#275C1B"></path>
                    <path d="M70.982369,35.7658989 C70.8970205,36.2241404 70.775104,36.6746175 70.6178187,37.1128994 L70.2532685,38.1917328 L70.0591969,38.7080316 L69.9374265,38.9538515 C69.6390085,39.52377 69.2054016,40.0096759 68.6755804,40.3678937 C68.1871126,40.7521977 67.5919758,40.9718355 66.9738386,40.9959288 C66.3389581,40.9568187 65.7451895,40.6648055 65.3223272,40.1837215 C64.893946,39.7280734 64.6068602,39.155285 64.4965714,38.5361888 C64.3531989,39.160924 64.0518511,39.7371756 63.6221075,40.2083805 C63.0732778,40.7522957 62.3241869,41.0380153 61.5573377,40.9959288 C60.4553153,40.9959288 59.5727333,40.1760155 58.9095919,38.5361888 C58.6460288,39.1610712 58.2662056,39.7287835 57.790826,40.2083805 C57.3060796,40.6983078 56.6535775,40.9803493 55.968836,40.9959288 L55,40.9959288 L55,37.6993224 L56.2177043,37.6993224 C56.9832354,37.6778259 57.6665709,37.2076401 57.9681542,36.494882 C58.2505471,35.9576886 58.3927929,35.3563828 58.3814126,34.7479426 L59.4255941,34.7479426 C59.4255941,36.7160429 60.1544408,37.6998361 61.6121344,37.6993224 C62.4501997,37.707976 63.2349445,37.2839723 63.6944087,36.5742533 C63.9692875,36.0072957 64.1183877,35.3863315 64.1312601,34.754878 L65.1967514,34.754878 C65.1504304,35.4894823 65.2840211,36.224299 65.5856557,36.8940504 C65.891009,37.4362157 66.4770725,37.7522571 67.0918037,37.7062578 C67.5295145,37.6984136 67.9635862,37.6241234 68.379526,37.4858675 C68.7363688,37.3866852 69.067701,37.2102684 69.3506452,36.9687981 C69.1805464,36.4612751 68.9259793,35.9869436 68.5979517,35.5663148 L67.8444972,34.4104219 L69.6710536,32 C70.2810655,32.8024808 70.7003407,33.7364367 70.8963686,34.7294483 C70.9935431,35.0668873 71.0227883,35.4206516 70.982369,35.7697519" id="Path_10" fill="#275C1B"></path>
                    <polygon id="Path_11" fill="#275C1B" points="105 32.8690029 103.149638 35 101 33.1510221 102.868061 31 105 32.864831"></polygon>
                    <polygon id="Path_12" fill="#275C1B" points="130.996782 30.8663325 129.14642 33 127 31.1520468 128.868866 29 131 30.8663325"></polygon>
                    <path d="M114.26884,35.8314215 C113.978884,35.2048846 113.584554,34.641256 113.105543,34.1686857 C112.830024,33.8999314 112.479535,33.737586 112.109176,33.707172 C111.885516,33.8623364 111.671889,34.0337219 111.469772,34.2201437 L111.255892,34.6285913 L110.994318,35.271816 C111.187288,35.5236933 111.430597,35.7251788 111.706008,35.8611707 L111.943735,35.9415738 L112.371495,36.0436857 L112.797019,36.1240888 L113.059339,36.1240888 L113.651048,36.0742389 L113.984164,35.9938358 C114.087664,35.9638266 114.184489,35.9115944 114.26884,35.8402659 M116,37.120283 C116,40.140223 114.829499,43.1001286 112.488496,46 L112.012296,46 L111.681416,45.9501501 L111.34979,45.869747 L111.135911,45.843214 L111.061388,45.817485 L110.942152,45.791756 L110.609781,45.6896441 L110.230461,45.5626072 C109.437677,45.3249569 108.68484,44.9531653 108,44.4610849 C111.258128,43.0449185 113.503742,41.0490459 114.736842,38.473467 L114.282254,38.6141724 L113.788915,38.7540738 L113.267257,38.8344768 L112.721006,38.8594018 C111.54406,38.907411 110.39329,38.4770053 109.496414,37.6533555 C109.398488,35.5891198 110.025123,33.5608741 111.251421,31.9728774 C111.559137,31.5817807 111.928485,31.2524249 112.342431,31 C113.622239,31.0203621 114.760384,31.8828959 115.212296,33.1749035 C115.754857,34.404179 116.023094,35.7534436 115.995529,37.1146548" id="Path_13" fill="#275C1B"></path>
                    <path d="M124.065058,38.639307 L124.065058,38.3992237 L124.09135,38.1811039 C124.141062,37.4690341 123.866191,36.7701391 123.332985,36.2528638 C122.800313,35.856257 122.171844,35.5837484 121.500747,35.4583925 C120.978374,35.7705821 120.618956,36.2676735 120.507395,36.8322446 C120.887238,37.2427692 121.338092,37.5925891 121.841724,37.8675566 C122.541293,38.2168477 123.289308,38.4764939 124.065058,38.639307 M126,37.6509514 L125.529205,38.5915933 L124.954063,39.5557133 C124.643941,40.1157555 124.207482,40.6081943 123.673962,41 L123.016657,41 L122.727442,40.9522863 L122.336346,40.8561015 L121.892665,40.7046294 C121.393628,40.5415373 120.932336,40.2933497 120.532865,39.973019 L119.459815,39.0937234 C118.865501,40.1222191 118.176701,40.6364669 117.393412,40.6364669 L115,40.6364669 L115,37.4101108 L117.760681,37.4101108 C117.898715,37.4101108 118.315282,37.202594 118.701449,36.5906466 L119.824619,34.8070624 C120.212191,34.1527995 120.686937,33.5457425 121.237825,33 C122.963798,33 124.201723,33.3786803 124.951598,34.1360409 C125.648342,34.8575531 125.996987,36.0301998 125.997535,37.6539809" id="Path_14" fill="#275C1B"></path>
                    <path d="M130.997666,37.8040836 C130.881304,39.1627987 130.441319,40.4797546 129.710104,41.6579971 C129.080332,42.888963 128.244013,44.0172919 127.233006,45 L126.861908,44.9759358 C126.651634,44.9621581 126.444072,44.9234439 126.244189,44.8607195 L125.054653,44.4662129 C124.290096,44.2421947 123.588266,43.8615906 123,43.3519689 C124.355274,42.72075 125.655869,41.9912581 126.889915,41.1701507 C127.964273,40.54359 128.803706,39.6188842 129.291549,38.5245503 C128.858673,37.4900797 128.075656,36.6172985 127.062628,36.040107 L128.721288,33 C129.408877,33.6223078 129.948857,34.3734317 130.306039,35.2044239 C130.726523,36.0167209 130.962813,36.9018933 131,37.8040836" id="Path_15" fill="#275C1B"></path>
                    <path d="M133.698687,25.00317 L133.838765,25.935947 L133.907344,26.8695166 L134,29.4934968 L133.954767,30.4009137 L133.907344,32.1666123 L133.861381,33.1968673 L133.788424,34.4086057 C133.788424,34.8286327 133.764105,35.3918388 133.715467,36.0982239 L133.484193,38.0152907 L133.182879,40.1336534 L132.021401,42 L132.021401,37.3844576 C132.113524,34.0611553 131.769606,30.7405314 131,27.5225397 L133.692121,25 L133.698687,25.00317 Z" id="Path_16" fill="#275C1B"></path>
                    <path d="M135,24.0712714 C135,24.3668508 134.581354,24.6869258 133.744061,25.0314963 C132.671664,25.4350174 131.532018,25.598767 130.396944,25.5124253 C130.241097,26.028394 130.030966,26.5241443 129.770515,26.9903225 C129.591755,27.0237998 129.061641,26.9780748 129,26.7314864 C129.014226,26.1710516 129.084479,25.6137942 129.20958,25.0690561 C129.394504,24.2313089 129.625658,23.8001875 129.903044,23.7756919 C130.643991,23.9801941 131.412389,24.0494999 132.175292,23.9806379 C132.842474,23.8885495 133.496103,23.7080481 134.120842,23.4433692 L134.958392,23 L134.993065,24.0712714 L135,24.0712714 Z" id="Path_17" fill="#275C1B"></path>
                    <path d="M108.999529,35.8714234 C109.008718,36.7435512 108.883387,37.6115155 108.628372,38.4418376 C108.5522,38.7648535 108.428481,39.233379 108.257215,39.8474139 C107.522857,40.7454123 106.604428,41.4584092 105.570328,41.9333043 C104.153506,42.6433641 102.601368,43.00802 101.030566,42.9998662 L101,42.9998662 L101,39.7788492 C101.179757,39.7918003 101.36388,39.7994186 101.564013,39.7994186 C102.663669,39.7865188 103.755736,39.6068924 104.806181,39.2661376 C105.879001,39.0484573 106.850149,38.4578712 107.562205,37.5901118 C107.325187,35.9412912 106.595851,34.4132628 105.47863,33.2248262 L106.72892,30 C107.37392,30.8362718 107.897033,31.767942 108.281231,32.7646809 C108.714113,33.7394374 108.958245,34.7943062 108.999529,35.8683761" id="Path_18" fill="#275C1B"></path>
                </g>
            </g>
        </g>
    </g>
</svg>