<?xml version="1.0" encoding="UTF-8"?>
<svg width="83px" height="120px" viewBox="0 0 83 120" version="1.1" xmlns="http://www.w3.org/2000/svg" xmlns:xlink="http://www.w3.org/1999/xlink">
    <!-- Generator: Sketch 54.1 (76490) - https://sketchapp.com -->
    <title>Gaj market</title>
    <desc>Created with Sketch.</desc>
    <g id="00.Home-Page" stroke="none" stroke-width="1" fill="none" fill-rule="evenodd">
        <g id="00.01.02.Home-Page.Light-Mode" transform="translate(-844.000000, -3599.000000)" fill="#C5C436" fill-rule="nonzero">
            <g id="Group-32" transform="translate(798.000000, 3571.000000)">
                <g id="Gaj-market" transform="translate(46.000000, 28.000000)">
                    <path d="M80.2195565,66.6280046 C76.6006004,60.2131838 68.2812481,58.6325431 61.432189,58.1851274 C60.7621282,58.1404399 60.0883746,58.1094469 59.4183138,58.0853013 C52.3859066,57.8409615 42.4402397,57.5070664 35.0162098,55.9375976 C26.3683818,54.2546081 17.3328086,50.8850253 27.0631845,44.5898518 C27.0775033,44.5718426 27.0928529,44.5546369 27.10916,44.538317 C31.1394917,45.8522264 35.3438703,46.5884121 39.5908657,46.7238608 C40.1410948,46.74188 40.6878156,46.7512499 41.2273355,46.7512499 C58.6993233,46.7512499 72.9546868,37.0209038 73.4101952,24.5170486 C73.5579077,20.3558841 72.1651635,16.3976154 69.5977357,12.9249629 L78.0022074,13.2132695 C78.0409819,13.2132695 78.0797564,13.2166931 78.1185309,13.2166931 C79.9082266,13.2144455 81.366664,11.8143375 81.3983609,10.0680381 C81.4300578,8.32173872 80.0233458,6.87210162 78.2348545,6.80799885 L62.3360049,6.25733333 C56.7247765,2.62953595 49.3854966,0.306325712 41.2869745,0.0275693141 C40.7402536,0.00684728062 40.1937174,0 39.6505047,0 C22.1820251,0 7.92666157,9.72674231 7.47170708,22.2343815 C7.16483438,30.7082516 13.2694225,38.349096 22.6617214,42.7684751 C21.0042463,43.6558498 19.4036531,44.6408564 17.8688203,45.7180313 C16.4174309,46.7094606 15.0331901,47.7913617 13.7247462,48.9569753 C13.0718314,49.5462598 12.4625299,50.1799592 11.9014201,50.8533116 C9.61593858,53.6136666 8.1277352,57.2036238 9.83122954,60.5971721 C10.9244866,62.7690214 13.1287263,63.9426093 15.276466,64.9511416 C15.4387651,65.0232183 15.6045724,65.0990789 15.7703796,65.1747594 C15.7703796,65.1747594 15.720896,65.2059325 15.6293142,65.2648552 C14.088119,66.2321237 0.248750761,75.0948473 0.00539442638,81.8304091 C-0.276736437,89.6262183 10.5753312,93.3675364 16.6943213,94.7993388 C23.0496514,96.2862798 29.7718623,96.9230769 36.4728396,96.9230769 C41.7485362,96.9106231 47.0170954,96.5437265 52.2411484,95.8249893 C54.131499,95.566955 56.0112636,95.2606293 57.8804421,94.9060122 C63.6574778,93.804501 69.4838125,92.1671 74.2211368,88.7553523 C81.1542073,83.7580988 84.570982,74.3447097 80.2195565,66.6280046 Z M22.2032588,22.7547748 C22.5876805,12.1400483 30.7521194,3.76618453 40.5639218,3.76618453 C40.7614873,3.76618453 40.9588681,3.76960817 41.1599417,3.77645545 C51.2396577,4.12404504 59.0868839,13.1864209 58.6954458,24.0144943 C58.3108394,34.6292208 50.1465852,43.0032648 40.3345981,43.0032648 C40.1372173,43.0032648 39.9361437,42.9998411 39.7350701,42.9928136 C29.6588623,42.6452241 21.8083125,33.5828482 22.2032588,22.7547748 Z M75.3031308,76.6542253 C75.1410163,80.1717455 71.9526422,82.5052266 68.8209526,83.5757449 C61.2137592,86.1777115 53.228791,86.8799182 45.176983,86.8799182 C44.6162294,86.8799182 44.0554759,86.8764945 43.4912141,86.8694671 C36.8572614,86.7937866 30.258575,86.3153779 23.772704,84.8733046 C19.7203964,83.9723466 13.1675009,82.3055743 13.4496317,77.1084884 C13.4938426,76.1839961 13.7264689,75.2773818 14.1339099,74.4416527 C15.019077,72.6862262 16.5039568,71.0754936 17.8582958,69.6539621 C18.5489383,68.9374647 19.2826418,68.2616939 20.0555191,67.6302303 C20.2743182,67.4511198 20.8103299,66.9211763 21.3465263,66.4701568 C21.3673527,66.4551978 21.3873238,66.4391367 21.4063499,66.4220456 C21.8367471,66.4806079 22.1539597,66.559712 22.605406,66.6526909 C23.8469295,66.9038779 25.1013164,67.1229909 26.3685665,67.3100298 C29.4336007,67.7747439 32.5512575,68.0848537 35.5983817,68.3731602 C40.1021356,68.8000341 44.6234304,69.0822141 49.1449099,69.2818664 C52.8410457,69.4436785 56.5395204,69.5517934 60.2403339,69.6062113 C64.624256,69.6716208 69.8473698,69.5341347 73.3213831,72.1469128 C74.8306355,73.2812189 75.3808645,75.0020486 75.3031308,76.6542253 Z" id="Path_197"></path>
                    <path d="M24,110.769231 C24,115.867244 19.8672438,120 14.7692308,120 C9.67121769,120 5.53846154,115.867244 5.53846154,110.769231 C5.53846154,105.671218 9.67121769,101.538462 14.7692308,101.538462 C19.8672438,101.538462 24,105.671218 24,110.769231 Z" id="Path_198"></path>
                    <path d="M73.8461538,110.769231 C73.8461538,115.867244 69.7133977,120 64.6153846,120 C59.5173715,120 55.3846154,115.867244 55.3846154,110.769231 C55.3846154,105.671218 59.5173715,101.538462 64.6153846,101.538462 C69.7133977,101.538462 73.8461538,105.671218 73.8461538,110.769231 L73.8461538,110.769231 Z" id="Path_199"></path>
                </g>
            </g>
        </g>
    </g>
</svg>