<svg xmlns="http://www.w3.org/2000/svg" width="371.295" height="512" viewBox="0 0 371.295 512">
  <g id="_014-woman" data-name="014-woman" transform="translate(-70.352)">
    <path id="Path_262" data-name="Path 262" d="M353.876,372.212c44.332,0,80.271-37.608,80.271-84a86.338,86.338,0,0,0-14.018-47.436A109.47,109.47,0,0,1,404.1,161.82a155.314,155.314,0,0,0,2.291-26.685C406.389,64.644,359.543,7.5,301.756,7.5a87.284,87.284,0,0,0-30.125,5.373,45.489,45.489,0,0,1-31.261,0A87.294,87.294,0,0,0,210.244,7.5c-57.787,0-104.633,57.144-104.633,127.634a155.314,155.314,0,0,0,2.291,26.685,109.479,109.479,0,0,1-16.031,78.955A86.33,86.33,0,0,0,77.853,288.21c0,46.392,35.938,84,80.271,84H353.876Z" fill="#ea806f"/>
    <path id="Path_263" data-name="Path 263" d="M434.145,288.209c0,46.391-35.934,84-80.264,84H307.967c44.33,0,80.274-37.612,80.274-84a86.3,86.3,0,0,0-14.018-47.431,109.485,109.485,0,0,1-16.032-78.962,155.442,155.442,0,0,0,2.286-26.677c0-60.868-34.932-111.795-81.67-124.557A87.03,87.03,0,0,1,301.754,7.5c57.785,0,104.636,57.148,104.636,127.64a154.449,154.449,0,0,1-2.3,26.677,109.485,109.485,0,0,0,16.032,78.962A86.294,86.294,0,0,1,434.145,288.209Z" fill="#c4715c"/>
    <path id="Path_264" data-name="Path 264" d="M419.867,414.332V504.5H92.133V414.332a95.52,95.52,0,0,1,95.515-95.525h136.7a95.52,95.52,0,0,1,95.517,95.525Z" fill="#fca5cd"/>
    <path id="Path_265" data-name="Path 265" d="M282.244,412.379A33.739,33.739,0,0,0,256,425.2a33.721,33.721,0,0,0-26.235-12.819c-19.162,0-34.692,16.573-34.692,37.025,0,14.469,10.714,37.129,34,55.1h53.864c23.277-17.967,33.991-40.628,33.991-55.1C316.927,428.952,301.4,412.379,282.244,412.379Z" fill="#34d399"/>
    <path id="Path_266" data-name="Path 266" d="M316.927,449.4c0,14.469-10.714,37.129-33.991,55.1h-29.2c23.277-17.967,33.991-40.628,33.991-55.1,0-14.886-8.22-27.714-20.091-33.592a32.771,32.771,0,0,1,14.611-3.432c19.153,0,34.683,16.573,34.683,37.024Z" fill="#059669"/>
    <path id="Path_267" data-name="Path 267" d="M419.867,414.332V504.5H384.454V414.332a95.52,95.52,0,0,0-95.515-95.525h35.413A95.52,95.52,0,0,1,419.867,414.332Z" fill="#fc7cb6"/>
    <path id="Path_268" data-name="Path 268" d="M322.54,318.807a66.54,66.54,0,1,1-133.08,0Z" fill="#ffbfb0"/>
    <path id="Path_269" data-name="Path 269" d="M217.126,276h77.747V335.57H217.126Z" fill="#ffbfb0"/>
    <path id="Path_270" data-name="Path 270" d="M294.874,276v34.759a105.37,105.37,0,0,1-77.748,0V276Z" fill="#ffa792"/>
    <circle id="Ellipse_7" data-name="Ellipse 7" cx="28.624" cy="28.624" r="28.624" transform="translate(317.507 155.846)" fill="#ffa792"/>
    <path id="Path_271" data-name="Path 271" d="M298.7,107.808a45.628,45.628,0,0,1,45.593,47.4L341.9,216.591a85.965,85.965,0,0,1-171.8,0l-1.6-41.281-2.629-67.5H298.7Z" fill="#ffcec0"/>
    <ellipse id="Ellipse_8" data-name="Ellipse 8" cx="13.121" cy="9.516" rx="13.121" ry="9.516" transform="translate(198.282 217.502)" fill="#fc95bb"/>
    <ellipse id="Ellipse_9" data-name="Ellipse 9" cx="13.121" cy="9.516" rx="13.121" ry="9.516" transform="translate(287.476 217.502)" fill="#fc95bb"/>
    <path id="Path_272" data-name="Path 272" d="M160.749,167.787h18.413a128.3,128.3,0,0,0,97.527-44.94l28.477-33.319H151.379v68.889a9.371,9.371,0,0,0,9.37,9.37Z" fill="#ea806f"/>
    <g id="Group_93" data-name="Group 93">
      <path id="Path_273" data-name="Path 273" d="M441.647,288.211A93.737,93.737,0,0,0,426.4,236.665a101.76,101.76,0,0,1-14.916-73.557,163.29,163.29,0,0,0,2.4-27.974c0-29.211-7.6-57.013-21.964-80.4a7.5,7.5,0,1,0-12.78,7.852c12.917,21.022,19.744,46.108,19.744,72.546a148.14,148.14,0,0,1-2.18,25.4,116.7,116.7,0,0,0,17.146,84.354,78.788,78.788,0,0,1,12.792,43.326,77.6,77.6,0,0,1-25.189,57.882,102.785,102.785,0,0,0-77.107-34.786H302.372V294.427a93.534,93.534,0,0,0,46.8-73.972,36.121,36.121,0,0,0,2.437-71.695,53.1,53.1,0,0,0-46.165-48.02l5.419-6.34a7.5,7.5,0,0,0-11.4-9.746l-28.477,33.319a120.375,120.375,0,0,1-33.442,27.256,7.5,7.5,0,1,0,7.25,13.131,135.323,135.323,0,0,0,37.594-30.642L293,115.3h5.7a38.129,38.129,0,0,1,38.1,39.607l-2.384,61.39a78.471,78.471,0,0,1-156.824,0l-1.593-41.015h3.167a135.923,135.923,0,0,0,33.22-4.13,7.5,7.5,0,1,0-3.67-14.544,120.889,120.889,0,0,1-29.55,3.674H160.75a1.872,1.872,0,0,1-1.87-1.87V112.491a7.5,7.5,0,0,0-15,0v45.924a16.889,16.889,0,0,0,16.87,16.87h.235l1.615,41.6a93.581,93.581,0,0,0,47.027,77.545v16.879H187.649a102.784,102.784,0,0,0-77.105,34.784c-16.072-14.553-25.191-35.34-25.191-57.88a78.782,78.782,0,0,1,12.792-43.326,116.705,116.705,0,0,0,17.146-84.354,148.24,148.24,0,0,1-2.18-25.4C113.111,68.892,156.685,15,210.244,15a79.859,79.859,0,0,1,27.546,4.916,53,53,0,0,0,36.42,0A79.859,79.859,0,0,1,301.756,15c21.047,0,41.087,8.222,57.954,23.776a7.5,7.5,0,0,0,10.169-11.027C350.194,9.6,326.637,0,301.756,0a94.813,94.813,0,0,0-32.705,5.831,37.988,37.988,0,0,1-26.1,0A94.812,94.812,0,0,0,210.244,0C148.414,0,98.111,60.621,98.111,135.134a163.2,163.2,0,0,0,2.4,27.974A101.758,101.758,0,0,1,85.6,236.664,93.747,93.747,0,0,0,70.352,288.21c0,27.258,11.252,52.41,31.053,69.84a102.425,102.425,0,0,0-16.773,56.28v25.141a7.5,7.5,0,0,0,15,0V414.33a88.129,88.129,0,0,1,82.73-87.861,74.031,74.031,0,0,0,147.269,0,88.13,88.13,0,0,1,82.733,87.861v90.165a7.5,7.5,0,0,0,15,0V414.33a102.423,102.423,0,0,0-16.778-56.288c19.79-17.438,31.061-42.645,31.061-69.831ZM367.255,184.47a21.143,21.143,0,0,1-17.4,20.775l1.6-41.194A21.142,21.142,0,0,1,367.255,184.47ZM256,377.847a58.887,58.887,0,0,1-58.555-51.54h12.182v9.263a7.5,7.5,0,0,0,15,0V301.327a93.825,93.825,0,0,0,62.748,0V335.57a7.5,7.5,0,0,0,15,0v-9.263h12.184A58.849,58.849,0,0,1,256,377.847Z"/>
      <path id="Path_274" data-name="Path 274" d="M92.133,464.962a7.5,7.5,0,0,0-7.5,7.5V504.5a7.5,7.5,0,0,0,15,0V472.462A7.5,7.5,0,0,0,92.133,464.962Z"/>
      <path id="Path_275" data-name="Path 275" d="M256,226.8a7.5,7.5,0,0,0,7.5-7.5V184.47a7.5,7.5,0,0,0-15,0V219.3A7.5,7.5,0,0,0,256,226.8Z"/>
      <path id="Path_276" data-name="Path 276" d="M210.091,182.356a33.793,33.793,0,0,0-13.519,2.791,7.5,7.5,0,0,0,6.043,13.729,19.5,19.5,0,0,1,14.952,0,7.5,7.5,0,1,0,6.043-13.728A33.773,33.773,0,0,0,210.091,182.356Z"/>
      <path id="Path_277" data-name="Path 277" d="M294.433,198.875a19.5,19.5,0,0,1,14.952,0,7.5,7.5,0,1,0,6.043-13.728,34.137,34.137,0,0,0-27.038,0,7.5,7.5,0,1,0,6.043,13.728Z"/>
      <path id="Path_278" data-name="Path 278" d="M239.131,240.569a7.5,7.5,0,0,0-6.646,8.267,23.654,23.654,0,0,0,47.028,0,7.5,7.5,0,1,0-14.913-1.621,8.654,8.654,0,0,1-17.2,0A7.5,7.5,0,0,0,239.131,240.569Z"/>
      <path id="Path_279" data-name="Path 279" d="M365.984,418.3a7.5,7.5,0,0,0-7.5,7.5v78.7a7.5,7.5,0,0,0,15,0V425.8A7.5,7.5,0,0,0,365.984,418.3Z"/>
      <path id="Path_280" data-name="Path 280" d="M146.016,418.3a7.5,7.5,0,0,0-7.5,7.5v78.7a7.5,7.5,0,0,0,15,0V425.8A7.5,7.5,0,0,0,146.016,418.3Z"/>
      <path id="Path_281" data-name="Path 281" d="M282.245,404.878A40.765,40.765,0,0,0,256,414.54a40.752,40.752,0,0,0-26.235-9.662c-23.265,0-42.192,19.974-42.192,44.525,0,16.2,11.416,41.356,36.918,61.034a7.5,7.5,0,1,0,9.164-11.876c-21.355-16.477-31.082-37.033-31.082-49.158,0-16.28,12.2-29.525,27.192-29.525a26.33,26.33,0,0,1,20.408,10.041,7.5,7.5,0,0,0,11.654,0,26.339,26.339,0,0,1,20.417-10.041c14.989,0,27.183,13.245,27.183,29.525,0,12.125-9.724,32.68-31.073,49.159a7.5,7.5,0,0,0,9.166,11.875c25.5-19.68,36.908-44.834,36.908-61.033C324.427,424.852,305.5,404.878,282.245,404.878Z"/>
    </g>
  </g>
</svg>
