/Users/amiraliataei/Documents/Amirali/Term 6/IE/CA/8/8/Server/src/main/java/com/example/CA6/controller/CoursesController.java
/Users/amiraliataei/Documents/Amirali/Term 6/IE/CA/8/8/Server/src/main/java/com/example/CA6/exception/ExamTimeCollisionException.java
/Users/amiraliataei/Documents/Amirali/Term 6/IE/CA/8/8/Server/src/main/java/com/example/CA6/repository/ClassTimeRepository.java
/Users/amiraliataei/Documents/Amirali/Term 6/IE/CA/8/8/Server/src/main/java/com/example/CA6/util/Tools.java
/Users/amiraliataei/Documents/Amirali/Term 6/IE/CA/8/8/Server/src/main/java/com/example/CA6/repository/PrerequisitesRepository.java
/Users/amiraliataei/Documents/Amirali/Term 6/IE/CA/8/8/Server/src/main/java/com/example/CA6/controller/PasswordCtrl.java
/Users/amiraliataei/Documents/Amirali/Term 6/IE/CA/8/8/Server/src/main/java/com/example/CA6/controller/ReportsController.java
/Users/amiraliataei/Documents/Amirali/Term 6/IE/CA/8/8/Server/src/main/java/com/example/CA6/config/CORSFilter.java
/Users/amiraliataei/Documents/Amirali/Term 6/IE/CA/8/8/Server/src/main/java/com/example/CA6/repository/ExamTimeRepository.java
/Users/amiraliataei/Documents/Amirali/Term 6/IE/CA/8/8/Server/src/main/java/com/example/CA6/exception/MinimumUnitsException.java
/Users/amiraliataei/Documents/Amirali/Term 6/IE/CA/8/8/Server/src/main/java/com/example/CA6/service/Term.java
/Users/amiraliataei/Documents/Amirali/Term 6/IE/CA/8/8/Server/src/main/java/com/example/CA6/util/JwtLink.java
/Users/amiraliataei/Documents/Amirali/Term 6/IE/CA/8/8/Server/src/main/java/com/example/CA6/model/Cards.java
/Users/amiraliataei/Documents/Amirali/Term 6/IE/CA/8/8/Server/src/main/java/com/example/CA6/exception/CapacityException.java
/Users/amiraliataei/Documents/Amirali/Term 6/IE/CA/8/8/Server/src/main/java/com/example/CA6/exception/MaximumUnitsException.java
/Users/amiraliataei/Documents/Amirali/Term 6/IE/CA/8/8/Server/src/main/java/com/example/CA6/service/Grade.java
/Users/amiraliataei/Documents/Amirali/Term 6/IE/CA/8/8/Server/src/main/java/com/example/CA6/model/Crs.java
/Users/amiraliataei/Documents/Amirali/Term 6/IE/CA/8/8/Server/src/main/java/com/example/CA6/model/IdPack.java
/Users/amiraliataei/Documents/Amirali/Term 6/IE/CA/8/8/Server/src/main/java/com/example/CA6/repository/ConnectionPool.java
/Users/amiraliataei/Documents/Amirali/Term 6/IE/CA/8/8/Server/src/main/java/com/example/CA6/exception/ClassTimeCollisionException.java
/Users/amiraliataei/Documents/Amirali/Term 6/IE/CA/8/8/Server/src/main/java/com/example/CA6/model/JwtResponse.java
/Users/amiraliataei/Documents/Amirali/Term 6/IE/CA/8/8/Server/src/main/java/com/example/CA6/model/Courses.java
/Users/amiraliataei/Documents/Amirali/Term 6/IE/CA/8/8/Server/src/main/java/com/example/CA6/repository/Repository.java
/Users/amiraliataei/Documents/Amirali/Term 6/IE/CA/8/8/Server/src/main/java/com/example/CA6/repository/CourseGroupRepository.java
/Users/amiraliataei/Documents/Amirali/Term 6/IE/CA/8/8/Server/src/main/java/com/example/CA6/model/Grd.java
/Users/amiraliataei/Documents/Amirali/Term 6/IE/CA/8/8/Server/src/main/java/com/example/CA6/exception/PrerequisitesException.java
/Users/amiraliataei/Documents/Amirali/Term 6/IE/CA/8/8/Server/src/main/java/com/example/CA6/util/JwtUtil.java
/Users/amiraliataei/Documents/Amirali/Term 6/IE/CA/8/8/Server/src/main/java/com/example/CA6/controller/PlansController.java
/Users/amiraliataei/Documents/Amirali/Term 6/IE/CA/8/8/Server/src/main/java/com/example/CA6/controller/StudentsController.java
/Users/amiraliataei/Documents/Amirali/Term 6/IE/CA/8/8/Server/src/main/java/com/example/CA6/repository/PrevCourseRepository.java
/Users/amiraliataei/Documents/Amirali/Term 6/IE/CA/8/8/Server/src/main/java/com/example/CA6/exception/HadPassedCourseException.java
/Users/amiraliataei/Documents/Amirali/Term 6/IE/CA/8/8/Server/src/main/java/com/example/CA6/repository/CurrCourseRepository.java
/Users/amiraliataei/Documents/Amirali/Term 6/IE/CA/8/8/Server/src/main/java/com/example/CA6/model/JwtRequest.java
/Users/amiraliataei/Documents/Amirali/Term 6/IE/CA/8/8/Server/src/main/java/com/example/CA6/service/Student.java
/Users/amiraliataei/Documents/Amirali/Term 6/IE/CA/8/8/Server/src/main/java/com/example/CA6/config/JwtRequestFilter.java
/Users/amiraliataei/Documents/Amirali/Term 6/IE/CA/8/8/Server/src/main/java/com/example/CA6/repository/StudentRepository.java
/Users/amiraliataei/Documents/Amirali/Term 6/IE/CA/8/8/Server/src/main/java/com/example/CA6/model/EmailRequest.java
/Users/amiraliataei/Documents/Amirali/Term 6/IE/CA/8/8/Server/src/main/java/com/example/CA6/model/Datas.java
/Users/amiraliataei/Documents/Amirali/Term 6/IE/CA/8/8/Server/src/main/java/com/example/CA6/controller/JwtAuthCtrl.java
/Users/amiraliataei/Documents/Amirali/Term 6/IE/CA/8/8/Server/src/main/java/com/example/CA6/exception/StudentNotFoundException.java
/Users/amiraliataei/Documents/Amirali/Term 6/IE/CA/8/8/Server/src/main/java/com/example/CA6/exception/OfferingNotFoundException.java
/Users/amiraliataei/Documents/Amirali/Term 6/IE/CA/8/8/Server/src/main/java/com/example/CA6/model/Std.java
/Users/amiraliataei/Documents/Amirali/Term 6/IE/CA/8/8/Server/src/main/java/com/example/CA6/repository/CourseRepository.java
/Users/amiraliataei/Documents/Amirali/Term 6/IE/CA/8/8/Server/src/main/java/com/example/CA6/controller/LinkController.java
/Users/amiraliataei/Documents/Amirali/Term 6/IE/CA/8/8/Server/src/main/java/com/example/CA6/service/WeeklySchedule.java
/Users/amiraliataei/Documents/Amirali/Term 6/IE/CA/8/8/Server/src/main/java/com/example/CA6/Ca6Application.java
/Users/amiraliataei/Documents/Amirali/Term 6/IE/CA/8/8/Server/src/main/java/com/example/CA6/controller/ProfilesController.java
/Users/amiraliataei/Documents/Amirali/Term 6/IE/CA/8/8/Server/src/main/java/com/example/CA6/service/MinJob.java
/Users/amiraliataei/Documents/Amirali/Term 6/IE/CA/8/8/Server/src/main/java/com/example/CA6/service/Course.java
/Users/amiraliataei/Documents/Amirali/Term 6/IE/CA/8/8/Server/src/main/java/com/example/CA6/model/Card.java
