/Users/amiraahmed/Desktop/serenity-with-bdd/src/test/java/starter/pages/DashboardPage.java
/Users/amiraahmed/Desktop/serenity-with-bdd/src/test/java/starter/pages/HomePage.java
/Users/amiraahmed/Desktop/serenity-with-bdd/src/test/java/starter/stepdefinitions/LoginStepDefinitions.java
/Users/amiraahmed/Desktop/serenity-with-bdd/src/test/java/starter/pages/OrangeHRMDashboard.java
/Users/amiraahmed/Desktop/serenity-with-bdd/src/test/java/starter/pages/OrangeHRMHomePage.java
/Users/amiraahmed/Desktop/serenity-with-bdd/src/test/java/starter/CucumberTestSuite.java
