{
  "name": "Polymorph",
  "manaCost": 4,
  "type": "SPELL",
  "hero": "MAGE",
  "rarity": "UNCOMMON",
  "description": "Transform a minion into a 1/1 sheep",
  "spell": {
    "class": "TransformToSheep"
  }
}