{
  "name": "Avenging Wrath",
  "manaCost": 6,
  "type": "SPELL",
  "hero": "NATURAL",
  "rarity": "EPIC",
  "description": "Deal 8 damage randomly split among all enemies",
  "spell": {
    "class": "DealDamageRandom",
    "value": 6
  }
}