{
  "name": "Covid-20",
  "manaCost": 6,
  "type": "SPELL",
  "hero": "MAGE",
  "rarity": "RARE",
  "description": "Instantly kills the target in the next round",
  "spell": {
    "class": "DelayKill"
  }
}