{
  "name": "Friendly Smith",
  "manaCost": 1,
  "type": "SPELL",
  "hero": "ROGUE",
  "rarity": "FREE",
  "description": "Discover a weapon from any class, Add it to your Adventure Deck with +2/+2",
  "spell": {
    "class": "DiscoverWeapon",
    "value": 2
  }
}