{
  "name": "Book of Specters",
  "manaCost": 2,
  "type": "SPELL",
  "hero": "NATURAL",
  "rarity": "EPIC",
  "description": "Draw 3 cards, Discard any spells drawn.",
  "ability": {
    "name": "DrawCardsDispel",
    "value": 3
  }
}