{
  "name": "Deadly Shot",
  "manaCost": 3,
  "type": "SPELL",
  "hero": "NATURAL",
  "rarity": "COMMON",
  "description": "Destroy a random enemy minion",
  "ability": {
    "name": "DestroyRandomMinion",
    "value": 1
  }
}