id : 1022131442183299072
"user : {'id': 1013432804154204160, 'id_str': '1013432804154204160', 'name': 'هشتگ سید', 'screen_name': 'imalisadeghi', 'location': 'Kiri, Nigeria', 'url': None, 'description': '\u200fسردبیر بلیچر ریپورت(کی به کیه؟) ، مهاجم سایه ی حقوق بشر', 'translator_type': 'none', 'protected': False, 'verified': False, 'followers_count': 1075, 'friends_count': 2079, 'listed_count': 1, 'favourites_count': 1806, 'statuses_count': 489, 'created_at': 'Sun Jul 01 14:43:03 +0000 2018', 'utc_offset': None, 'time_zone': None, 'geo_enabled': False, 'lang': 'fa', 'contributors_enabled': False, 'is_translator': False, 'profile_background_color': 'F5F8FA', 'profile_background_image_url': '', 'profile_background_image_url_https': '', 'profile_background_tile': False, 'profile_link_color': '1DA1F2', 'profile_sidebar_border_color': 'C0DEED', 'profile_sidebar_fill_color': 'DDEEF6', 'profile_text_color': '333333', 'profile_use_background_image': True, 'profile_image_url': 'http://pbs.twimg.com/profile_images/1013434708095635457/Y7oG_lIK_normal.jpg', 'profile_image_url_https': 'https://pbs.twimg.com/profile_images/1013434708095635457/Y7oG_lIK_normal.jpg', 'profile_banner_url': 'https://pbs.twimg.com/profile_banners/1013432804154204160/1532529914', 'default_profile': True, 'default_profile_image': False, 'following': None, 'follow_request_sent': None, 'notifications': None}"
id : 1022131707158429696
"user : {'id': 994530277564219392, 'id_str': '994530277564219392', 'name': 'فِـرشي ـــد', 'screen_name': 'avalinnooresobh', 'location': 'مثلاً شمال', 'url': None, 'description': 'كوه باش و دل نبند', 'translator_type': 'none', 'protected': False, 'verified': False, 'followers_count': 328, 'friends_count': 629, 'listed_count': 0, 'favourites_count': 8476, 'statuses_count': 410, 'created_at': 'Thu May 10 10:51:10 +0000 2018', 'utc_offset': None, 'time_zone': None, 'geo_enabled': True, 'lang': 'en', 'contributors_enabled': False, 'is_translator': False, 'profile_background_color': 'F5F8FA', 'profile_background_image_url': '', 'profile_background_image_url_https': '', 'profile_background_tile': False, 'profile_link_color': '1DA1F2', 'profile_sidebar_border_color': 'C0DEED', 'profile_sidebar_fill_color': 'DDEEF6', 'profile_text_color': '333333', 'profile_use_background_image': True, 'profile_image_url': 'http://pbs.twimg.com/profile_images/994537369444511744/sstCeIGC_normal.jpg', 'profile_image_url_https': 'https://pbs.twimg.com/profile_images/994537369444511744/sstCeIGC_normal.jpg', 'profile_banner_url': 'https://pbs.twimg.com/profile_banners/994530277564219392/1527598661', 'default_profile': True, 'default_profile_image': False, 'following': None, 'follow_request_sent': None, 'notifications': None}"
id : 1022132761694486530
"user : {'id': 934833914841124864, 'id_str': '934833914841124864', 'name': 'mohamadhosein', 'screen_name': 'imohamadhosein', 'location': 'tehran', 'url': None, 'description': 'football player⚽️✋🏼🤚🏼physicalEducationStudents🎓🎽 بی فرهنگ', 'translator_type': 'none', 'protected': False, 'verified': False, 'followers_count': 436, 'friends_count': 397, 'listed_count': 0, 'favourites_count': 17445, 'statuses_count': 2103, 'created_at': 'Sun Nov 26 17:19:08 +0000 2017', 'utc_offset': None, 'time_zone': None, 'geo_enabled': False, 'lang': 'en', 'contributors_enabled': False, 'is_translator': False, 'profile_background_color': 'F5F8FA', 'profile_background_image_url': '', 'profile_background_image_url_https': '', 'profile_background_tile': False, 'profile_link_color': '1DA1F2', 'profile_sidebar_border_color': 'C0DEED', 'profile_sidebar_fill_color': 'DDEEF6', 'profile_text_color': '333333', 'profile_use_background_image': True, 'profile_image_url': 'http://pbs.twimg.com/profile_images/1022005961622519808/k00DApuK_normal.jpg', 'profile_image_url_https': 'https://pbs.twimg.com/profile_images/1022005961622519808/k00DApuK_normal.jpg', 'profile_banner_url': 'https://pbs.twimg.com/profile_banners/934833914841124864/1532464809', 'default_profile': True, 'default_profile_image': False, 'following': None, 'follow_request_sent': None, 'notifications': None}"
id : 1022132830611165184
"user : {'id': 934833914841124864, 'id_str': '934833914841124864', 'name': 'mohamadhosein', 'screen_name': 'imohamadhosein', 'location': 'tehran', 'url': None, 'description': 'football player⚽️✋🏼🤚🏼physicalEducationStudents🎓🎽 بی فرهنگ', 'translator_type': 'none', 'protected': False, 'verified': False, 'followers_count': 436, 'friends_count': 397, 'listed_count': 0, 'favourites_count': 17445, 'statuses_count': 2103, 'created_at': 'Sun Nov 26 17:19:08 +0000 2017', 'utc_offset': None, 'time_zone': None, 'geo_enabled': False, 'lang': 'en', 'contributors_enabled': False, 'is_translator': False, 'profile_background_color': 'F5F8FA', 'profile_background_image_url': '', 'profile_background_image_url_https': '', 'profile_background_tile': False, 'profile_link_color': '1DA1F2', 'profile_sidebar_border_color': 'C0DEED', 'profile_sidebar_fill_color': 'DDEEF6', 'profile_text_color': '333333', 'profile_use_background_image': True, 'profile_image_url': 'http://pbs.twimg.com/profile_images/1022005961622519808/k00DApuK_normal.jpg', 'profile_image_url_https': 'https://pbs.twimg.com/profile_images/1022005961622519808/k00DApuK_normal.jpg', 'profile_banner_url': 'https://pbs.twimg.com/profile_banners/934833914841124864/1532464809', 'default_profile': True, 'default_profile_image': False, 'following': None, 'follow_request_sent': None, 'notifications': None}"
id : 1022135643055562752
"user : {'id': 880402604689416192, 'id_str': '880402604689416192', 'name': 'Parse🇩🇪', 'screen_name': 'Parse01751268', 'location': 'Niederfischbach, Deutschland', 'url': None, 'description': '\u200f\u200f\u200f\u200f\u200f\u200f\u200f\u200f\u200f\u200f\u200f\u200f\u200f\u200f\u200f\u200f\u200f\u200f\u200f\u200f\u200f\u200f\u200f\u200f\u200f\u200f\u200f اصلا هر چی تو بگی، \nگوشتهای توی خورشت هم همش برای تو', 'translator_type': 'none', 'protected': False, 'verified': False, 'followers_count': 704, 'friends_count': 673, 'listed_count': 1, 'favourites_count': 82937, 'statuses_count': 22484, 'created_at': 'Thu Jun 29 12:28:32 +0000 2017', 'utc_offset': None, 'time_zone': None, 'geo_enabled': True, 'lang': 'fa', 'contributors_enabled': False, 'is_translator': False, 'profile_background_color': 'F5F8FA', 'profile_background_image_url': '', 'profile_background_image_url_https': '', 'profile_background_tile': False, 'profile_link_color': '1DA1F2', 'profile_sidebar_border_color': 'C0DEED', 'profile_sidebar_fill_color': 'DDEEF6', 'profile_text_color': '333333', 'profile_use_background_image': True, 'profile_image_url': 'http://pbs.twimg.com/profile_images/1022132037807996928/tr56LM4s_normal.jpg', 'profile_image_url_https': 'https://pbs.twimg.com/profile_images/1022132037807996928/tr56LM4s_normal.jpg', 'profile_banner_url': 'https://pbs.twimg.com/profile_banners/880402604689416192/1530034896', 'default_profile': True, 'default_profile_image': False, 'following': None, 'follow_request_sent': None, 'notifications': None}"
id : 1022138598408237061
"user : {'id': 932269069172125696, 'id_str': '932269069172125696', 'name': 'Shahab', 'screen_name': 'Miliadis133', 'location': None, 'url': None, 'description': 'Nothing Else Matters', 'translator_type': 'none', 'protected': False, 'verified': False, 'followers_count': 1471, 'friends_count': 1524, 'listed_count': 0, 'favourites_count': 50244, 'statuses_count': 7167, 'created_at': 'Sun Nov 19 15:27:21 +0000 2017', 'utc_offset': None, 'time_zone': None, 'geo_enabled': False, 'lang': 'en', 'contributors_enabled': False, 'is_translator': False, 'profile_background_color': 'F5F8FA', 'profile_background_image_url': '', 'profile_background_image_url_https': '', 'profile_background_tile': False, 'profile_link_color': '1DA1F2', 'profile_sidebar_border_color': 'C0DEED', 'profile_sidebar_fill_color': 'DDEEF6', 'profile_text_color': '333333', 'profile_use_background_image': True, 'profile_image_url': 'http://pbs.twimg.com/profile_images/1018965082947182598/T19xwsem_normal.jpg', 'profile_image_url_https': 'https://pbs.twimg.com/profile_images/1018965082947182598/T19xwsem_normal.jpg', 'profile_banner_url': 'https://pbs.twimg.com/profile_banners/932269069172125696/1518555767', 'default_profile': True, 'default_profile_image': False, 'following': None, 'follow_request_sent': None, 'notifications': None}"
id : 1022139239742492672
"user : {'id': 897082511150415872, 'id_str': '897082511150415872', 'name': 'xboγ...||...γodx', 'screen_name': 'nojocky', 'location': None, 'url': None, 'description': None, 'translator_type': 'none', 'protected': False, 'verified': False, 'followers_count': 86, 'friends_count': 86, 'listed_count': 0, 'favourites_count': 3534, 'statuses_count': 142, 'created_at': 'Mon Aug 14 13:08:32 +0000 2017', 'utc_offset': None, 'time_zone': None, 'geo_enabled': False, 'lang': 'fa', 'contributors_enabled': False, 'is_translator': False, 'profile_background_color': 'F5F8FA', 'profile_background_image_url': '', 'profile_background_image_url_https': '', 'profile_background_tile': False, 'profile_link_color': '1DA1F2', 'profile_sidebar_border_color': 'C0DEED', 'profile_sidebar_fill_color': 'DDEEF6', 'profile_text_color': '333333', 'profile_use_background_image': True, 'profile_image_url': 'http://pbs.twimg.com/profile_images/951661666634227712/_dT5J-Uw_normal.jpg', 'profile_image_url_https': 'https://pbs.twimg.com/profile_images/951661666634227712/_dT5J-Uw_normal.jpg', 'profile_banner_url': 'https://pbs.twimg.com/profile_banners/897082511150415872/1515733299', 'default_profile': True, 'default_profile_image': False, 'following': None, 'follow_request_sent': None, 'notifications': None}"
id : 1022145373798899712
"user : {'id': 4757620263, 'id_str': '4757620263', 'name': 'همیشه گریون', 'screen_name': 'gooddainasor', 'location': None, 'url': None, 'description': None, 'translator_type': 'none', 'protected': False, 'verified': False, 'followers_count': 3159, 'friends_count': 2409, 'listed_count': 3, 'favourites_count': 21335, 'statuses_count': 14409, 'created_at': 'Sat Jan 09 20:38:25 +0000 2016', 'utc_offset': None, 'time_zone': None, 'geo_enabled': False, 'lang': 'en', 'contributors_enabled': False, 'is_translator': False, 'profile_background_color': 'F5F8FA', 'profile_background_image_url': '', 'profile_background_image_url_https': '', 'profile_background_tile': False, 'profile_link_color': '1DA1F2', 'profile_sidebar_border_color': 'C0DEED', 'profile_sidebar_fill_color': 'DDEEF6', 'profile_text_color': '333333', 'profile_use_background_image': True, 'profile_image_url': 'http://pbs.twimg.com/profile_images/1020963551727554560/p7Z09NsH_normal.jpg', 'profile_image_url_https': 'https://pbs.twimg.com/profile_images/1020963551727554560/p7Z09NsH_normal.jpg', 'profile_banner_url': 'https://pbs.twimg.com/profile_banners/4757620263/1530080999', 'default_profile': True, 'default_profile_image': False, 'following': None, 'follow_request_sent': None, 'notifications': None}"
id : 1022145757464420352
"user : {'id': 987255615486615552, 'id_str': '987255615486615552', 'name': 'کرمِ دندون', 'screen_name': 'kermedandon', 'location': 'Dandan', 'url': None, 'description': None, 'translator_type': 'none', 'protected': False, 'verified': False, 'followers_count': 1778, 'friends_count': 1467, 'listed_count': 0, 'favourites_count': 4941, 'statuses_count': 3441, 'created_at': 'Fri Apr 20 09:04:15 +0000 2018', 'utc_offset': None, 'time_zone': None, 'geo_enabled': False, 'lang': 'en', 'contributors_enabled': False, 'is_translator': False, 'profile_background_color': 'F5F8FA', 'profile_background_image_url': '', 'profile_background_image_url_https': '', 'profile_background_tile': False, 'profile_link_color': '1DA1F2', 'profile_sidebar_border_color': 'C0DEED', 'profile_sidebar_fill_color': 'DDEEF6', 'profile_text_color': '333333', 'profile_use_background_image': True, 'profile_image_url': 'http://pbs.twimg.com/profile_images/987256216060604416/5hxoE2B0_normal.jpg', 'profile_image_url_https': 'https://pbs.twimg.com/profile_images/987256216060604416/5hxoE2B0_normal.jpg', 'default_profile': True, 'default_profile_image': False, 'following': None, 'follow_request_sent': None, 'notifications': None}"
id : 1022146357174394880
"user : {'id': 1015291581182697473, 'id_str': '1015291581182697473', 'name': 'Samanyolu', 'screen_name': 'Samanyoo', 'location': None, 'url': None, 'description': '\u200fبه قصد فالوبک فالو نکنید .مرسی #استقلال_طلب #آزربایجان', 'translator_type': 'none', 'protected': False, 'verified': False, 'followers_count': 72, 'friends_count': 126, 'listed_count': 0, 'favourites_count': 969, 'statuses_count': 1088, 'created_at': 'Fri Jul 06 17:49:10 +0000 2018', 'utc_offset': None, 'time_zone': None, 'geo_enabled': False, 'lang': 'en', 'contributors_enabled': False, 'is_translator': False, 'profile_background_color': 'F5F8FA', 'profile_background_image_url': '', 'profile_background_image_url_https': '', 'profile_background_tile': False, 'profile_link_color': '1DA1F2', 'profile_sidebar_border_color': 'C0DEED', 'profile_sidebar_fill_color': 'DDEEF6', 'profile_text_color': '333333', 'profile_use_background_image': True, 'profile_image_url': 'http://pbs.twimg.com/profile_images/1015309678899757057/hWFimmgS_normal.jpg', 'profile_image_url_https': 'https://pbs.twimg.com/profile_images/1015309678899757057/hWFimmgS_normal.jpg', 'profile_banner_url': 'https://pbs.twimg.com/profile_banners/1015291581182697473/1531644518', 'default_profile': True, 'default_profile_image': False, 'following': None, 'follow_request_sent': None, 'notifications': None}"
id : 1022152010743853056
"user : {'id': 878841761115885570, 'id_str': '878841761115885570', 'name': 'عقاید یک دلقک', 'screen_name': 'shab_1989', 'location': 'Islamic Republic of Iran', 'url': None, 'description': 'وجیه عندالله', 'translator_type': 'none', 'protected': False, 'verified': False, 'followers_count': 1927, 'friends_count': 616, 'listed_count': 10, 'favourites_count': 28438, 'statuses_count': 7707, 'created_at': 'Sun Jun 25 05:06:18 +0000 2017', 'utc_offset': None, 'time_zone': None, 'geo_enabled': False, 'lang': 'en', 'contributors_enabled': False, 'is_translator': False, 'profile_background_color': 'F5F8FA', 'profile_background_image_url': '', 'profile_background_image_url_https': '', 'profile_background_tile': False, 'profile_link_color': '1DA1F2', 'profile_sidebar_border_color': 'C0DEED', 'profile_sidebar_fill_color': 'DDEEF6', 'profile_text_color': '333333', 'profile_use_background_image': True, 'profile_image_url': 'http://pbs.twimg.com/profile_images/996475830866980864/IIBEOP2i_normal.jpg', 'profile_image_url_https': 'https://pbs.twimg.com/profile_images/996475830866980864/IIBEOP2i_normal.jpg', 'profile_banner_url': 'https://pbs.twimg.com/profile_banners/878841761115885570/1502360646', 'default_profile': True, 'default_profile_image': False, 'following': None, 'follow_request_sent': None, 'notifications': None}"
id : 1022163086763995139
"user : {'id': 4565124497, 'id_str': '4565124497', 'name': 'دودوك', 'screen_name': 'YouTdii', 'location': None, 'url': None, 'description': 'حذف شده در دور مقدماتی', 'translator_type': 'regular', 'protected': False, 'verified': False, 'followers_count': 2982, 'friends_count': 89, 'listed_count': 28, 'favourites_count': 77014, 'statuses_count': 16878, 'created_at': 'Tue Dec 22 06:50:22 +0000 2015', 'utc_offset': None, 'time_zone': None, 'geo_enabled': False, 'lang': 'en', 'contributors_enabled': False, 'is_translator': False, 'profile_background_color': 'F5F8FA', 'profile_background_image_url': '', 'profile_background_image_url_https': '', 'profile_background_tile': False, 'profile_link_color': '1DA1F2', 'profile_sidebar_border_color': 'C0DEED', 'profile_sidebar_fill_color': 'DDEEF6', 'profile_text_color': '333333', 'profile_use_background_image': True, 'profile_image_url': 'http://pbs.twimg.com/profile_images/987454928254853120/B_HXbrgL_normal.jpg', 'profile_image_url_https': 'https://pbs.twimg.com/profile_images/987454928254853120/B_HXbrgL_normal.jpg', 'profile_banner_url': 'https://pbs.twimg.com/profile_banners/4565124497/1530826377', 'default_profile': True, 'default_profile_image': False, 'following': None, 'follow_request_sent': None, 'notifications': None}"
id : 1022169630184558592
"user : {'id': 4744542088, 'id_str': '4744542088', 'name': 'پروستات', 'screen_name': '_prostate_', 'location': 'Amphoe Mueang Chiang Mai, Chan', 'url': None, 'description': None, 'translator_type': 'none', 'protected': False, 'verified': False, 'followers_count': 3455, 'friends_count': 90, 'listed_count': 27, 'favourites_count': 165589, 'statuses_count': 41879, 'created_at': 'Fri Jan 08 12:46:35 +0000 2016', 'utc_offset': None, 'time_zone': None, 'geo_enabled': True, 'lang': 'en', 'contributors_enabled': False, 'is_translator': False, 'profile_background_color': '000000', 'profile_background_image_url': 'http://abs.twimg.com/images/themes/theme1/bg.png', 'profile_background_image_url_https': 'https://abs.twimg.com/images/themes/theme1/bg.png', 'profile_background_tile': False, 'profile_link_color': '1B95E0', 'profile_sidebar_border_color': '000000', 'profile_sidebar_fill_color': '000000', 'profile_text_color': '000000', 'profile_use_background_image': False, 'profile_image_url': 'http://pbs.twimg.com/profile_images/998965880133378048/t8mklsom_normal.jpg', 'profile_image_url_https': 'https://pbs.twimg.com/profile_images/998965880133378048/t8mklsom_normal.jpg', 'default_profile': False, 'default_profile_image': False, 'following': None, 'follow_request_sent': None, 'notifications': None}"
id : 1022169941729075201
"user : {'id': 842614335541252096, 'id_str': '842614335541252096', 'name': 'چــارســـــو', 'screen_name': 'charsuo', 'location': 'ایران', 'url': None, 'description': '\u200f', 'translator_type': 'none', 'protected': False, 'verified': False, 'followers_count': 10, 'friends_count': 125, 'listed_count': 0, 'favourites_count': 38, 'statuses_count': 115, 'created_at': 'Fri Mar 17 05:51:27 +0000 2017', 'utc_offset': None, 'time_zone': None, 'geo_enabled': False, 'lang': 'fa', 'contributors_enabled': False, 'is_translator': False, 'profile_background_color': 'F5F8FA', 'profile_background_image_url': '', 'profile_background_image_url_https': '', 'profile_background_tile': False, 'profile_link_color': '1DA1F2', 'profile_sidebar_border_color': 'C0DEED', 'profile_sidebar_fill_color': 'DDEEF6', 'profile_text_color': '333333', 'profile_use_background_image': True, 'profile_image_url': 'http://pbs.twimg.com/profile_images/1009315941287636992/NRV0-xdp_normal.jpg', 'profile_image_url_https': 'https://pbs.twimg.com/profile_images/1009315941287636992/NRV0-xdp_normal.jpg', 'profile_banner_url': 'https://pbs.twimg.com/profile_banners/842614335541252096/1528737342', 'default_profile': True, 'default_profile_image': False, 'following': None, 'follow_request_sent': None, 'notifications': None}"
id : 1022170728786014208
"user : {'id': 858017213021913088, 'id_str': '858017213021913088', 'name': 'پدرام', 'screen_name': 'pedram_1211', 'location': None, 'url': None, 'description': '\u200fحیلت رها کن عاشقا دیوانه شو دیوانه شو', 'translator_type': 'none', 'protected': False, 'verified': False, 'followers_count': 89, 'friends_count': 104, 'listed_count': 0, 'favourites_count': 2252, 'statuses_count': 328, 'created_at': 'Fri Apr 28 17:56:59 +0000 2017', 'utc_offset': None, 'time_zone': None, 'geo_enabled': False, 'lang': 'en', 'contributors_enabled': False, 'is_translator': False, 'profile_background_color': 'F5F8FA', 'profile_background_image_url': '', 'profile_background_image_url_https': '', 'profile_background_tile': False, 'profile_link_color': '1DA1F2', 'profile_sidebar_border_color': 'C0DEED', 'profile_sidebar_fill_color': 'DDEEF6', 'profile_text_color': '333333', 'profile_use_background_image': True, 'profile_image_url': 'http://pbs.twimg.com/profile_images/1017798536216399872/8jdb068A_normal.jpg', 'profile_image_url_https': 'https://pbs.twimg.com/profile_images/1017798536216399872/8jdb068A_normal.jpg', 'profile_banner_url': 'https://pbs.twimg.com/profile_banners/858017213021913088/1531412249', 'default_profile': True, 'default_profile_image': False, 'following': None, 'follow_request_sent': None, 'notifications': None}"
id : 1022171856625905665
"user : {'id': 1005894712593731585, 'id_str': '1005894712593731585', 'name': 'آنارشی', 'screen_name': 'anarchy_bidiin', 'location': None, 'url': None, 'description': '\u200f\u200f\u200f\u200f\u200f\u200f\u200fمرتد   بیرحمانه آنارشیست\n /\u200f\u200f\u200f با احمقا بددهنم', 'translator_type': 'none', 'protected': False, 'verified': False, 'followers_count': 221, 'friends_count': 242, 'listed_count': 2, 'favourites_count': 6813, 'statuses_count': 3353, 'created_at': 'Sun Jun 10 19:29:22 +0000 2018', 'utc_offset': None, 'time_zone': None, 'geo_enabled': False, 'lang': 'en', 'contributors_enabled': False, 'is_translator': False, 'profile_background_color': 'F5F8FA', 'profile_background_image_url': '', 'profile_background_image_url_https': '', 'profile_background_tile': False, 'profile_link_color': '1DA1F2', 'profile_sidebar_border_color': 'C0DEED', 'profile_sidebar_fill_color': 'DDEEF6', 'profile_text_color': '333333', 'profile_use_background_image': True, 'profile_image_url': 'http://pbs.twimg.com/profile_images/1015121668392542208/kYDGSAkQ_normal.jpg', 'profile_image_url_https': 'https://pbs.twimg.com/profile_images/1015121668392542208/kYDGSAkQ_normal.jpg', 'profile_banner_url': 'https://pbs.twimg.com/profile_banners/1005894712593731585/1531873745', 'default_profile': True, 'default_profile_image': False, 'following': None, 'follow_request_sent': None, 'notifications': None}"
id : 1022171905435021314
"user : {'id': 2659547583, 'id_str': '2659547583', 'name': 'کاپیش👻', 'screen_name': '0098Boy', 'location': None, 'url': None, 'description': '\u200f\u200f\u200f\u200fخداوند مارا طوری بکند که طوری نشود.', 'translator_type': 'none', 'protected': False, 'verified': False, 'followers_count': 221, 'friends_count': 142, 'listed_count': 0, 'favourites_count': 10476, 'statuses_count': 3882, 'created_at': 'Tue Jul 01 10:17:57 +0000 2014', 'utc_offset': None, 'time_zone': None, 'geo_enabled': False, 'lang': 'en', 'contributors_enabled': False, 'is_translator': False, 'profile_background_color': 'C0DEED', 'profile_background_image_url': 'http://abs.twimg.com/images/themes/theme1/bg.png', 'profile_background_image_url_https': 'https://abs.twimg.com/images/themes/theme1/bg.png', 'profile_background_tile': False, 'profile_link_color': '1DA1F2', 'profile_sidebar_border_color': 'C0DEED', 'profile_sidebar_fill_color': 'DDEEF6', 'profile_text_color': '333333', 'profile_use_background_image': True, 'profile_image_url': 'http://pbs.twimg.com/profile_images/1015939109708292096/z-wMnBI-_normal.jpg', 'profile_image_url_https': 'https://pbs.twimg.com/profile_images/1015939109708292096/z-wMnBI-_normal.jpg', 'profile_banner_url': 'https://pbs.twimg.com/profile_banners/2659547583/1531520951', 'default_profile': True, 'default_profile_image': False, 'following': None, 'follow_request_sent': None, 'notifications': None}"
id : 1022177977432301569
"user : {'id': 854739858883051520, 'id_str': '854739858883051520', 'name': 'Mahdi', 'screen_name': 'Mahdiiofficial', 'location': 'Iran', 'url': 'http://soundcloud.com/mahdiiofficial', 'description': 'Fighting for Freedom | Daily Life | Poor Writer', 'translator_type': 'none', 'protected': False, 'verified': False, 'followers_count': 5762, 'friends_count': 2510, 'listed_count': 34, 'favourites_count': 93350, 'statuses_count': 115531, 'created_at': 'Wed Apr 19 16:53:57 +0000 2017', 'utc_offset': None, 'time_zone': None, 'geo_enabled': True, 'lang': 'en', 'contributors_enabled': False, 'is_translator': False, 'profile_background_color': '000000', 'profile_background_image_url': 'http://abs.twimg.com/images/themes/theme1/bg.png', 'profile_background_image_url_https': 'https://abs.twimg.com/images/themes/theme1/bg.png', 'profile_background_tile': False, 'profile_link_color': 'ABB8C2', 'profile_sidebar_border_color': '000000', 'profile_sidebar_fill_color': '000000', 'profile_text_color': '000000', 'profile_use_background_image': False, 'profile_image_url': 'http://pbs.twimg.com/profile_images/1021302930178158592/z4rYfEHH_normal.jpg', 'profile_image_url_https': 'https://pbs.twimg.com/profile_images/1021302930178158592/z4rYfEHH_normal.jpg', 'profile_banner_url': 'https://pbs.twimg.com/profile_banners/854739858883051520/1529999526', 'default_profile': False, 'default_profile_image': False, 'following': None, 'follow_request_sent': None, 'notifications': None}"
id : 1022184991898390529
"user : {'id': 1250172013, 'id_str': '1250172013', 'name': 'امیررخان', 'screen_name': 'amirrmte', 'location': 'Tehran', 'url': None, 'description': '\u200f\u200f\u200f\u200f\u200f\u200f\u200f\u200f\u200f\u200f\u200f\u200f\u200f\u200f\u200f\u200f\u200f\u200f\u200f\u200f\u200f\u200f\u200f\u200f\u200f\u200f\u200f\u200f\u200f\u200f\u200f\u200f\u200f\u200f\u200f\u200f\u200f\u200f\u200f\u200f\u200f\u200f\u200f\u200f\u200f\u200f\u200f\u200f\u200f\u200f\u200f\u200f\u200f\u200f\u200f\u200f\u200f\u200f\u200f\u200f\u200f\u200f\u200f\u200f\u200f', 'translator_type': 'regular', 'protected': False, 'verified': False, 'followers_count': 3004, 'friends_count': 171, 'listed_count': 32, 'favourites_count': 354030, 'statuses_count': 20992, 'created_at': 'Thu Mar 07 22:18:42 +0000 2013', 'utc_offset': None, 'time_zone': None, 'geo_enabled': False, 'lang': 'en', 'contributors_enabled': False, 'is_translator': False, 'profile_background_color': '0099B9', 'profile_background_image_url': 'http://abs.twimg.com/images/themes/theme4/bg.gif', 'profile_background_image_url_https': 'https://abs.twimg.com/images/themes/theme4/bg.gif', 'profile_background_tile': False, 'profile_link_color': '0099B9', 'profile_sidebar_border_color': '5ED4DC', 'profile_sidebar_fill_color': '95E8EC', 'profile_text_color': '3C3940', 'profile_use_background_image': True, 'profile_image_url': 'http://pbs.twimg.com/profile_images/1019985130407030789/CVM_12ha_normal.jpg', 'profile_image_url_https': 'https://pbs.twimg.com/profile_images/1019985130407030789/CVM_12ha_normal.jpg', 'profile_banner_url': 'https://pbs.twimg.com/profile_banners/1250172013/1531213061', 'default_profile': False, 'default_profile_image': False, 'following': None, 'follow_request_sent': None, 'notifications': None}"
id : 1022186764029517824
"user : {'id': 957614798136664064, 'id_str': '957614798136664064', 'name': 'Dr.IQ', 'screen_name': 'Dr_Iq98', 'location': 'ایران اشغالی', 'url': None, 'description': 'I live in a country where freedom is restricted!', 'translator_type': 'none', 'protected': False, 'verified': False, 'followers_count': 149, 'friends_count': 369, 'listed_count': 0, 'favourites_count': 931, 'statuses_count': 146, 'created_at': 'Sun Jan 28 14:02:14 +0000 2018', 'utc_offset': None, 'time_zone': None, 'geo_enabled': False, 'lang': 'en', 'contributors_enabled': False, 'is_translator': False, 'profile_background_color': 'F5F8FA', 'profile_background_image_url': '', 'profile_background_image_url_https': '', 'profile_background_tile': False, 'profile_link_color': '1DA1F2', 'profile_sidebar_border_color': 'C0DEED', 'profile_sidebar_fill_color': 'DDEEF6', 'profile_text_color': '333333', 'profile_use_background_image': True, 'profile_image_url': 'http://pbs.twimg.com/profile_images/1021138359995912192/crAmU4XI_normal.jpg', 'profile_image_url_https': 'https://pbs.twimg.com/profile_images/1021138359995912192/crAmU4XI_normal.jpg', 'profile_banner_url': 'https://pbs.twimg.com/profile_banners/957614798136664064/1517149268', 'default_profile': True, 'default_profile_image': False, 'following': None, 'follow_request_sent': None, 'notifications': None}"
