<?xml version="1.0" encoding="iso-8859-1"?>
<!-- Generator: Adobe Illustrator 18.1.1, SVG Export Plug-In . SVG Version: 6.00 Build 0)  -->
<svg version="1.1" id="Capa_1" xmlns="http://www.w3.org/2000/svg" xmlns:xlink="http://www.w3.org/1999/xlink" x="0px" y="0px" width="17" height="17"
	 viewBox="0 0 40.528 40.528" style="enable-background:new 0 0 40.528 40.528;" xml:space="preserve">
<g>
	<path style="fill:#010002;" d="M20.264,0C11.749,0,4.847,6.903,4.847,15.417c0,5.054,5.432,14.649,9.847,21.613
		c2.957,4.664,8.183,4.664,11.14,0c4.415-6.965,9.847-16.559,9.847-21.613C35.681,6.902,28.779,0,20.264,0z M20.264,22.667
		c-4.234,0-7.667-3.433-7.667-7.667s3.433-7.667,7.667-7.667s7.667,3.433,7.667,7.667S24.498,22.667,20.264,22.667z"/>
</g>
<g>
</g>
<g>
</g>
<g>
</g>
<g>
</g>
<g>
</g>
<g>
</g>
<g>
</g>
<g>
</g>
<g>
</g>
<g>
</g>
<g>
</g>
<g>
</g>
<g>
</g>
<g>
</g>
<g>
</g>
</svg>
