<?xml version="1.0" encoding="iso-8859-1"?>
<!-- Generator: Adobe Illustrator 19.0.0, SVG Export Plug-In . SVG Version: 6.00 Build 0)  -->
<svg fill="#666666" version="1.1" id="Capa_1" xmlns="http://www.w3.org/2000/svg" xmlns:xlink="http://www.w3.org/1999/xlink" x="0px" y="0px"
	 viewBox="0 0 57.949 57.949" style="enable-background:new 0 0 57.949 57.949;" xml:space="preserve">
<g>
	<path d="M29.975,27.985h11.972c-0.123-4.348-1.033-8.567-2.664-12.477c-3.01,0.874-6.131,1.355-9.308,1.44V27.985z"/>
	<path d="M40.384,13.057c2.928-1.01,5.731-2.392,8.328-4.169l0.653-0.5C44.588,3.658,38.18,0.58,31.071,0.069L30.553,0.49
		C34.767,3.979,38.099,8.268,40.384,13.057z"/>
	<path d="M29.975,2.628v12.32c2.891-0.082,5.731-0.513,8.473-1.283C36.421,9.505,33.557,5.753,29.975,2.628z"/>
	<path d="M41.531,42.202c3.13,1.132,6.12,2.668,8.885,4.639l0.868,0.65c3.976-4.785,6.439-10.866,6.665-17.505H43.947
		C43.834,34.224,43.006,38.343,41.531,42.202z"/>
	<path d="M9.237,8.888c2.597,1.777,5.401,3.158,8.328,4.169c2.285-4.788,5.617-9.077,9.832-12.567l-0.518-0.421
		c-7.125,0.512-13.547,3.603-18.328,8.35L9.237,8.888z"/>
	<path d="M27.975,2.628c-3.583,3.125-6.446,6.878-8.473,11.036c2.742,0.77,5.582,1.202,8.473,1.283V2.628z"/>
	<path d="M14.003,29.985H0c0.227,6.639,2.689,12.719,6.665,17.505l0.85-0.635c2.775-1.977,5.771-3.518,8.906-4.652
		C14.943,38.341,14.116,34.222,14.003,29.985z"/>
	<path d="M16.752,14.89c-3.037-1.064-5.945-2.505-8.644-4.351L7.17,9.897C2.901,14.768,0.236,21.072,0,27.985h14.003
		C14.124,23.425,15.061,18.997,16.752,14.89z"/>
	<path d="M16.003,27.985h11.972V16.948c-3.179-0.085-6.301-0.566-9.309-1.438C17.035,19.419,16.125,23.637,16.003,27.985z"/>
	<path d="M27.297,57.391c-4.419-3.695-7.841-8.259-10.111-13.341c-2.992,1.074-5.851,2.538-8.492,4.42l-0.689,0.515
		c4.774,5.003,11.31,8.304,18.605,8.896L27.297,57.391z"/>
	<path d="M27.975,40.023V29.985H16.003c0.113,4.019,0.905,7.924,2.313,11.58C21.429,40.627,24.669,40.111,27.975,40.023z"/>
	<path d="M49.236,48.456c-2.631-1.875-5.482-3.335-8.469-4.406c-2.272,5.094-5.698,9.662-10.113,13.344l0.685,0.487
		c7.295-0.592,13.832-3.892,18.606-8.895L49.236,48.456z"/>
	<path d="M49.885,10.507c-2.72,1.862-5.643,3.311-8.689,4.38c1.692,4.108,2.629,8.537,2.751,13.098h14.003
		c-0.237-6.935-2.917-13.256-7.209-18.133L49.885,10.507z"/>
	<path d="M27.975,55.342V42.023c-3.039,0.085-6.016,0.556-8.882,1.4C21.136,47.932,24.141,51.998,27.975,55.342z"/>
	<path d="M41.947,29.985H29.975v10.038c3.307,0.088,6.548,0.604,9.662,1.542C41.041,37.91,41.833,34.005,41.947,29.985z"/>
	<path d="M38.86,43.423c-2.866-0.844-5.845-1.314-8.885-1.4v13.323C33.806,52.013,36.814,47.943,38.86,43.423z"/>
</g>
<g>
</g>
<g>
</g>
<g>
</g>
<g>
</g>
<g>
</g>
<g>
</g>
<g>
</g>
<g>
</g>
<g>
</g>
<g>
</g>
<g>
</g>
<g>
</g>
<g>
</g>
<g>
</g>
<g>
</g>
</svg>
