<?xml version="1.0" encoding="iso-8859-1"?>
<!-- Generator: Adobe Illustrator 19.0.0, SVG Export Plug-In . SVG Version: 6.00 Build 0)  -->
<svg version="1.1" id="Layer_1" xmlns="http://www.w3.org/2000/svg" xmlns:xlink="http://www.w3.org/1999/xlink" x="0px" y="0px"
	width="18" height="18" fill="rgb(144, 190, 196)" viewBox="0 0 512 512" style="enable-background:new 0 0 512 512;" xml:space="preserve">
<g>
	<g>
		<circle cx="256" cy="101.632" r="17.303"/>
	</g>
</g>
<g>
	<g>
		<path d="M301.9,252.502l31.776-26.642l-21.453-25.588l-39.527,33.141v-32.727c11.463-3.623,21.493-10.907,28.483-20.805
			c17.657-1.616,33.729-11.657,42.837-27.434c9.11-15.777,9.77-34.714,2.34-50.815c7.432-16.101,6.771-35.037-2.34-50.816
			s-25.178-25.819-42.837-27.434C290.95,8.898,274.218,0,256,0c-18.218,0-34.948,8.895-45.177,23.382
			c-17.657,1.616-33.729,11.657-42.838,27.434c-9.109,15.777-9.77,34.714-2.34,50.816c-7.432,16.101-6.771,35.037,2.34,50.815
			c9.11,15.779,25.178,25.819,42.838,27.434c6.99,9.899,17.018,17.182,28.482,20.806v32.727l-39.528-33.14l-21.453,25.588
			l31.776,26.642h-91.186v103.243h19.535L161.333,512h189.333l22.884-156.255h19.535V252.502H301.9z M235.835,156.563l-4.921-11.484
			l-12.406,1.483c-8.737,1.044-17.212-3.2-21.605-10.81c-4.393-7.61-3.827-17.075,1.441-24.115l7.489-10.004l-7.489-10.004
			c-5.268-7.041-5.835-16.506-1.441-24.116s12.877-11.856,21.605-10.81l12.406,1.483l4.921-11.486
			c3.463-8.085,11.378-13.308,20.165-13.308c8.789,0,16.703,5.222,20.165,13.305l4.92,11.487l12.407-1.483
			c8.737-1.046,17.211,3.2,21.605,10.81c4.393,7.61,3.827,17.075-1.441,24.116l-7.489,10.004l7.489,10.004
			c5.268,7.04,5.835,16.505,1.441,24.115c-4.392,7.609-12.868,11.859-21.605,10.81l-12.407-1.483l-4.92,11.487
			c-3.462,8.083-11.378,13.305-20.165,13.305C247.213,169.869,239.298,164.646,235.835,156.563z M321.81,478.609H190.19
			l-17.995-122.863h167.609L321.81,478.609z M359.695,322.353H152.306v-36.46h207.389V322.353z"/>
	</g>
</g>
<g>
</g>
<g>
</g>
<g>
</g>
<g>
</g>
<g>
</g>
<g>
</g>
<g>
</g>
<g>
</g>
<g>
</g>
<g>
</g>
<g>
</g>
<g>
</g>
<g>
</g>
<g>
</g>
<g>
</g>
</svg>
