[
    [
        "A",
        "B",
        [
            "a"
        ]
    ],
    [
        "A",
        "C",
        [
            "c"
        ]
    ],
    [
        "B",
        "A",
        [
            "b"
        ]
    ],
    [
        "C",
        "D",
        [
            "d"
        ]
    ],
    [
        "D",
        "C",
        [
            "e"
        ]
    ],
    [
        "D",
        "E",
        [
            "f"
        ]
    ]
]
