
{
  "type": "mysql",
  "host": "0.0.0.0",
  "port": 3306,
  "username": "root",
  "password": "P@ssword123",
  "database": "testdb_nest",
  "entities": ["dist/**/*.entity{.ts,.js}"],
  "synchronize": true
}