{
	"objects": {
		"cube": [{
				"id": 1,
				"dimention": {
					"ab": 2,
					"ad": 2,
					"ae": 7
				},
				"placement": {
					"x": 7,
					"y": 5,
					"z": 0
				},
				"color": 8169980
			},
			{
				"id": 2,
				"dimention": {
					"ab": 1,
					"ad": 1,
					"ae": 4
				},
				"placement": {
					"x": 4,
					"y": 4,
					"z": 6
				},
				"color": 16711680
			}
		],
		"plane": {
			"width": 60,
			"height": 20,
			"placement": {
				"x": 0,
				"y": 0,
				"z": 0
			},
			"color": "0xffffff",
			"rotation": "default"
		},
		"camera": {
			"type": "perspective",
			"attribute": {
				"fov": "default",
				"aspect_ratio": "default",
				"near": 0.1,
				"far": 1000
			},
			"lookAt": {
				"x": 0,
				"y": 0,
				"z": 0
			},
			"placement": {
				"x": 0,
				"y": 100,
				"z": 200
			}
		},
		"robots": [{
				"id": "robot1",
				"placement": {
					"row": 5,
					"col": 9
				},
				"color": "0x22222",
        "memoryCapacity": 50
			},
			{
				"id": "robot2",
				"placement": {
					"row": 9,
					"col": 5
				},
				"color": "0x22222",
        "memoryCapacity": 50
			}
		],
		"walls": [{
				"id": "w1",
				"placement": {
					"row": 2,
					"col": 2
				}
			},
			{
				"id": "w2",
				"placement": {
					"row": 1,
					"col": 5
				}
			},
			{
				"id": "w3",
				"placement": {
					"row": 6,
					"col": 4
				}
			},
			{
				"id": "w4",
				"placement": {
					"row": 5,
					"col": 2
				}
			},
			{
				"id": "w5",
				"placement": {
					"row": 5,
					"col": 3
				}
			}
		],
		"coins": [{
				"id": 1,
				"placement": {
					"row": 1,
					"col": 9
				}
			},
			{
				"id": 2,
				"placement": {
					"row": 2,
					"col": 9
				}
			},
			{
				"id": 3,
				"placement": {
					"row": 3,
					"col": 9
				}
			},
			{
				"id": 4,
				"placement": {
					"row": 1,
					"col": 8
				}
			},
			{
				"id": 5,
				"placement": {
					"row": 2,
					"col": 8
				}
			},
			{
				"id": 6,
				"placement": {
					"row": 3,
					"col": 8
				}
			}
		],
		"grid": {
			"numberOfRows": 100,
			"numberOfCols": 100,
			"cellSpacing": 3,
			"cellProperties": {
				"width": 20,
				"height": 20
			},
			"cellColor": "0x00ee22"

		},
		"programs": {
			"robot1": [
                 "move","move","turn","turn","pick","turn",
                 "move","pick","turn","turn","move","turn",
                 "move","pick","turn","turn","pick","turn",
                 "pick","move","turn","turn","move","turn",
                 "move","move","turn","turn","move","turn",
                 "move","move","pick","turn","pick","turn",
                 "drop","move","drop","turn","move","turn",
                 "move","move","turn","turn","move","pick",
                 "move","move","turn","turn","move","turn",
                 "move","pick","turn","turn","move","turn",
                 "move","move","drop","turn","move","turn",
                 "drop","move","turn","turn","move","turn"
                ],
			"robot2": [
                 "drop","turn","turn","move","pick","move","turn","turn","turn" ,
                 "move","turn","turn","move","move","move","turn","turn","turn" ,
                 "pick","turn","turn","move","drop","move","turn","turn","turn" ,
                 "move","turn","turn","drop","move","move","turn","turn","turn" ,
                 "move","turn","turn","move","move","move","turn","turn","turn" ,
                 "move","turn","drop","move","move","drop","turn","turn","turn" ,
                 "pick","turn","turn","move","pick","move","turn","turn","turn" ,
                 "move","turn","turn","move","drop","move","turn","turn","turn" ,
                 "move","turn","turn","move","move","pick","turn","turn","turn" 
      
                ]
		}
	}
}
