state={
	id=890
	name="STATE_890"
	manpower = 710035
	state_category = pastoral
	
	resources = {
		rubber=3.000
	}
	
	history={
		owner = WAI
		buildings = {
			infrastructure = 1

		}
		add_core_of = WAI

	}
	
	provinces={
		1181 4201 4941 7161 10766 12783 13176
	}
	
	buildings_max_level_factor=1.000
	local_supplies=0.000
}
