
state={
	id=556
	name="STATE_556"
	manpower = 1662391
	state_category=rural

	history={
		owner = TRM
		add_core_of = TRM
		victory_points = {
			4927 1 
		}
		buildings = {
			infrastructure = 2

		}

	}

	provinces={
		4927 5045 8116 12794 
	}
	buildings_max_level_factor=1.000
	
	local_supplies=2.000
}
