state={
	id=769
	name="STATE_769" # Burundi
	
	state_category = pastoral

	history={
		owner = WAI
		add_core_of = WAI
		victory_points = {
			2220 1
		}
		buildings = {
			infrastructure = 1

		}
	}

	provinces={
		2220
	}
	manpower=2145731
	buildings_max_level_factor=1.000

	local_supplies=0.0 
}
