state = {
	id = 886
	name = "STATE_886"
	manpower = 661102
	state_category = pastoral
	history = {
		owner = WAI
		add_core_of = WAI
		buildings = {
			infrastructure = 1
		}
	}
	provinces = {
		1914 4918 10743 10784 12862 12887 
	}
	
	buildings_max_level_factor = 1.000
	local_supplies = 0.000
}
