state={
	id=910
	name="STATE_910"

	history={
		owner = TRM
		add_core_of = TRM
		victory_points = {
			13212 1
		}
		buildings = {
			infrastructure = 2
			13212 = {
				naval_base = 1

			}

		}

	}

	provinces={
		13212 
	}
	manpower=1101346
	buildings_max_level_factor=1.000
	state_category=pastoral

	local_supplies=0.0 
}
