state={
	id=274
	name="STATE_274"

	history={
		owner = WAI
		add_core_of = WAI
		victory_points = {
			10862 1 
		}
		buildings = {
			infrastructure = 2
			10862 = {
				naval_base = 2

			}

		}

	}

	provinces={
		10862 12742 12785 13136
	}
	manpower=3163600
	buildings_max_level_factor=1.000
	state_category=rural

	local_supplies=0.0 
}
