
state={
	id=558
	name="STATE_558"
	resources={
		rubber=2.000
	}

	history={
		owner = WAI
		add_core_of = WAI
		buildings = {
			infrastructure = 2
			arms_factory = 0
			industrial_complex = 1
			2050 = {
				naval_base = 3

			}

		}
		victory_points = {
			2050 1 
		}

	}

	provinces={
		2050 4952 12731 12817 12900 
	}
	manpower=19757000
	buildings_max_level_factor=1.000
	state_category=rural
	local_supplies=0.000
}
