state={
	id=898
	name="STATE_898"
	manpower = 498718
	state_category = wasteland

	history={
		owner = TRM
		add_core_of = TRM
		
		buildings = {
			infrastructure = 2

		}

	}

	provinces={
		2044 5101 7930 7954 10788 
	}
	
	buildings_max_level_factor=1.000
	local_supplies=0.000
}
