state=
{
	id=116
	name="STATE_116"
	manpower = 241621
	state_category = small_island
	history= {
		owner = USN
		add_core_of = USN
		victory_points = {
			12003 5 
		}
		buildings = {
			infrastructure = 2
			air_base = 3
			12003 = {
				naval_base = 3
				coastal_bunker = 1
			}
		}
	}
	provinces= { 12003 }

	local_supplies=0.0 
}
