EESchema Schematic File Version 4
EELAYER 30 0
EELAYER END
$Descr A4 11693 8268
encoding utf-8
Sheet 2 3
Title "Modular Drums"
Date "2023-01-03"
Rev "2"
Comp "(c) 2022-2023 Andreas Messer"
Comment1 ""
Comment2 ""
Comment3 ""
Comment4 ""
$EndDescr
$Comp
L Device:R R201
U 1 1 635992EF
P 1900 2400
F 0 "R201" H 1830 2354 50  0000 R CNN
F 1 "27k" H 1830 2445 50  0000 R CNN
F 2 "Resistors_SMD:R_0603_HandSoldering" V 1830 2400 50  0001 C CNN
F 3 "~" H 1900 2400 50  0001 C CNN
	1    1900 2400
	1    0    0    1   
$EndComp
$Comp
L Device:R_POT RV201
U 1 1 63599F81
P 1900 2750
F 0 "RV201" H 1830 2704 50  0000 R CNN
F 1 "25k" H 1830 2795 50  0000 R CNN
F 2 "Potentiometer:Potentiometer_Alpha_RD901F-40-xxx-xxx-00D" H 1900 2750 50  0001 C CNN
F 3 "~" H 1900 2750 50  0001 C CNN
	1    1900 2750
	1    0    0    1   
$EndComp
$Comp
L Device:R R202
U 1 1 6359B2E2
P 1900 3100
F 0 "R202" H 1970 3146 50  0000 L CNN
F 1 "10k" H 1970 3055 50  0000 L CNN
F 2 "Resistors_SMD:R_0603_HandSoldering" V 1830 3100 50  0001 C CNN
F 3 "~" H 1900 3100 50  0001 C CNN
	1    1900 3100
	-1   0    0    -1  
$EndComp
Wire Wire Line
	1900 2550 1900 2600
Wire Wire Line
	1900 2900 1900 2950
$Comp
L Device:C C201
U 1 1 6359B9DD
P 2300 3050
F 0 "C201" H 2415 3096 50  0000 L CNN
F 1 "1nF" H 2415 3005 50  0000 L CNN
F 2 "Capacitors_SMD:C_0603_HandSoldering" H 2338 2900 50  0001 C CNN
F 3 "~" H 2300 3050 50  0001 C CNN
	1    2300 3050
	1    0    0    -1  
$EndComp
$Comp
L power:GND #PWR0202
U 1 1 6359CCC2
P 1900 3300
F 0 "#PWR0202" H 1900 3050 50  0001 C CNN
F 1 "GND" H 1905 3127 50  0001 C CNN
F 2 "" H 1900 3300 50  0001 C CNN
F 3 "" H 1900 3300 50  0001 C CNN
	1    1900 3300
	1    0    0    -1  
$EndComp
Wire Wire Line
	1900 3250 1900 3300
$Comp
L power:GND #PWR0218
U 1 1 6359F5B5
P 2300 3300
F 0 "#PWR0218" H 2300 3050 50  0001 C CNN
F 1 "GND" H 2305 3127 50  0001 C CNN
F 2 "" H 2300 3300 50  0001 C CNN
F 3 "" H 2300 3300 50  0001 C CNN
	1    2300 3300
	1    0    0    -1  
$EndComp
Wire Wire Line
	2300 3200 2300 3300
Wire Wire Line
	2300 2900 2300 2750
$Comp
L power:GND #PWR0227
U 1 1 635A3880
P 2950 3400
F 0 "#PWR0227" H 2950 3150 50  0001 C CNN
F 1 "GND" H 2955 3227 50  0001 C CNN
F 2 "" H 2950 3400 50  0001 C CNN
F 3 "" H 2950 3400 50  0001 C CNN
	1    2950 3400
	1    0    0    -1  
$EndComp
$Comp
L power:+12V #PWR0201
U 1 1 635A5C59
P 1900 2200
F 0 "#PWR0201" H 1900 2050 50  0001 C CNN
F 1 "+12V" H 1915 2373 50  0000 C CNN
F 2 "" H 1900 2200 50  0001 C CNN
F 3 "" H 1900 2200 50  0001 C CNN
	1    1900 2200
	1    0    0    -1  
$EndComp
Wire Wire Line
	1900 2200 1900 2250
$Comp
L Device:R R218
U 1 1 635AB476
P 2950 1750
F 0 "R218" H 3020 1796 50  0000 L CNN
F 1 "470R" H 3020 1705 50  0000 L CNN
F 2 "Resistors_SMD:R_0603_HandSoldering" V 2880 1750 50  0001 C CNN
F 3 "~" H 2950 1750 50  0001 C CNN
	1    2950 1750
	-1   0    0    -1  
$EndComp
$Comp
L power:+12V #PWR0226
U 1 1 635AF8C0
P 2950 1550
F 0 "#PWR0226" H 2950 1400 50  0001 C CNN
F 1 "+12V" H 2965 1723 50  0000 C CNN
F 2 "" H 2950 1550 50  0001 C CNN
F 3 "" H 2950 1550 50  0001 C CNN
	1    2950 1550
	1    0    0    -1  
$EndComp
$Comp
L Device:R R204
U 1 1 635C1128
P 2200 2100
F 0 "R204" H 2270 2146 50  0000 L CNN
F 1 "220k" H 2270 2055 50  0000 L CNN
F 2 "Resistors_SMD:R_0603_HandSoldering" V 2130 2100 50  0001 C CNN
F 3 "~" H 2200 2100 50  0001 C CNN
	1    2200 2100
	1    0    0    -1  
$EndComp
$Comp
L power:GND #PWR0211
U 1 1 635C2A0C
P 2200 2300
F 0 "#PWR0211" H 2200 2050 50  0001 C CNN
F 1 "GND" H 2205 2127 50  0001 C CNN
F 2 "" H 2200 2300 50  0001 C CNN
F 3 "" H 2200 2300 50  0001 C CNN
	1    2200 2300
	1    0    0    -1  
$EndComp
Wire Wire Line
	2200 2250 2200 2300
Wire Wire Line
	2950 1950 2950 2000
$Comp
L Device:R R211
U 1 1 635AA3DD
P 2400 1700
F 0 "R211" V 2193 1700 50  0000 C CNN
F 1 "100k" V 2284 1700 50  0000 C CNN
F 2 "Resistors_SMD:R_0603_HandSoldering" V 2330 1700 50  0001 C CNN
F 3 "~" H 2400 1700 50  0001 C CNN
	1    2400 1700
	0    -1   1    0   
$EndComp
Wire Wire Line
	2950 1900 2950 1950
Connection ~ 2950 1950
Wire Wire Line
	2050 2750 2300 2750
$Comp
L Device:C C202
U 1 1 6364864D
P 2600 2400
F 0 "C202" H 2715 2446 50  0000 L CNN
F 1 "1nF" H 2715 2355 50  0000 L CNN
F 2 "Capacitors_SMD:C_0603_HandSoldering" H 2638 2250 50  0001 C CNN
F 3 "~" H 2600 2400 50  0001 C CNN
	1    2600 2400
	1    0    0    -1  
$EndComp
$Comp
L power:GND #PWR0219
U 1 1 636489DB
P 2600 2600
F 0 "#PWR0219" H 2600 2350 50  0001 C CNN
F 1 "GND" H 2605 2427 50  0001 C CNN
F 2 "" H 2600 2600 50  0001 C CNN
F 3 "" H 2600 2600 50  0001 C CNN
	1    2600 2600
	1    0    0    -1  
$EndComp
Wire Wire Line
	2600 2250 2600 2200
Wire Wire Line
	2600 2550 2600 2600
Wire Wire Line
	3300 2950 3300 3000
Wire Wire Line
	2950 2400 2950 3000
Wire Wire Line
	3300 1950 2950 1950
Wire Wire Line
	3300 1950 3300 2550
$Comp
L Device:R R219
U 1 1 6359FB58
P 2950 3200
F 0 "R219" H 3020 3246 50  0000 L CNN
F 1 "100k" H 3020 3155 50  0000 L CNN
F 2 "Resistors_SMD:R_0603_HandSoldering" V 2880 3200 50  0001 C CNN
F 3 "~" H 2950 3200 50  0001 C CNN
	1    2950 3200
	1    0    0    -1  
$EndComp
Wire Wire Line
	2950 3350 2950 3400
Wire Wire Line
	2950 3000 3300 3000
Connection ~ 3300 3000
Wire Wire Line
	3300 3000 3300 3050
Wire Wire Line
	2950 1550 2950 1600
Text Label 2200 1700 3    30   ~ 0
CV_ACCENT
$Comp
L MCU_Microchip_ATmega:ATmega8L-8PU U201
U 1 1 6367FA73
P 5250 3400
F 0 "U201" H 4800 4750 50  0000 C CNN
F 1 "ATmega8L-8PU" H 5250 3400 50  0000 C CNN
F 2 "Housings_DIP:DIP-28_W7.62mm_Socket_LongPads" H 5250 3400 50  0001 C CIN
F 3 "http://ww1.microchip.com/downloads/en/DeviceDoc/atmel-2486-8-bit-avr-microcontroller-atmega8_l_datasheet.pdf" H 5250 3400 50  0001 C CNN
	1    5250 3400
	1    0    0    -1  
$EndComp
$Comp
L power:GND #PWR0232
U 1 1 63680885
P 5250 4850
F 0 "#PWR0232" H 5250 4600 50  0001 C CNN
F 1 "GND" H 5255 4677 50  0001 C CNN
F 2 "" H 5250 4850 50  0001 C CNN
F 3 "" H 5250 4850 50  0001 C CNN
	1    5250 4850
	1    0    0    -1  
$EndComp
Wire Wire Line
	5250 4800 5250 4850
$Comp
L power:GND #PWR0233
U 1 1 636813EC
P 5350 4850
F 0 "#PWR0233" H 5350 4600 50  0001 C CNN
F 1 "GND" H 5355 4677 50  0001 C CNN
F 2 "" H 5350 4850 50  0001 C CNN
F 3 "" H 5350 4850 50  0001 C CNN
	1    5350 4850
	1    0    0    -1  
$EndComp
Wire Wire Line
	5350 4800 5350 4850
Wire Wire Line
	3300 3000 3450 3000
$Comp
L Device:C C210
U 1 1 6369008C
P 4250 1750
F 0 "C210" V 4502 1750 50  0000 C CNN
F 1 "100nF" V 4411 1750 50  0000 C CNN
F 2 "Capacitors_SMD:C_0603_HandSoldering" H 4288 1600 50  0001 C CNN
F 3 "~" H 4250 1750 50  0001 C CNN
	1    4250 1750
	1    0    0    1   
$EndComp
$Comp
L power:GND #PWR0230
U 1 1 63693280
P 4250 1950
F 0 "#PWR0230" H 4250 1700 50  0001 C CNN
F 1 "GND" H 4255 1777 50  0001 C CNN
F 2 "" H 4250 1950 50  0001 C CNN
F 3 "" H 4250 1950 50  0001 C CNN
	1    4250 1950
	1    0    0    -1  
$EndComp
$Comp
L power:+5V #PWR0229
U 1 1 63694BB1
P 4250 1500
F 0 "#PWR0229" H 4250 1350 50  0001 C CNN
F 1 "+5V" H 4265 1673 50  0000 C CNN
F 2 "" H 4250 1500 50  0001 C CNN
F 3 "" H 4250 1500 50  0001 C CNN
	1    4250 1500
	1    0    0    -1  
$EndComp
$Comp
L Device:R R220
U 1 1 6369E2D3
P 4600 1900
F 0 "R220" H 4530 1854 50  0000 R CNN
F 1 "27k" H 4530 1945 50  0000 R CNN
F 2 "Resistors_SMD:R_0603_HandSoldering" V 4530 1900 50  0001 C CNN
F 3 "~" H 4600 1900 50  0001 C CNN
	1    4600 1900
	-1   0    0    1   
$EndComp
$Comp
L Device:C C211
U 1 1 636AEDEB
P 4600 3550
F 0 "C211" H 4486 3504 50  0000 R CNN
F 1 "100nF" H 4486 3595 50  0000 R CNN
F 2 "Capacitors_SMD:C_0603_HandSoldering" H 4638 3400 50  0001 C CNN
F 3 "~" H 4600 3550 50  0001 C CNN
	1    4600 3550
	1    0    0    1   
$EndComp
Wire Wire Line
	4650 2900 4600 2900
Wire Wire Line
	4600 2900 4600 3400
$Comp
L power:GND #PWR0231
U 1 1 636B02ED
P 4600 3750
F 0 "#PWR0231" H 4600 3500 50  0001 C CNN
F 1 "GND" H 4605 3577 50  0001 C CNN
F 2 "" H 4600 3750 50  0001 C CNN
F 3 "" H 4600 3750 50  0001 C CNN
	1    4600 3750
	1    0    0    -1  
$EndComp
Wire Wire Line
	4600 3700 4600 3750
$Comp
L Device:R R212
U 1 1 636B7C75
P 2450 3850
F 0 "R212" V 2250 3800 50  0000 L CNN
F 1 "100k" V 2350 3850 50  0000 C CNN
F 2 "Resistors_SMD:R_0603_HandSoldering" V 2380 3850 50  0001 C CNN
F 3 "~" H 2450 3850 50  0001 C CNN
	1    2450 3850
	0    -1   1    0   
$EndComp
$Comp
L Device:R R205
U 1 1 636C86E4
P 2250 4050
F 0 "R205" H 2000 4100 50  0000 L CNN
F 1 "220k" H 2100 4000 50  0000 C CNN
F 2 "Resistors_SMD:R_0603_HandSoldering" V 2180 4050 50  0001 C CNN
F 3 "~" H 2250 4050 50  0001 C CNN
	1    2250 4050
	-1   0    0    -1  
$EndComp
Wire Wire Line
	2300 3850 2250 3850
Wire Wire Line
	2250 3850 2250 3900
$Comp
L power:GND #PWR0212
U 1 1 636FB71E
P 2250 4250
F 0 "#PWR0212" H 2250 4000 50  0001 C CNN
F 1 "GND" H 2255 4077 50  0001 C CNN
F 2 "" H 2250 4250 50  0001 C CNN
F 3 "" H 2250 4250 50  0001 C CNN
	1    2250 4250
	-1   0    0    -1  
$EndComp
Wire Wire Line
	2250 4200 2250 4250
$Comp
L Connector:AudioJack2_SwitchT J202
U 1 1 636FDE19
P 1850 3850
F 0 "J202" H 1670 3783 50  0000 R CNN
F 1 "TRIG_CB" H 1670 3874 50  0000 R CNN
F 2 "Connectors:Cliff_FC681374V" H 1850 3850 50  0001 C CNN
F 3 "~" H 1850 3850 50  0001 C CNN
	1    1850 3850
	1    0    0    1   
$EndComp
Wire Wire Line
	2250 3850 2050 3850
Connection ~ 2250 3850
Wire Wire Line
	2100 4000 2100 3950
Wire Wire Line
	2100 3950 2050 3950
NoConn ~ 2050 3750
$Comp
L Device:R R213
U 1 1 6370842F
P 2450 4400
F 0 "R213" V 2250 4350 50  0000 L CNN
F 1 "100k" V 2350 4400 50  0000 C CNN
F 2 "Resistors_SMD:R_0603_HandSoldering" V 2380 4400 50  0001 C CNN
F 3 "~" H 2450 4400 50  0001 C CNN
	1    2450 4400
	0    -1   1    0   
$EndComp
$Comp
L Device:R R206
U 1 1 63708435
P 2250 4600
F 0 "R206" H 2000 4650 50  0000 L CNN
F 1 "220k" H 2100 4550 50  0000 C CNN
F 2 "Resistors_SMD:R_0603_HandSoldering" V 2180 4600 50  0001 C CNN
F 3 "~" H 2250 4600 50  0001 C CNN
	1    2250 4600
	-1   0    0    -1  
$EndComp
Wire Wire Line
	2300 4400 2250 4400
Wire Wire Line
	2250 4400 2250 4450
$Comp
L power:GND #PWR0213
U 1 1 6370843D
P 2250 4800
F 0 "#PWR0213" H 2250 4550 50  0001 C CNN
F 1 "GND" H 2255 4627 50  0001 C CNN
F 2 "" H 2250 4800 50  0001 C CNN
F 3 "" H 2250 4800 50  0001 C CNN
	1    2250 4800
	-1   0    0    -1  
$EndComp
Wire Wire Line
	2250 4750 2250 4800
$Comp
L Connector:AudioJack2_SwitchT J203
U 1 1 63708444
P 1850 4400
F 0 "J203" H 1670 4333 50  0000 R CNN
F 1 "TRIG_BD" H 1670 4424 50  0000 R CNN
F 2 "Connectors:Cliff_FC681374V" H 1850 4400 50  0001 C CNN
F 3 "~" H 1850 4400 50  0001 C CNN
	1    1850 4400
	1    0    0    1   
$EndComp
Wire Wire Line
	2250 4400 2050 4400
Connection ~ 2250 4400
$Comp
L power:GND #PWR0206
U 1 1 6370844C
P 2100 4550
F 0 "#PWR0206" H 2100 4300 50  0001 C CNN
F 1 "GND" H 2105 4377 50  0001 C CNN
F 2 "" H 2100 4550 50  0001 C CNN
F 3 "" H 2100 4550 50  0001 C CNN
	1    2100 4550
	-1   0    0    -1  
$EndComp
Wire Wire Line
	2100 4550 2100 4500
Wire Wire Line
	2100 4500 2050 4500
NoConn ~ 2050 4300
NoConn ~ 2050 4850
Wire Wire Line
	2100 5050 2050 5050
Wire Wire Line
	2100 5100 2100 5050
$Comp
L power:GND #PWR0207
U 1 1 63709A79
P 2100 5100
F 0 "#PWR0207" H 2100 4850 50  0001 C CNN
F 1 "GND" H 2105 4927 50  0001 C CNN
F 2 "" H 2100 5100 50  0001 C CNN
F 3 "" H 2100 5100 50  0001 C CNN
	1    2100 5100
	-1   0    0    -1  
$EndComp
Connection ~ 2250 4950
Wire Wire Line
	2250 4950 2050 4950
$Comp
L Connector:AudioJack2_SwitchT J204
U 1 1 63709A71
P 1850 4950
F 0 "J204" H 1670 4883 50  0000 R CNN
F 1 "TRIG_SNARE" H 1670 4974 50  0000 R CNN
F 2 "Connectors:Cliff_FC681374V" H 1850 4950 50  0001 C CNN
F 3 "~" H 1850 4950 50  0001 C CNN
	1    1850 4950
	1    0    0    1   
$EndComp
Wire Wire Line
	2250 5300 2250 5350
$Comp
L power:GND #PWR0214
U 1 1 63709A6A
P 2250 5350
F 0 "#PWR0214" H 2250 5100 50  0001 C CNN
F 1 "GND" H 2255 5177 50  0001 C CNN
F 2 "" H 2250 5350 50  0001 C CNN
F 3 "" H 2250 5350 50  0001 C CNN
	1    2250 5350
	-1   0    0    -1  
$EndComp
Wire Wire Line
	2250 4950 2250 5000
Wire Wire Line
	2300 4950 2250 4950
$Comp
L Device:R R207
U 1 1 63709A62
P 2250 5150
F 0 "R207" H 2000 5200 50  0000 L CNN
F 1 "220k" H 2100 5100 50  0000 C CNN
F 2 "Resistors_SMD:R_0603_HandSoldering" V 2180 5150 50  0001 C CNN
F 3 "~" H 2250 5150 50  0001 C CNN
	1    2250 5150
	-1   0    0    -1  
$EndComp
$Comp
L Device:R R214
U 1 1 63709A5C
P 2450 4950
F 0 "R214" V 2250 4900 50  0000 L CNN
F 1 "100k" V 2350 4950 50  0000 C CNN
F 2 "Resistors_SMD:R_0603_HandSoldering" V 2380 4950 50  0001 C CNN
F 3 "~" H 2450 4950 50  0001 C CNN
	1    2450 4950
	0    -1   1    0   
$EndComp
$Comp
L Device:R R215
U 1 1 63713E38
P 2450 5500
F 0 "R215" V 2250 5450 50  0000 L CNN
F 1 "100k" V 2350 5500 50  0000 C CNN
F 2 "Resistors_SMD:R_0603_HandSoldering" V 2380 5500 50  0001 C CNN
F 3 "~" H 2450 5500 50  0001 C CNN
	1    2450 5500
	0    -1   1    0   
$EndComp
$Comp
L Device:R R208
U 1 1 63713E3E
P 2250 5700
F 0 "R208" H 2000 5750 50  0000 L CNN
F 1 "220k" H 2100 5650 50  0000 C CNN
F 2 "Resistors_SMD:R_0603_HandSoldering" V 2180 5700 50  0001 C CNN
F 3 "~" H 2250 5700 50  0001 C CNN
	1    2250 5700
	-1   0    0    -1  
$EndComp
Wire Wire Line
	2300 5500 2250 5500
Wire Wire Line
	2250 5500 2250 5550
$Comp
L power:GND #PWR0215
U 1 1 63713E46
P 2250 5900
F 0 "#PWR0215" H 2250 5650 50  0001 C CNN
F 1 "GND" H 2255 5727 50  0001 C CNN
F 2 "" H 2250 5900 50  0001 C CNN
F 3 "" H 2250 5900 50  0001 C CNN
	1    2250 5900
	-1   0    0    -1  
$EndComp
Wire Wire Line
	2250 5850 2250 5900
$Comp
L Connector:AudioJack2_SwitchT J205
U 1 1 63713E4D
P 1850 5500
F 0 "J205" H 1670 5433 50  0000 R CNN
F 1 "TRIG_NOISE" H 1670 5524 50  0000 R CNN
F 2 "Connectors:Cliff_FC681374V" H 1850 5500 50  0001 C CNN
F 3 "~" H 1850 5500 50  0001 C CNN
	1    1850 5500
	1    0    0    1   
$EndComp
Wire Wire Line
	2250 5500 2050 5500
Connection ~ 2250 5500
$Comp
L power:GND #PWR0208
U 1 1 63713E55
P 2100 5650
F 0 "#PWR0208" H 2100 5400 50  0001 C CNN
F 1 "GND" H 2105 5477 50  0001 C CNN
F 2 "" H 2100 5650 50  0001 C CNN
F 3 "" H 2100 5650 50  0001 C CNN
	1    2100 5650
	-1   0    0    -1  
$EndComp
Wire Wire Line
	2100 5650 2100 5600
Wire Wire Line
	2100 5600 2050 5600
NoConn ~ 2050 5400
$Comp
L Device:R R216
U 1 1 63716225
P 2450 6050
F 0 "R216" V 2250 6000 50  0000 L CNN
F 1 "100k" V 2350 6050 50  0000 C CNN
F 2 "Resistors_SMD:R_0603_HandSoldering" V 2380 6050 50  0001 C CNN
F 3 "~" H 2450 6050 50  0001 C CNN
	1    2450 6050
	0    -1   1    0   
$EndComp
$Comp
L Device:R R209
U 1 1 6371622B
P 2250 6250
F 0 "R209" H 2000 6300 50  0000 L CNN
F 1 "220k" H 2100 6200 50  0000 C CNN
F 2 "Resistors_SMD:R_0603_HandSoldering" V 2180 6250 50  0001 C CNN
F 3 "~" H 2250 6250 50  0001 C CNN
	1    2250 6250
	-1   0    0    -1  
$EndComp
Wire Wire Line
	2300 6050 2250 6050
Wire Wire Line
	2250 6050 2250 6100
$Comp
L power:GND #PWR0216
U 1 1 63716233
P 2250 6450
F 0 "#PWR0216" H 2250 6200 50  0001 C CNN
F 1 "GND" H 2255 6277 50  0001 C CNN
F 2 "" H 2250 6450 50  0001 C CNN
F 3 "" H 2250 6450 50  0001 C CNN
	1    2250 6450
	-1   0    0    -1  
$EndComp
Wire Wire Line
	2250 6400 2250 6450
$Comp
L Connector:AudioJack2_SwitchT J206
U 1 1 6371623A
P 1850 6050
F 0 "J206" H 1670 5983 50  0000 R CNN
F 1 "TRIG_CLAP" H 1670 6074 50  0000 R CNN
F 2 "Connectors:Cliff_FC681374V" H 1850 6050 50  0001 C CNN
F 3 "~" H 1850 6050 50  0001 C CNN
	1    1850 6050
	1    0    0    1   
$EndComp
Wire Wire Line
	2250 6050 2050 6050
Connection ~ 2250 6050
$Comp
L power:GND #PWR0209
U 1 1 63716242
P 2100 6200
F 0 "#PWR0209" H 2100 5950 50  0001 C CNN
F 1 "GND" H 2105 6027 50  0001 C CNN
F 2 "" H 2100 6200 50  0001 C CNN
F 3 "" H 2100 6200 50  0001 C CNN
	1    2100 6200
	-1   0    0    -1  
$EndComp
Wire Wire Line
	2100 6200 2100 6150
Wire Wire Line
	2100 6150 2050 6150
NoConn ~ 2050 5950
$Comp
L Device:R R217
U 1 1 63718760
P 2450 6600
F 0 "R217" V 2250 6550 50  0000 L CNN
F 1 "100k" V 2350 6600 50  0000 C CNN
F 2 "Resistors_SMD:R_0603_HandSoldering" V 2380 6600 50  0001 C CNN
F 3 "~" H 2450 6600 50  0001 C CNN
	1    2450 6600
	0    -1   1    0   
$EndComp
$Comp
L Device:R R210
U 1 1 63718766
P 2250 6800
F 0 "R210" H 2000 6850 50  0000 L CNN
F 1 "220k" H 2100 6750 50  0000 C CNN
F 2 "Resistors_SMD:R_0603_HandSoldering" V 2180 6800 50  0001 C CNN
F 3 "~" H 2250 6800 50  0001 C CNN
	1    2250 6800
	-1   0    0    -1  
$EndComp
Wire Wire Line
	2300 6600 2250 6600
Wire Wire Line
	2250 6600 2250 6650
$Comp
L power:GND #PWR0217
U 1 1 6371876E
P 2250 7000
F 0 "#PWR0217" H 2250 6750 50  0001 C CNN
F 1 "GND" H 2255 6827 50  0001 C CNN
F 2 "" H 2250 7000 50  0001 C CNN
F 3 "" H 2250 7000 50  0001 C CNN
	1    2250 7000
	-1   0    0    -1  
$EndComp
Wire Wire Line
	2250 6950 2250 7000
$Comp
L Connector:AudioJack2_SwitchT J207
U 1 1 63718775
P 1850 6600
F 0 "J207" H 1670 6533 50  0000 R CNN
F 1 "TRIG_MC" H 1670 6624 50  0000 R CNN
F 2 "Connectors:Cliff_FC681374V" H 1850 6600 50  0001 C CNN
F 3 "~" H 1850 6600 50  0001 C CNN
	1    1850 6600
	1    0    0    1   
$EndComp
Wire Wire Line
	2250 6600 2050 6600
Connection ~ 2250 6600
$Comp
L power:GND #PWR0210
U 1 1 6371877D
P 2100 6750
F 0 "#PWR0210" H 2100 6500 50  0001 C CNN
F 1 "GND" H 2105 6577 50  0001 C CNN
F 2 "" H 2100 6750 50  0001 C CNN
F 3 "" H 2100 6750 50  0001 C CNN
	1    2100 6750
	-1   0    0    -1  
$EndComp
Wire Wire Line
	2100 6750 2100 6700
Wire Wire Line
	2100 6700 2050 6700
NoConn ~ 2050 6500
$Comp
L power:GND #PWR0205
U 1 1 6371AABA
P 2100 4000
F 0 "#PWR0205" H 2100 3750 50  0001 C CNN
F 1 "GND" H 2105 3827 50  0001 C CNN
F 2 "" H 2100 4000 50  0001 C CNN
F 3 "" H 2100 4000 50  0001 C CNN
	1    2100 4000
	-1   0    0    -1  
$EndComp
$Comp
L Connector:AudioJack2_SwitchT J201
U 1 1 63745DD9
P 1850 1700
F 0 "J201" H 1670 1633 50  0000 R CNN
F 1 "ACCENT" H 1670 1724 50  0000 R CNN
F 2 "Connectors:Cliff_FC681374V" H 1850 1700 50  0001 C CNN
F 3 "~" H 1850 1700 50  0001 C CNN
	1    1850 1700
	1    0    0    1   
$EndComp
$Comp
L power:GND #PWR0204
U 1 1 6374E11D
P 2100 1850
F 0 "#PWR0204" H 2100 1600 50  0001 C CNN
F 1 "GND" H 2105 1677 50  0001 C CNN
F 2 "" H 2100 1850 50  0001 C CNN
F 3 "" H 2100 1850 50  0001 C CNN
	1    2100 1850
	1    0    0    -1  
$EndComp
Wire Wire Line
	2050 1800 2100 1800
Wire Wire Line
	2100 1800 2100 1850
$Comp
L power:+5V #PWR0203
U 1 1 6375D0BA
P 2100 1200
F 0 "#PWR0203" H 2100 1050 50  0001 C CNN
F 1 "+5V" H 2115 1373 50  0000 C CNN
F 2 "" H 2100 1200 50  0001 C CNN
F 3 "" H 2100 1200 50  0001 C CNN
	1    2100 1200
	1    0    0    -1  
$EndComp
Wire Wire Line
	2050 1600 2100 1600
$Comp
L Device:C C209
U 1 1 635AD818
P 3300 3200
F 0 "C209" H 3415 3246 50  0000 L CNN
F 1 "1nF" H 3415 3155 50  0000 L CNN
F 2 "Capacitors_SMD:C_0603_HandSoldering" H 3338 3050 50  0001 C CNN
F 3 "~" H 3300 3200 50  0001 C CNN
	1    3300 3200
	1    0    0    -1  
$EndComp
Wire Wire Line
	2950 3050 2950 3000
Connection ~ 2950 3000
$Comp
L power:GND #PWR0228
U 1 1 635B60B4
P 3300 3400
F 0 "#PWR0228" H 3300 3150 50  0001 C CNN
F 1 "GND" H 3305 3227 50  0001 C CNN
F 2 "" H 3300 3400 50  0001 C CNN
F 3 "" H 3300 3400 50  0001 C CNN
	1    3300 3400
	1    0    0    -1  
$EndComp
Wire Wire Line
	3300 3350 3300 3400
Text Label 6000 5450 1    50   ~ 0
MIDI_RX
Wire Wire Line
	5850 3900 8500 3900
Wire Wire Line
	8500 4000 5850 4000
Wire Wire Line
	5850 4100 8500 4100
Wire Wire Line
	8500 4200 5850 4200
Wire Wire Line
	5850 4300 8500 4300
Wire Wire Line
	8500 4400 5850 4400
Wire Wire Line
	4250 1900 4250 1950
Wire Wire Line
	4650 2300 4600 2300
Wire Wire Line
	4250 1600 4250 1550
Wire Wire Line
	4250 1500 4250 1550
Connection ~ 4250 1550
$Comp
L Device:R R222
U 1 1 637A07E2
P 8200 2600
F 0 "R222" V 7993 2600 50  0000 C CNN
F 1 "10k" V 8084 2600 50  0000 C CNN
F 2 "Resistors_SMD:R_0603_HandSoldering" V 8130 2600 50  0001 C CNN
F 3 "~" H 8200 2600 50  0001 C CNN
	1    8200 2600
	0    1    1    0   
$EndComp
$Comp
L Device:R R223
U 1 1 637A110C
P 8400 2800
F 0 "R223" H 8330 2754 50  0000 R CNN
F 1 "2.2k" H 8330 2845 50  0000 R CNN
F 2 "Resistors_SMD:R_0603_HandSoldering" V 8330 2800 50  0001 C CNN
F 3 "~" H 8400 2800 50  0001 C CNN
	1    8400 2800
	-1   0    0    1   
$EndComp
Wire Wire Line
	8350 2600 8400 2600
Wire Wire Line
	8400 2600 8400 2650
$Comp
L power:GND #PWR0239
U 1 1 637A784D
P 8400 3000
F 0 "#PWR0239" H 8400 2750 50  0001 C CNN
F 1 "GND" H 8405 2827 50  0001 C CNN
F 2 "" H 8400 3000 50  0001 C CNN
F 3 "" H 8400 3000 50  0001 C CNN
	1    8400 3000
	1    0    0    -1  
$EndComp
Wire Wire Line
	8400 2950 8400 3000
Wire Wire Line
	8400 2600 8500 2600
Connection ~ 8400 2600
$Comp
L Device:R R221
U 1 1 637C73E9
P 7400 3200
F 0 "R221" V 7193 3200 50  0000 C CNN
F 1 "33k" V 7284 3200 50  0000 C CNN
F 2 "Resistors_SMD:R_0603_HandSoldering" V 7330 3200 50  0001 C CNN
F 3 "~" H 7400 3200 50  0001 C CNN
	1    7400 3200
	0    1    1    0   
$EndComp
Wire Wire Line
	7950 3200 7950 3250
$Comp
L power:GND #PWR0240
U 1 1 637C73F8
P 7950 3600
F 0 "#PWR0240" H 7950 3350 50  0001 C CNN
F 1 "GND" H 7955 3427 50  0001 C CNN
F 2 "" H 7950 3600 50  0001 C CNN
F 3 "" H 7950 3600 50  0001 C CNN
	1    7950 3600
	1    0    0    -1  
$EndComp
Wire Wire Line
	7950 3550 7950 3600
Wire Wire Line
	7950 3200 8500 3200
$Comp
L Device:C C213
U 1 1 637CB208
P 7600 3400
F 0 "C213" H 7500 3400 50  0000 R TNN
F 1 "47nF" H 7500 3450 50  0000 R CNN
F 2 "Capacitors_ThroughHole:C_Rect_L7.2mm_W2.5mm_P5.00mm_FKS2_FKP2_MKS2_MKP2" H 7638 3250 50  0001 C CNN
F 3 "~" H 7600 3400 50  0001 C CNN
	1    7600 3400
	1    0    0    1   
$EndComp
Wire Wire Line
	4600 1750 4600 1550
Wire Wire Line
	4250 1550 4600 1550
Connection ~ 4600 1550
$Comp
L Device:R R203
U 1 1 63764AD6
P 2100 1400
F 0 "R203" H 2170 1446 50  0000 L CNN
F 1 "470R" H 2170 1355 50  0000 L CNN
F 2 "Resistors_SMD:R_0603_HandSoldering" V 2030 1400 50  0001 C CNN
F 3 "~" H 2100 1400 50  0001 C CNN
	1    2100 1400
	1    0    0    1   
$EndComp
Wire Wire Line
	2100 1550 2100 1600
Wire Wire Line
	2100 1200 2100 1250
Wire Wire Line
	2300 2750 3000 2750
Connection ~ 2300 2750
Wire Wire Line
	2600 2200 2600 1700
Wire Wire Line
	2600 1100 6450 1100
Connection ~ 2600 2200
Wire Wire Line
	2600 2200 2650 2200
Text Label 5850 2700 0    50   ~ 0
GATE_ACCENT
Wire Wire Line
	2550 1700 2600 1700
Connection ~ 2600 1700
Wire Wire Line
	2600 1700 2600 1100
Wire Wire Line
	2200 1700 2200 1950
Connection ~ 2200 1700
Wire Wire Line
	2250 1700 2200 1700
Wire Wire Line
	2200 1700 2050 1700
$Comp
L Device:C C203
U 1 1 638C1F9F
P 2650 4050
F 0 "C203" H 2765 4096 50  0000 L CNN
F 1 "1nF" H 2765 4005 50  0000 L CNN
F 2 "Capacitors_SMD:C_0603_HandSoldering" H 2688 3900 50  0001 C CNN
F 3 "~" H 2650 4050 50  0001 C CNN
	1    2650 4050
	1    0    0    -1  
$EndComp
$Comp
L power:GND #PWR0220
U 1 1 638C2E1A
P 2650 4250
F 0 "#PWR0220" H 2650 4000 50  0001 C CNN
F 1 "GND" H 2655 4077 50  0001 C CNN
F 2 "" H 2650 4250 50  0001 C CNN
F 3 "" H 2650 4250 50  0001 C CNN
	1    2650 4250
	-1   0    0    -1  
$EndComp
Wire Wire Line
	2650 4200 2650 4250
Wire Wire Line
	2600 3850 2650 3850
Wire Wire Line
	2650 3850 2650 3900
$Comp
L Device:C C204
U 1 1 638D0D46
P 2650 4600
F 0 "C204" H 2765 4646 50  0000 L CNN
F 1 "1nF" H 2765 4555 50  0000 L CNN
F 2 "Capacitors_SMD:C_0603_HandSoldering" H 2688 4450 50  0001 C CNN
F 3 "~" H 2650 4600 50  0001 C CNN
	1    2650 4600
	1    0    0    -1  
$EndComp
$Comp
L power:GND #PWR0221
U 1 1 638D0D4C
P 2650 4800
F 0 "#PWR0221" H 2650 4550 50  0001 C CNN
F 1 "GND" H 2655 4627 50  0001 C CNN
F 2 "" H 2650 4800 50  0001 C CNN
F 3 "" H 2650 4800 50  0001 C CNN
	1    2650 4800
	-1   0    0    -1  
$EndComp
Wire Wire Line
	2650 4750 2650 4800
Wire Wire Line
	2600 4400 2650 4400
Wire Wire Line
	2650 4400 2650 4450
$Comp
L Device:C C205
U 1 1 638D5EDA
P 2650 5150
F 0 "C205" H 2765 5196 50  0000 L CNN
F 1 "1nF" H 2765 5105 50  0000 L CNN
F 2 "Capacitors_SMD:C_0603_HandSoldering" H 2688 5000 50  0001 C CNN
F 3 "~" H 2650 5150 50  0001 C CNN
	1    2650 5150
	1    0    0    -1  
$EndComp
$Comp
L power:GND #PWR0222
U 1 1 638D5EE0
P 2650 5350
F 0 "#PWR0222" H 2650 5100 50  0001 C CNN
F 1 "GND" H 2655 5177 50  0001 C CNN
F 2 "" H 2650 5350 50  0001 C CNN
F 3 "" H 2650 5350 50  0001 C CNN
	1    2650 5350
	-1   0    0    -1  
$EndComp
Wire Wire Line
	2650 5300 2650 5350
Wire Wire Line
	2600 4950 2650 4950
Wire Wire Line
	2650 4950 2650 5000
$Comp
L Device:C C206
U 1 1 638DAF33
P 2650 5700
F 0 "C206" H 2765 5746 50  0000 L CNN
F 1 "1nF" H 2765 5655 50  0000 L CNN
F 2 "Capacitors_SMD:C_0603_HandSoldering" H 2688 5550 50  0001 C CNN
F 3 "~" H 2650 5700 50  0001 C CNN
	1    2650 5700
	1    0    0    -1  
$EndComp
$Comp
L power:GND #PWR0223
U 1 1 638DAF39
P 2650 5900
F 0 "#PWR0223" H 2650 5650 50  0001 C CNN
F 1 "GND" H 2655 5727 50  0001 C CNN
F 2 "" H 2650 5900 50  0001 C CNN
F 3 "" H 2650 5900 50  0001 C CNN
	1    2650 5900
	-1   0    0    -1  
$EndComp
Wire Wire Line
	2650 5850 2650 5900
Wire Wire Line
	2600 5500 2650 5500
Wire Wire Line
	2650 5500 2650 5550
$Comp
L Device:C C207
U 1 1 638E0D26
P 2650 6250
F 0 "C207" H 2765 6296 50  0000 L CNN
F 1 "1nF" H 2765 6205 50  0000 L CNN
F 2 "Capacitors_SMD:C_0603_HandSoldering" H 2688 6100 50  0001 C CNN
F 3 "~" H 2650 6250 50  0001 C CNN
	1    2650 6250
	1    0    0    -1  
$EndComp
$Comp
L power:GND #PWR0224
U 1 1 638E0D2C
P 2650 6450
F 0 "#PWR0224" H 2650 6200 50  0001 C CNN
F 1 "GND" H 2655 6277 50  0001 C CNN
F 2 "" H 2650 6450 50  0001 C CNN
F 3 "" H 2650 6450 50  0001 C CNN
	1    2650 6450
	-1   0    0    -1  
$EndComp
Wire Wire Line
	2650 6400 2650 6450
Wire Wire Line
	2600 6050 2650 6050
Wire Wire Line
	2650 6050 2650 6100
$Comp
L Device:C C208
U 1 1 638E666A
P 2650 6800
F 0 "C208" H 2765 6846 50  0000 L CNN
F 1 "1nF" H 2765 6755 50  0000 L CNN
F 2 "Capacitors_SMD:C_0603_HandSoldering" H 2688 6650 50  0001 C CNN
F 3 "~" H 2650 6800 50  0001 C CNN
	1    2650 6800
	1    0    0    -1  
$EndComp
$Comp
L power:GND #PWR0225
U 1 1 638E6670
P 2650 7000
F 0 "#PWR0225" H 2650 6750 50  0001 C CNN
F 1 "GND" H 2655 6827 50  0001 C CNN
F 2 "" H 2650 7000 50  0001 C CNN
F 3 "" H 2650 7000 50  0001 C CNN
	1    2650 7000
	-1   0    0    -1  
$EndComp
Wire Wire Line
	2650 6950 2650 7000
Wire Wire Line
	2600 6600 2650 6600
Wire Wire Line
	2650 6600 2650 6650
Wire Wire Line
	2650 3850 3150 3850
Connection ~ 2650 3850
Wire Wire Line
	3150 4400 2650 4400
Connection ~ 2650 4400
Wire Wire Line
	2650 4950 3150 4950
Connection ~ 2650 4950
Text Label 2650 4400 0    50   ~ 0
TRIG_BD
Text Label 2650 4950 0    50   ~ 0
TRIG_SNARE
Text Label 2650 5500 0    50   ~ 0
TRIG_NOISE
Text Label 2700 6050 0    50   ~ 0
TRIG_CLAP
Text Label 2650 3850 0    50   ~ 0
TRIG_CB
Text Label 2650 6600 0    50   ~ 0
TRIG_MC
Entry Wire Line
	6300 3000 6400 3100
Entry Wire Line
	6300 3100 6400 3200
Entry Wire Line
	6300 3200 6400 3300
Entry Wire Line
	6300 3300 6400 3400
Entry Wire Line
	6300 3400 6400 3500
Entry Wire Line
	6300 3500 6400 3600
Text Label 5850 3400 0    50   ~ 0
TRIG_BD
Text Label 5850 3200 0    50   ~ 0
TRIG_CLAP
Text Label 5850 3300 0    50   ~ 0
TRIG_SNARE
Text Label 5850 3000 0    50   ~ 0
TRIG_NOISE
Text Label 5850 3500 0    50   ~ 0
TRIG_CB
Text Label 5850 3100 0    50   ~ 0
TRIG_MC
Wire Wire Line
	5850 3000 6300 3000
Wire Wire Line
	6300 3100 5850 3100
Wire Wire Line
	5850 3200 6300 3200
Wire Wire Line
	6300 3300 5850 3300
Wire Wire Line
	5850 3400 6300 3400
Wire Wire Line
	6300 3500 5850 3500
Wire Wire Line
	3150 5500 2650 5500
Connection ~ 2650 5500
Wire Wire Line
	3150 6050 2650 6050
Connection ~ 2650 6050
Wire Wire Line
	3150 6600 2650 6600
Connection ~ 2650 6600
Entry Wire Line
	3150 3850 3250 3950
Entry Wire Line
	3150 4400 3250 4500
Entry Wire Line
	3150 4950 3250 5050
Entry Wire Line
	3150 5500 3250 5600
Entry Wire Line
	3150 6050 3250 6150
Entry Wire Line
	3150 6600 3250 6700
Wire Bus Line
	3250 6750 3350 6850
Wire Bus Line
	3350 6850 6250 6850
Wire Bus Line
	6250 6850 6400 6700
$Comp
L Connector_Generic:Conn_02x08_Odd_Even J209
U 1 1 639DE78C
P 7800 5600
F 0 "J209" H 7850 4975 50  0000 C CNN
F 1 "Conn_02x08_Odd_Even" H 7850 5066 50  0000 C CNN
F 2 "Pin_Headers:Pin_Header_Straight_2x08_Pitch2.54mm" H 7800 5600 50  0001 C CNN
F 3 "~" H 7800 5600 50  0001 C CNN
	1    7800 5600
	-1   0    0    1   
$EndComp
Wire Wire Line
	7500 5800 8000 5800
Wire Wire Line
	8000 5900 7500 5900
Wire Wire Line
	7500 5700 8000 5700
Wire Wire Line
	8000 5600 7500 5600
Wire Wire Line
	7500 5500 8000 5500
Wire Wire Line
	8000 5400 7500 5400
NoConn ~ 8000 5300
NoConn ~ 7500 5300
NoConn ~ 7500 5200
NoConn ~ 8000 5200
$Comp
L power:GND #PWR0238
U 1 1 63A233A7
P 8650 5900
F 0 "#PWR0238" H 8650 5650 50  0001 C CNN
F 1 "GND" H 8655 5727 50  0001 C CNN
F 2 "" H 8650 5900 50  0001 C CNN
F 3 "" H 8650 5900 50  0001 C CNN
	1    8650 5900
	1    0    0    -1  
$EndComp
Wire Wire Line
	8000 5800 8000 5700
Connection ~ 8000 5800
Connection ~ 8000 5700
Wire Wire Line
	8000 5700 8000 5600
Connection ~ 8000 5600
$Comp
L Device:D D202
U 1 1 63A40CB1
P 8200 5500
F 0 "D202" H 8200 5717 50  0000 C CNN
F 1 "D" H 8200 5626 50  0000 C CNN
F 2 "Diodes_SMD:D_SMA_Handsoldering" H 8200 5500 50  0001 C CNN
F 3 "~" H 8200 5500 50  0001 C CNN
	1    8200 5500
	-1   0    0    1   
$EndComp
Wire Wire Line
	8000 5500 8050 5500
Connection ~ 8000 5500
$Comp
L Device:Ferrite_Bead_Small FB202
U 1 1 63A6A2E7
P 8500 5500
F 0 "FB202" V 8263 5500 50  0000 C CNN
F 1 "Ferrite_Bead_Small" V 8354 5500 50  0000 C CNN
F 2 "Resistors_SMD:R_0805_HandSoldering" V 8430 5500 50  0001 C CNN
F 3 "~" H 8500 5500 50  0001 C CNN
	1    8500 5500
	0    1    1    0   
$EndComp
$Comp
L Device:Ferrite_Bead_Small FB203
U 1 1 63A6A84E
P 8500 4900
F 0 "FB203" V 8263 4900 50  0000 C CNN
F 1 "Ferrite_Bead_Small" V 8354 4900 50  0000 C CNN
F 2 "Resistors_SMD:R_0805_HandSoldering" V 8430 4900 50  0001 C CNN
F 3 "~" H 8500 4900 50  0001 C CNN
	1    8500 4900
	0    1    1    0   
$EndComp
$Comp
L power:+12V #PWR0241
U 1 1 63AE1EAA
P 8700 5500
F 0 "#PWR0241" H 8700 5350 50  0001 C CNN
F 1 "+12V" V 8700 5700 50  0000 C CNN
F 2 "" H 8700 5500 50  0001 C CNN
F 3 "" H 8700 5500 50  0001 C CNN
	1    8700 5500
	0    1    1    0   
$EndComp
$Comp
L power:-12V #PWR0242
U 1 1 63AEC028
P 6800 5900
F 0 "#PWR0242" H 6800 6000 50  0001 C CNN
F 1 "-12V" V 6815 6028 50  0000 L CNN
F 2 "" H 6800 5900 50  0001 C CNN
F 3 "" H 6800 5900 50  0001 C CNN
	1    6800 5900
	0    -1   -1   0   
$EndComp
$Comp
L Device:Ferrite_Bead_Small FB201
U 1 1 63B2D0A9
P 7000 5900
F 0 "FB201" V 6763 5900 50  0000 C CNN
F 1 "Ferrite_Bead_Small" V 6854 5900 50  0000 C CNN
F 2 "Resistors_SMD:R_0805_HandSoldering" V 6930 5900 50  0001 C CNN
F 3 "~" H 7000 5900 50  0001 C CNN
	1    7000 5900
	0    1    1    0   
$EndComp
Connection ~ 7500 5400
$Comp
L power:+5V #PWR0234
U 1 1 63B46598
P 8700 4900
F 0 "#PWR0234" H 8700 4750 50  0001 C CNN
F 1 "+5V" V 8700 5100 50  0000 C CNN
F 2 "" H 8700 4900 50  0001 C CNN
F 3 "" H 8700 4900 50  0001 C CNN
	1    8700 4900
	0    1    1    0   
$EndComp
$Comp
L power:GND #PWR0235
U 1 1 63B6426B
P 7050 5550
F 0 "#PWR0235" H 7050 5300 50  0001 C CNN
F 1 "GND" H 7055 5377 50  0001 C CNN
F 2 "" H 7050 5550 50  0001 C CNN
F 3 "" H 7050 5550 50  0001 C CNN
	1    7050 5550
	1    0    0    -1  
$EndComp
Wire Wire Line
	7050 5500 7050 5550
$Comp
L Device:CP C212
U 1 1 63B6D56E
P 6850 5700
F 0 "C212" H 6968 5746 50  0000 L CNN
F 1 "10µF/25V" H 6968 5655 50  0000 L CNN
F 2 "Capacitors_ThroughHole:CP_Radial_D4.0mm_P1.50mm" H 6888 5550 50  0001 C CNN
F 3 "~" H 6850 5700 50  0001 C CNN
	1    6850 5700
	1    0    0    -1  
$EndComp
$Comp
L Device:R R224
U 1 1 63809132
P 7950 3400
F 0 "R224" H 7880 3354 50  0000 R CNN
F 1 "4.7k" H 7880 3445 50  0000 R CNN
F 2 "Resistors_SMD:R_0603_HandSoldering" V 7880 3400 50  0001 C CNN
F 3 "~" H 7950 3400 50  0001 C CNN
	1    7950 3400
	-1   0    0    1   
$EndComp
$Comp
L power:GND #PWR0237
U 1 1 6380C0B0
P 7600 3600
F 0 "#PWR0237" H 7600 3350 50  0001 C CNN
F 1 "GND" H 7605 3427 50  0001 C CNN
F 2 "" H 7600 3600 50  0001 C CNN
F 3 "" H 7600 3600 50  0001 C CNN
	1    7600 3600
	1    0    0    -1  
$EndComp
Wire Wire Line
	7600 3550 7600 3600
Wire Wire Line
	7600 3250 7600 3200
Connection ~ 7600 3200
Wire Wire Line
	7600 3200 7950 3200
Wire Wire Line
	7550 3200 7600 3200
Text GLabel 3450 3000 2    50   Output ~ 0
LEVEL
Text GLabel 8500 3800 2    50   Output ~ 0
GATE_CB
Text GLabel 8500 2600 2    50   Output ~ 0
WHITE_NOISE
Text GLabel 8500 3200 2    50   Output ~ 0
TONE_CB
Text GLabel 8500 3900 2    50   Output ~ 0
GATE_BD
Text GLabel 8500 4000 2    50   Output ~ 0
GATE_BD_ATTACK
Text GLabel 8500 4300 2    50   Output ~ 0
GATE_CLAP
Text GLabel 8500 4200 2    50   Output ~ 0
GATE_SNARE
Text GLabel 8500 4100 2    50   Output ~ 0
GATE_SNARE_NOISE
Text GLabel 8500 4400 2    50   Output ~ 0
GATE_MARACAS
Wire Wire Line
	7050 5500 6850 5500
Wire Wire Line
	6850 5850 6850 5900
Wire Wire Line
	6850 5900 6900 5900
$Comp
L Device:D D203
U 1 1 637DF8C9
P 7300 5900
F 0 "D203" H 7300 6117 50  0000 C CNN
F 1 "D" H 7300 6026 50  0000 C CNN
F 2 "Diodes_SMD:D_SMA_Handsoldering" H 7300 5900 50  0001 C CNN
F 3 "~" H 7300 5900 50  0001 C CNN
	1    7300 5900
	-1   0    0    1   
$EndComp
Wire Wire Line
	6850 5550 6850 5500
Connection ~ 6850 5900
Wire Wire Line
	7100 5900 7150 5900
Wire Wire Line
	7450 5900 7500 5900
Connection ~ 7500 5900
Wire Wire Line
	8650 5500 8650 5550
Wire Wire Line
	8600 5500 8650 5500
Connection ~ 8650 5500
Wire Wire Line
	8400 5500 8350 5500
$Comp
L Device:Polyfuse F201
U 1 1 638C4AE5
P 7750 4900
F 0 "F201" V 7525 4900 50  0000 C CNN
F 1 "60V/50mA" V 7616 4900 50  0000 C CNN
F 2 "Fuse_Holders_and_Fuses:Fuse_SMD1206_HandSoldering" H 7800 4700 50  0001 L CNN
F 3 "~" H 7750 4900 50  0001 C CNN
	1    7750 4900
	0    1    1    0   
$EndComp
$Comp
L Device:CP C215
U 1 1 63A6B57E
P 8650 5100
F 0 "C215" H 8768 5146 50  0000 L CNN
F 1 "10µF/16V" H 8768 5055 50  0000 L CNN
F 2 "Capacitors_ThroughHole:CP_Radial_Tantal_D4.5mm_P2.50mm" H 8688 4950 50  0001 C CNN
F 3 "~" H 8650 5100 50  0001 C CNN
	1    8650 5100
	1    0    0    -1  
$EndComp
$Comp
L Device:CP C214
U 1 1 63A6B004
P 8650 5700
F 0 "C214" H 8768 5746 50  0000 L CNN
F 1 "10µF/25V" H 8768 5655 50  0000 L CNN
F 2 "Capacitors_ThroughHole:CP_Radial_D4.0mm_P1.50mm" H 8688 5550 50  0001 C CNN
F 3 "~" H 8650 5700 50  0001 C CNN
	1    8650 5700
	1    0    0    -1  
$EndComp
$Comp
L Device:D D201
U 1 1 63A4020E
P 8350 5100
F 0 "D201" H 8350 4883 50  0000 C CNN
F 1 "D" H 8350 4974 50  0000 C CNN
F 2 "Diodes_SMD:D_SMA_Handsoldering" H 8350 5100 50  0001 C CNN
F 3 "~" H 8350 5100 50  0001 C CNN
	1    8350 5100
	0    1    1    0   
$EndComp
Wire Wire Line
	8350 4900 8350 4950
Wire Wire Line
	8350 4900 8400 4900
Wire Wire Line
	8650 4900 8650 4950
Connection ~ 8350 4900
$Comp
L power:GND #PWR0244
U 1 1 63957F82
P 8350 5350
F 0 "#PWR0244" H 8350 5100 50  0001 C CNN
F 1 "GND" H 8355 5177 50  0001 C CNN
F 2 "" H 8350 5350 50  0001 C CNN
F 3 "" H 8350 5350 50  0001 C CNN
	1    8350 5350
	1    0    0    -1  
$EndComp
Wire Wire Line
	8350 5250 8350 5300
Wire Wire Line
	8350 5300 8650 5300
Wire Wire Line
	8650 5300 8650 5250
Connection ~ 8350 5300
Wire Wire Line
	8350 5300 8350 5350
Wire Wire Line
	8700 4900 8650 4900
Connection ~ 8650 4900
Wire Wire Line
	7400 5400 7400 4900
Wire Wire Line
	7400 4900 7600 4900
Wire Wire Line
	7400 5400 7500 5400
$Comp
L power:GND #PWR0243
U 1 1 639E3BA2
P 8150 5900
F 0 "#PWR0243" H 8150 5650 50  0001 C CNN
F 1 "GND" H 8155 5727 50  0001 C CNN
F 2 "" H 8150 5900 50  0001 C CNN
F 3 "" H 8150 5900 50  0001 C CNN
	1    8150 5900
	1    0    0    -1  
$EndComp
Wire Wire Line
	6800 5900 6850 5900
Wire Wire Line
	8650 5500 8700 5500
Wire Wire Line
	8650 5850 8650 5900
Wire Wire Line
	8000 5800 8150 5800
Wire Wire Line
	8150 5800 8150 5900
Wire Wire Line
	7900 4900 8350 4900
Wire Wire Line
	8600 4900 8650 4900
$Comp
L Device:Q_NPN_BEC Q201
U 1 1 6371B2A4
P 2850 2200
F 0 "Q201" H 3040 2246 50  0000 L CNN
F 1 "BC846A" H 3040 2155 50  0000 L CNN
F 2 "TO_SOT_Packages_SMD:SOT-23" H 3050 2300 50  0001 C CNN
F 3 "~" H 2850 2200 50  0001 C CNN
	1    2850 2200
	1    0    0    -1  
$EndComp
$Comp
L Device:Q_NPN_BEC Q202
U 1 1 6371FEEE
P 3200 2750
F 0 "Q202" H 3390 2796 50  0000 L CNN
F 1 "BC846A" H 3390 2705 50  0000 L CNN
F 2 "TO_SOT_Packages_SMD:SOT-23" H 3400 2850 50  0001 C CNN
F 3 "~" H 3200 2750 50  0001 C CNN
	1    3200 2750
	1    0    0    -1  
$EndComp
$Comp
L Device:R R225
U 1 1 639BF5DB
P 5100 1550
F 0 "R225" H 5030 1504 50  0000 R CNN
F 1 "10R" H 5030 1595 50  0000 R CNN
F 2 "Resistors_SMD:R_0603_HandSoldering" V 5030 1550 50  0001 C CNN
F 3 "~" H 5100 1550 50  0001 C CNN
	1    5100 1550
	0    1    1    0   
$EndComp
Wire Wire Line
	5250 1550 5350 1550
Wire Wire Line
	5350 1550 5350 2000
Wire Wire Line
	4600 1550 4900 1550
Wire Wire Line
	5250 2000 5250 1900
Wire Wire Line
	5250 1900 4900 1900
Wire Wire Line
	4900 1900 4900 1550
Connection ~ 4900 1550
Wire Wire Line
	4900 1550 4950 1550
$Comp
L Device:C C218
U 1 1 63A14767
P 5550 1750
F 0 "C218" V 5802 1750 50  0000 C CNN
F 1 "100nF" V 5711 1750 50  0000 C CNN
F 2 "Capacitors_SMD:C_0603_HandSoldering" H 5588 1600 50  0001 C CNN
F 3 "~" H 5550 1750 50  0001 C CNN
	1    5550 1750
	1    0    0    1   
$EndComp
Wire Wire Line
	5350 1550 5550 1550
Wire Wire Line
	5550 1550 5550 1600
Connection ~ 5350 1550
$Comp
L power:GND #PWR0101
U 1 1 63A1E8DE
P 5550 1950
F 0 "#PWR0101" H 5550 1700 50  0001 C CNN
F 1 "GND" H 5555 1777 50  0001 C CNN
F 2 "" H 5550 1950 50  0001 C CNN
F 3 "" H 5550 1950 50  0001 C CNN
	1    5550 1950
	1    0    0    -1  
$EndComp
Wire Wire Line
	5550 1900 5550 1950
Wire Wire Line
	4600 2050 4600 2300
Wire Wire Line
	5850 2600 8050 2600
Connection ~ 4400 2700
Wire Wire Line
	4400 2700 4650 2700
Wire Wire Line
	4400 2700 4400 2750
Wire Wire Line
	4350 2700 4400 2700
Wire Wire Line
	4000 3100 4000 3050
$Comp
L power:GND #PWR0102
U 1 1 63A50647
P 4000 3100
F 0 "#PWR0102" H 4000 2850 50  0001 C CNN
F 1 "GND" H 4005 2927 50  0001 C CNN
F 2 "" H 4000 3100 50  0001 C CNN
F 3 "" H 4000 3100 50  0001 C CNN
	1    4000 3100
	1    0    0    -1  
$EndComp
Wire Wire Line
	4400 3100 4400 3050
$Comp
L power:GND #PWR0103
U 1 1 63A4756C
P 4400 3100
F 0 "#PWR0103" H 4400 2850 50  0001 C CNN
F 1 "GND" H 4405 2927 50  0001 C CNN
F 2 "" H 4400 3100 50  0001 C CNN
F 3 "" H 4400 3100 50  0001 C CNN
	1    4400 3100
	1    0    0    -1  
$EndComp
$Comp
L Device:C C217
U 1 1 63A471B6
P 4400 2900
F 0 "C217" H 4286 2854 50  0000 R CNN
F 1 "22pF" H 4286 2945 50  0000 R CNN
F 2 "Capacitors_SMD:C_0603_HandSoldering" H 4438 2750 50  0001 C CNN
F 3 "~" H 4400 2900 50  0001 C CNN
	1    4400 2900
	1    0    0    1   
$EndComp
$Comp
L Device:C C216
U 1 1 63A4490C
P 4000 2900
F 0 "C216" H 3886 2854 50  0000 R CNN
F 1 "22pF" H 3886 2945 50  0000 R CNN
F 2 "Capacitors_SMD:C_0603_HandSoldering" H 4038 2750 50  0001 C CNN
F 3 "~" H 4000 2900 50  0001 C CNN
	1    4000 2900
	1    0    0    1   
$EndComp
$Comp
L Device:Crystal Y201
U 1 1 63A43A5A
P 4200 2700
F 0 "Y201" H 4200 2968 50  0000 C CNN
F 1 "16.000MHz" H 4200 2877 50  0000 C CNN
F 2 "Crystals:Crystal_HC49-4H_Vertical" H 4200 2700 50  0001 C CNN
F 3 "~" H 4200 2700 50  0001 C CNN
	1    4200 2700
	1    0    0    -1  
$EndComp
Wire Wire Line
	4650 2500 4000 2500
Wire Wire Line
	4000 2500 4000 2700
Wire Wire Line
	4000 2700 4050 2700
Connection ~ 4000 2700
Wire Wire Line
	4000 2700 4000 2750
Wire Wire Line
	5850 3800 8500 3800
$Comp
L Device:R R226
U 1 1 637C44D7
P 7400 2900
F 0 "R226" V 7193 2900 50  0000 C CNN
F 1 "100k" V 7284 2900 50  0000 C CNN
F 2 "Resistors_SMD:R_0603_HandSoldering" V 7330 2900 50  0001 C CNN
F 3 "~" H 7400 2900 50  0001 C CNN
	1    7400 2900
	0    1    1    0   
$EndComp
Wire Wire Line
	7550 2900 7600 2900
Wire Wire Line
	7600 2900 7600 3200
Connection ~ 7950 3200
$Comp
L Device:R R227
U 1 1 63857FC0
P 7950 3000
F 0 "R227" H 7880 2954 50  0000 R CNN
F 1 "4.7k" H 7880 3045 50  0000 R CNN
F 2 "Resistors_SMD:R_0603_HandSoldering" V 7880 3000 50  0001 C CNN
F 3 "~" H 7950 3000 50  0001 C CNN
	1    7950 3000
	-1   0    0    1   
$EndComp
Wire Wire Line
	7950 3150 7950 3200
$Comp
L power:+5V #PWR0104
U 1 1 63862A02
P 7950 2800
F 0 "#PWR0104" H 7950 2650 50  0001 C CNN
F 1 "+5V" H 7850 2900 50  0000 C CNN
F 2 "" H 7950 2800 50  0001 C CNN
F 3 "" H 7950 2800 50  0001 C CNN
	1    7950 2800
	1    0    0    -1  
$EndComp
Wire Wire Line
	7950 2800 7950 2850
Wire Wire Line
	6600 3200 7250 3200
Wire Wire Line
	6700 2900 7250 2900
Wire Wire Line
	6700 2500 5850 2500
Wire Wire Line
	6700 2500 6700 2900
Wire Wire Line
	6450 2700 5850 2700
Wire Wire Line
	6450 1100 6450 2700
Wire Wire Line
	6600 2400 5850 2400
Wire Wire Line
	6600 2400 6600 3200
$Comp
L Device:Q_NPN_BEC Q203
U 1 1 637E1067
P 5900 5700
F 0 "Q203" H 6090 5746 50  0000 L CNN
F 1 "BC846A" H 6090 5655 50  0000 L CNN
F 2 "TO_SOT_Packages_SMD:SOT-23" H 6100 5800 50  0001 C CNN
F 3 "~" H 5900 5700 50  0001 C CNN
	1    5900 5700
	1    0    0    -1  
$EndComp
$Comp
L Device:R R230
U 1 1 637EFFCB
P 5800 5450
F 0 "R230" H 5730 5404 50  0000 R CNN
F 1 "3.3k" H 5730 5495 50  0000 R CNN
F 2 "Resistors_SMD:R_0603_HandSoldering" V 5730 5450 50  0001 C CNN
F 3 "~" H 5800 5450 50  0001 C CNN
	1    5800 5450
	0    1    1    0   
$EndComp
Wire Wire Line
	5950 5450 6000 5450
Wire Wire Line
	6000 5450 6000 5500
$Comp
L power:GND #PWR0106
U 1 1 63858105
P 6000 6100
F 0 "#PWR0106" H 6000 5850 50  0001 C CNN
F 1 "GND" H 6005 5927 50  0001 C CNN
F 2 "" H 6000 6100 50  0001 C CNN
F 3 "" H 6000 6100 50  0001 C CNN
	1    6000 6100
	1    0    0    -1  
$EndComp
Wire Wire Line
	6000 5900 6000 6100
$Comp
L power:+5V #PWR0107
U 1 1 638641EC
P 5600 5200
F 0 "#PWR0107" H 5600 5050 50  0001 C CNN
F 1 "+5V" H 5500 5300 50  0000 C CNN
F 2 "" H 5600 5200 50  0001 C CNN
F 3 "" H 5600 5200 50  0001 C CNN
	1    5600 5200
	1    0    0    -1  
$EndComp
Wire Wire Line
	6000 3700 5850 3700
Connection ~ 6000 5450
$Comp
L Device:C C219
U 1 1 63AB477A
P 5400 5250
F 0 "C219" V 5652 5250 50  0000 C CNN
F 1 "100nF" V 5561 5250 50  0000 C CNN
F 2 "Capacitors_SMD:C_0603_HandSoldering" H 5438 5100 50  0001 C CNN
F 3 "~" H 5400 5250 50  0001 C CNN
	1    5400 5250
	0    1    -1   0   
$EndComp
Wire Wire Line
	4400 5600 4400 5400
Wire Wire Line
	4350 5600 4400 5600
Wire Wire Line
	4450 5500 4350 5500
Wire Wire Line
	4450 5800 4450 5500
NoConn ~ 4350 5700
Connection ~ 4800 5800
Wire Wire Line
	4450 5800 4800 5800
Wire Wire Line
	4400 5400 4450 5400
$Comp
L Connector:AudioJack3 J208
U 1 1 638F20EA
P 4150 5600
F 0 "J208" H 3871 5533 50  0000 R CNN
F 1 "MIDI_IN" H 3871 5624 50  0000 R CNN
F 2 "Connectors:Cliff_FC681374V" H 4150 5600 50  0001 C CNN
F 3 "~" H 4150 5600 50  0001 C CNN
	1    4150 5600
	1    0    0    1   
$EndComp
Connection ~ 4800 5400
Wire Wire Line
	4750 5400 4800 5400
$Comp
L Device:R R228
U 1 1 638B9F76
P 4600 5400
F 0 "R228" H 4530 5354 50  0000 R CNN
F 1 "220R" H 4530 5445 50  0000 R CNN
F 2 "Resistors_SMD:R_0603_HandSoldering" V 4530 5400 50  0001 C CNN
F 3 "~" H 4600 5400 50  0001 C CNN
	1    4600 5400
	0    1    1    0   
$EndComp
Wire Wire Line
	4800 5800 4800 5750
Wire Wire Line
	4900 5800 4800 5800
Wire Wire Line
	4900 5700 4900 5800
Wire Wire Line
	4950 5700 4900 5700
Wire Wire Line
	4800 5400 4800 5450
Wire Wire Line
	4900 5400 4800 5400
Wire Wire Line
	4900 5500 4900 5400
Wire Wire Line
	4950 5500 4900 5500
$Comp
L Device:D D?
U 1 1 638974F3
P 4800 5600
AR Path="/635B4852/638974F3" Ref="D?"  Part="1" 
AR Path="/635986C0/638974F3" Ref="D204"  Part="1" 
F 0 "D204" H 4800 5817 50  0000 C CNN
F 1 "D" H 4800 5726 50  0000 C CNN
F 2 "Diodes_SMD:D_MiniMELF" H 4800 5600 50  0001 C CNN
F 3 "~" H 4800 5600 50  0001 C CNN
	1    4800 5600
	0    -1   1    0   
$EndComp
Connection ~ 5600 5450
Wire Wire Line
	5600 5200 5600 5250
Wire Wire Line
	5600 6100 5600 6050
$Comp
L power:GND #PWR0105
U 1 1 638381CD
P 5600 6100
F 0 "#PWR0105" H 5600 5850 50  0001 C CNN
F 1 "GND" H 5605 5927 50  0001 C CNN
F 2 "" H 5600 6100 50  0001 C CNN
F 3 "" H 5600 6100 50  0001 C CNN
	1    5600 6100
	1    0    0    -1  
$EndComp
NoConn ~ 5550 5500
Wire Wire Line
	5600 5600 5550 5600
Wire Wire Line
	5600 5450 5600 5600
Wire Wire Line
	5650 5450 5600 5450
Connection ~ 5600 5700
Wire Wire Line
	5600 5700 5700 5700
Wire Wire Line
	5600 5700 5600 5750
Wire Wire Line
	5550 5700 5600 5700
$Comp
L Device:R R229
U 1 1 637D15B4
P 5600 5900
F 0 "R229" H 5530 5854 50  0000 R CNN
F 1 "1k" H 5530 5945 50  0000 R CNN
F 2 "Resistors_SMD:R_0603_HandSoldering" V 5530 5900 50  0001 C CNN
F 3 "~" H 5600 5900 50  0001 C CNN
	1    5600 5900
	-1   0    0    1   
$EndComp
$Comp
L Isolator:4N25 U202
U 1 1 637990E9
P 5250 5600
F 0 "U202" H 5250 5400 50  0000 C CNN
F 1 "MB104" H 5250 5300 50  0000 C CNN
F 2 "Housings_DIP:DIP-6_W7.62mm_LongPads" H 5050 5400 50  0001 L CIN
F 3 "https://www.vishay.com/docs/83725/4n25.pdf" H 5250 5600 50  0001 L CNN
	1    5250 5600
	1    0    0    -1  
$EndComp
Wire Wire Line
	5550 5250 5600 5250
Connection ~ 5600 5250
Wire Wire Line
	5600 5250 5600 5450
$Comp
L power:GND #PWR0108
U 1 1 63B0525C
P 5200 5300
F 0 "#PWR0108" H 5200 5050 50  0001 C CNN
F 1 "GND" H 5205 5127 50  0001 C CNN
F 2 "" H 5200 5300 50  0001 C CNN
F 3 "" H 5200 5300 50  0001 C CNN
	1    5200 5300
	1    0    0    -1  
$EndComp
Wire Wire Line
	5200 5300 5200 5250
Wire Wire Line
	5200 5250 5250 5250
Wire Wire Line
	6000 3700 6000 5450
NoConn ~ 5850 2800
$Comp
L Device:R R231
U 1 1 63BB9E54
P 6900 2300
F 0 "R231" H 6830 2254 50  0000 R CNN
F 1 "1k" H 6830 2345 50  0000 R CNN
F 2 "Resistors_SMD:R_0603_HandSoldering" V 6830 2300 50  0001 C CNN
F 3 "~" H 6900 2300 50  0001 C CNN
	1    6900 2300
	0    1    1    0   
$EndComp
$Comp
L Device:LED D205
U 1 1 63BBC2E3
P 7250 2300
F 0 "D205" H 7243 2045 50  0000 C CNN
F 1 "LED" H 7243 2136 50  0000 C CNN
F 2 "LEDs:LED_D5.0mm" H 7250 2300 50  0001 C CNN
F 3 "~" H 7250 2300 50  0001 C CNN
	1    7250 2300
	-1   0    0    1   
$EndComp
$Comp
L power:GND #PWR0109
U 1 1 63BBD5B4
P 7450 2350
F 0 "#PWR0109" H 7450 2100 50  0001 C CNN
F 1 "GND" H 7455 2177 50  0001 C CNN
F 2 "" H 7450 2350 50  0001 C CNN
F 3 "" H 7450 2350 50  0001 C CNN
	1    7450 2350
	1    0    0    -1  
$EndComp
Wire Wire Line
	7400 2300 7450 2300
Wire Wire Line
	7450 2300 7450 2350
Wire Wire Line
	7100 2300 7050 2300
Wire Wire Line
	5850 2300 6750 2300
Wire Bus Line
	6400 3100 6400 6700
Wire Bus Line
	3250 3950 3250 6750
$EndSCHEMATC
