EESchema Schematic File Version 4
EELAYER 30 0
EELAYER END
$Descr A4 11693 8268
encoding utf-8
Sheet 3 3
Title "Modular Drums"
Date "2023-01-03"
Rev "2"
Comp "(c) 2022-2023 Andreas Messer"
Comment1 ""
Comment2 ""
Comment3 ""
Comment4 ""
$EndDescr
$Comp
L Device:R R302
U 1 1 635B63DE
P 1350 5950
F 0 "R302" V 1143 5950 50  0000 C CNN
F 1 "220k" V 1234 5950 50  0000 C CNN
F 2 "Resistors_SMD:R_0603_HandSoldering" V 1280 5950 50  0001 C CNN
F 3 "~" H 1350 5950 50  0001 C CNN
	1    1350 5950
	0    -1   1    0   
$EndComp
$Comp
L Device:R R305
U 1 1 635B73AD
P 1550 6150
F 0 "R305" H 1480 6104 50  0000 R CNN
F 1 "39k" H 1480 6195 50  0000 R CNN
F 2 "Resistors_SMD:R_0603_HandSoldering" V 1480 6150 50  0001 C CNN
F 3 "~" H 1550 6150 50  0001 C CNN
	1    1550 6150
	1    0    0    1   
$EndComp
$Comp
L Device:R R311
U 1 1 635B7B8A
P 2150 6950
F 0 "R311" H 2080 6904 50  0000 R CNN
F 1 "6.8k" H 2080 6995 50  0000 R CNN
F 2 "Resistors_SMD:R_0603_HandSoldering" V 2080 6950 50  0001 C CNN
F 3 "~" H 2150 6950 50  0001 C CNN
	1    2150 6950
	1    0    0    1   
$EndComp
$Comp
L Device:C C304
U 1 1 635B9381
P 1950 6750
F 0 "C304" V 1698 6750 50  0000 C CNN
F 1 "15nF" V 1789 6750 50  0000 C CNN
F 2 "Capacitors_ThroughHole:C_Rect_L7.2mm_W2.5mm_P5.00mm_FKS2_FKP2_MKS2_MKP2" H 1988 6600 50  0001 C CNN
F 3 "~" H 1950 6750 50  0001 C CNN
	1    1950 6750
	0    1    1    0   
$EndComp
$Comp
L Device:C C308
U 1 1 635BA690
P 2450 6750
F 0 "C308" V 2198 6750 50  0000 C CNN
F 1 "15nF" V 2289 6750 50  0000 C CNN
F 2 "Capacitors_ThroughHole:C_Rect_L7.2mm_W2.5mm_P5.00mm_FKS2_FKP2_MKS2_MKP2" H 2488 6600 50  0001 C CNN
F 3 "~" H 2450 6750 50  0001 C CNN
	1    2450 6750
	0    1    1    0   
$EndComp
Wire Wire Line
	1900 6150 1750 6150
Wire Wire Line
	1750 6150 1750 6450
Wire Wire Line
	1750 6750 1800 6750
Wire Wire Line
	2100 6750 2150 6750
Wire Wire Line
	2500 6050 2550 6050
Wire Wire Line
	2650 6050 2650 6450
Wire Wire Line
	2150 6750 2150 6800
Connection ~ 2150 6750
Wire Wire Line
	2150 6750 2250 6750
$Comp
L Device:R R312
U 1 1 635BE7F7
P 2150 7350
F 0 "R312" H 2080 7304 50  0000 R CNN
F 1 "39k" H 2080 7395 50  0000 R CNN
F 2 "Resistors_SMD:R_0603_HandSoldering" V 2080 7350 50  0001 C CNN
F 3 "~" H 2150 7350 50  0001 C CNN
	1    2150 7350
	1    0    0    1   
$EndComp
Wire Wire Line
	2150 7100 2150 7150
$Comp
L power:GND #PWR0308
U 1 1 635BF53C
P 2150 7550
F 0 "#PWR0308" H 2150 7300 50  0001 C CNN
F 1 "GND" H 2155 7377 50  0001 C CNN
F 2 "" H 2150 7550 50  0001 C CNN
F 3 "" H 2150 7550 50  0001 C CNN
	1    2150 7550
	1    0    0    -1  
$EndComp
Wire Wire Line
	2150 7500 2150 7550
Wire Wire Line
	1500 5950 1550 5950
Wire Wire Line
	1550 6000 1550 5950
Connection ~ 1550 5950
Wire Wire Line
	1550 5950 1650 5950
$Comp
L power:GND #PWR0303
U 1 1 635C8C2B
P 1550 6350
F 0 "#PWR0303" H 1550 6100 50  0001 C CNN
F 1 "GND" H 1555 6177 50  0001 C CNN
F 2 "" H 1550 6350 50  0001 C CNN
F 3 "" H 1550 6350 50  0001 C CNN
	1    1550 6350
	1    0    0    -1  
$EndComp
Wire Wire Line
	1550 6300 1550 6350
Wire Wire Line
	1200 5950 1150 5950
Wire Wire Line
	1150 6550 1650 6550
Wire Wire Line
	1650 6550 1650 5950
Connection ~ 1650 5950
Wire Wire Line
	1650 5950 1900 5950
Wire Wire Line
	1150 7150 2150 7150
Connection ~ 2150 7150
Wire Wire Line
	2150 7150 2150 7200
Connection ~ 1750 6450
Wire Wire Line
	1750 6450 1750 6750
Connection ~ 2650 6450
Wire Wire Line
	2650 6450 2650 6550
$Comp
L Device:R R326
U 1 1 635E695E
P 3100 6950
F 0 "R326" H 3030 6996 50  0000 R CNN
F 1 "4.7k" H 3030 6905 50  0000 R CNN
F 2 "Resistors_SMD:R_0603_HandSoldering" V 3030 6950 50  0001 C CNN
F 3 "~" H 3100 6950 50  0001 C CNN
	1    3100 6950
	-1   0    0    -1  
$EndComp
$Comp
L Device:R R325
U 1 1 635ECA28
P 2900 7350
F 0 "R325" H 2830 7304 50  0000 R CNN
F 1 "6.8k" H 2830 7395 50  0000 R CNN
F 2 "Resistors_SMD:R_0603_HandSoldering" V 2830 7350 50  0001 C CNN
F 3 "~" H 2900 7350 50  0001 C CNN
	1    2900 7350
	1    0    0    1   
$EndComp
$Comp
L Device:CP C315
U 1 1 635F220F
P 3100 7350
F 0 "C315" H 3218 7396 50  0000 L CNN
F 1 "10µF/25V" H 3218 7305 50  0000 L CNN
F 2 "Capacitors_ThroughHole:CP_Radial_D4.0mm_P1.50mm" H 3138 7200 50  0001 C CNN
F 3 "~" H 3100 7350 50  0001 C CNN
	1    3100 7350
	1    0    0    -1  
$EndComp
Wire Wire Line
	2900 7200 2900 7150
Wire Wire Line
	3100 7150 3100 7200
Wire Wire Line
	2900 7500 2900 7550
Wire Wire Line
	3100 7500 3100 7550
$Comp
L Device:R R324
U 1 1 635F5D4E
P 2900 5850
F 0 "R324" H 2830 5804 50  0000 R CNN
F 1 "4.7k" H 2830 5895 50  0000 R CNN
F 2 "Resistors_SMD:R_0603_HandSoldering" V 2830 5850 50  0001 C CNN
F 3 "~" H 2900 5850 50  0001 C CNN
	1    2900 5850
	1    0    0    1   
$EndComp
$Comp
L Device:R_POT RV303
U 1 1 635F74C8
P 3100 6100
F 0 "RV303" H 3030 6146 50  0000 R CNN
F 1 "100k" H 3030 6055 50  0000 R CNN
F 2 "Potentiometer:Potentiometer_Alpha_RD901F-40-xxx-xxx-00D" H 3100 6100 50  0001 C CNN
F 3 "~" H 3100 6100 50  0001 C CNN
	1    3100 6100
	-1   0    0    -1  
$EndComp
$Comp
L Device:CP C314
U 1 1 635FFB7E
P 3100 5750
F 0 "C314" H 2800 5800 50  0000 L CNN
F 1 "10µF/25V" H 3000 5700 50  0000 R CNN
F 2 "Capacitors_ThroughHole:CP_Radial_D4.0mm_P1.50mm" H 3138 5600 50  0001 C CNN
F 3 "~" H 3100 5750 50  0001 C CNN
	1    3100 5750
	-1   0    0    -1  
$EndComp
Wire Wire Line
	2950 6100 2900 6100
Wire Wire Line
	2900 6100 2900 6300
Wire Wire Line
	3100 6300 3100 6250
Wire Wire Line
	3100 5950 3100 5900
Wire Wire Line
	3100 5600 3100 5550
Wire Wire Line
	3100 5550 3000 5550
Wire Wire Line
	2900 5550 2900 5700
Wire Wire Line
	2900 6000 2900 6100
Connection ~ 2900 6100
Wire Wire Line
	3100 6300 3100 6350
Connection ~ 3100 6300
Wire Wire Line
	2900 7150 3100 7150
$Comp
L Device:R R320
U 1 1 6363AEC6
P 2750 6800
F 0 "R320" H 2680 6754 50  0000 R CNN
F 1 "470k" H 2680 6845 50  0000 R CNN
F 2 "Resistors_SMD:R_0603_HandSoldering" V 2680 6800 50  0001 C CNN
F 3 "~" H 2750 6800 50  0001 C CNN
	1    2750 6800
	-1   0    0    1   
$EndComp
Wire Wire Line
	2750 6300 2900 6300
Wire Wire Line
	3100 7100 3100 7150
Connection ~ 3100 7150
Wire Wire Line
	2600 6750 2650 6750
Wire Wire Line
	3100 6750 3100 6800
Connection ~ 2250 6750
Wire Wire Line
	2250 6750 2300 6750
Wire Wire Line
	2250 6750 2250 7100
Wire Wire Line
	2350 6450 2650 6450
Wire Wire Line
	2050 6450 1750 6450
$Comp
L Device:R R314
U 1 1 635CC08E
P 2200 6450
F 0 "R314" V 1993 6450 50  0000 C CNN
F 1 "1M" V 2084 6450 50  0000 C CNN
F 2 "Resistors_SMD:R_0603_HandSoldering" V 2130 6450 50  0001 C CNN
F 3 "~" H 2200 6450 50  0001 C CNN
	1    2200 6450
	0    -1   1    0   
$EndComp
Wire Wire Line
	2650 6550 2800 6550
Connection ~ 2650 6550
Wire Wire Line
	2650 6550 2650 6750
Wire Wire Line
	2250 7100 2300 7100
Wire Wire Line
	2750 6300 2750 6650
$Comp
L power:+12V #PWR0314
U 1 1 637260C5
P 3000 5500
F 0 "#PWR0314" H 3000 5350 50  0001 C CNN
F 1 "+12V" H 3015 5673 50  0000 C CNN
F 2 "" H 3000 5500 50  0001 C CNN
F 3 "" H 3000 5500 50  0001 C CNN
	1    3000 5500
	1    0    0    -1  
$EndComp
Wire Wire Line
	3000 5500 3000 5550
Connection ~ 3000 5550
Wire Wire Line
	3000 5550 2900 5550
Wire Wire Line
	2750 6950 2750 7100
Wire Wire Line
	2600 7100 2750 7100
Connection ~ 2900 6300
Wire Wire Line
	2900 6300 3100 6300
$Comp
L Device:R_POT RV302
U 1 1 637665B7
P 2550 5500
F 0 "RV302" V 2343 5500 50  0000 C CNN
F 1 "100k" V 2434 5500 50  0000 C CNN
F 2 "Potentiometer:Potentiometer_Alpha_RD901F-40-xxx-xxx-00D" H 2550 5500 50  0001 C CNN
F 3 "~" H 2550 5500 50  0001 C CNN
	1    2550 5500
	0    1    1    0   
$EndComp
$Comp
L Device:R R319
U 1 1 63766C66
P 2550 5850
F 0 "R319" H 2480 5804 50  0000 R CNN
F 1 "39k" H 2480 5895 50  0000 R CNN
F 2 "Resistors_SMD:R_0603_HandSoldering" V 2480 5850 50  0001 C CNN
F 3 "~" H 2550 5850 50  0001 C CNN
	1    2550 5850
	1    0    0    1   
$EndComp
Wire Wire Line
	2550 6000 2550 6050
Connection ~ 2550 6050
Wire Wire Line
	2550 6050 2650 6050
Wire Wire Line
	2550 5650 2550 5700
$Comp
L power:GND #PWR0312
U 1 1 63770932
P 2750 5550
F 0 "#PWR0312" H 2750 5300 50  0001 C CNN
F 1 "GND" H 2755 5377 50  0001 C CNN
F 2 "" H 2750 5550 50  0001 C CNN
F 3 "" H 2750 5550 50  0001 C CNN
	1    2750 5550
	1    0    0    -1  
$EndComp
Wire Wire Line
	2700 5500 2750 5500
Wire Wire Line
	2750 5500 2750 5550
$Comp
L Device:R R313
U 1 1 63775A3C
P 2200 5500
F 0 "R313" V 1993 5500 50  0000 C CNN
F 1 "10k" V 2084 5500 50  0000 C CNN
F 2 "Resistors_SMD:R_0603_HandSoldering" V 2130 5500 50  0001 C CNN
F 3 "~" H 2200 5500 50  0001 C CNN
	1    2200 5500
	0    -1   1    0   
$EndComp
Wire Wire Line
	2400 5500 2350 5500
$Comp
L power:GND #PWR0307
U 1 1 637791D4
P 2000 5000
F 0 "#PWR0307" H 2000 4750 50  0001 C CNN
F 1 "GND" H 2005 4827 50  0001 C CNN
F 2 "" H 2000 5000 50  0001 C CNN
F 3 "" H 2000 5000 50  0001 C CNN
	1    2000 5000
	1    0    0    -1  
$EndComp
Wire Wire Line
	2000 5000 2000 4950
Wire Wire Line
	2000 4950 2050 4950
Wire Wire Line
	2050 5150 2000 5150
Wire Wire Line
	2000 5150 2000 5500
Wire Wire Line
	2000 5500 2050 5500
$Comp
L Device:R R309
U 1 1 63783598
P 1800 4950
F 0 "R309" H 1750 5100 50  0000 R CNN
F 1 "100k" H 1750 5000 50  0000 R CNN
F 2 "Resistors_SMD:R_0603_HandSoldering" V 1730 4950 50  0001 C CNN
F 3 "~" H 1800 4950 50  0001 C CNN
	1    1800 4950
	-1   0    0    -1  
$EndComp
Wire Wire Line
	2000 5150 1800 5150
Wire Wire Line
	1800 5150 1800 5100
Connection ~ 2000 5150
$Comp
L Device:R_POT RV301
U 1 1 637A0A75
P 1400 4950
F 0 "RV301" H 1331 4996 50  0000 R CNN
F 1 "100k" H 1331 4905 50  0000 R CNN
F 2 "Potentiometer:Potentiometer_Alpha_RD901F-40-xxx-xxx-00D" H 1400 4950 50  0001 C CNN
F 3 "~" H 1400 4950 50  0001 C CNN
	1    1400 4950
	1    0    0    -1  
$EndComp
Wire Wire Line
	1550 4950 1600 4950
Wire Wire Line
	1600 4950 1600 5150
Wire Wire Line
	1600 5150 1400 5150
Wire Wire Line
	1400 5150 1400 5100
Wire Wire Line
	1600 5150 1800 5150
Connection ~ 1600 5150
Connection ~ 1800 5150
$Comp
L Device:C C302
U 1 1 637A81A6
P 1600 4750
F 0 "C302" V 1852 4750 50  0000 C CNN
F 1 "47nF" V 1761 4750 50  0000 C CNN
F 2 "Capacitors_ThroughHole:C_Rect_L7.2mm_W2.5mm_P5.00mm_FKS2_FKP2_MKS2_MKP2" H 1638 4600 50  0001 C CNN
F 3 "~" H 1600 4750 50  0001 C CNN
	1    1600 4750
	0    -1   -1   0   
$EndComp
Wire Wire Line
	1800 4800 1800 4750
Wire Wire Line
	1800 4750 1750 4750
Wire Wire Line
	1400 4800 1400 4750
Wire Wire Line
	1400 4750 1450 4750
Wire Wire Line
	1800 4750 2700 4750
Wire Wire Line
	2700 4750 2700 5050
Wire Wire Line
	2700 5050 2650 5050
Connection ~ 1800 4750
$Comp
L Connector:AudioJack2_SwitchT J301
U 1 1 637DDAC8
P 3300 5050
F 0 "J301" H 3120 4983 50  0000 R CNN
F 1 "OUT_BD" H 3120 5074 50  0000 R CNN
F 2 "Connectors:Cliff_FC681374V" H 3300 5050 50  0001 C CNN
F 3 "~" H 3300 5050 50  0001 C CNN
	1    3300 5050
	-1   0    0    1   
$EndComp
$Comp
L Device:R R323
U 1 1 637DF377
P 2900 5050
F 0 "R323" V 2693 5050 50  0000 C CNN
F 1 "1k" V 2784 5050 50  0000 C CNN
F 2 "Resistors_SMD:R_0603_HandSoldering" V 2830 5050 50  0001 C CNN
F 3 "~" H 2900 5050 50  0001 C CNN
	1    2900 5050
	0    -1   1    0   
$EndComp
$Comp
L power:GND #PWR0315
U 1 1 637E39E0
P 3050 5200
F 0 "#PWR0315" H 3050 4950 50  0001 C CNN
F 1 "GND" H 3055 5027 50  0001 C CNN
F 2 "" H 3050 5200 50  0001 C CNN
F 3 "" H 3050 5200 50  0001 C CNN
	1    3050 5200
	1    0    0    -1  
$EndComp
Wire Wire Line
	3100 5150 3050 5150
Wire Wire Line
	3050 5150 3050 5200
Wire Wire Line
	3050 5050 3100 5050
$Comp
L Device:C C301
U 1 1 63832C65
P 1450 1950
F 0 "C301" V 1198 1950 50  0000 C CNN
F 1 "100nF" V 1289 1950 50  0000 C CNN
F 2 "Capacitors_ThroughHole:C_Rect_L7.2mm_W2.5mm_P5.00mm_FKS2_FKP2_MKS2_MKP2" H 1488 1800 50  0001 C CNN
F 3 "~" H 1450 1950 50  0001 C CNN
	1    1450 1950
	0    1    1    0   
$EndComp
Wire Wire Line
	1300 1950 1200 1950
$Comp
L Device:R R307
U 1 1 63838F9F
P 1800 1750
F 0 "R307" H 1730 1796 50  0000 R CNN
F 1 "1M" H 1730 1705 50  0000 R CNN
F 2 "Resistors_SMD:R_0603_HandSoldering" V 1730 1750 50  0001 C CNN
F 3 "~" H 1800 1750 50  0001 C CNN
	1    1800 1750
	-1   0    0    -1  
$EndComp
Wire Wire Line
	1600 1950 1800 1950
Wire Wire Line
	1800 1950 1800 1900
Connection ~ 1800 1950
Wire Wire Line
	1800 1950 1850 1950
$Comp
L Device:R R315
U 1 1 6383E83A
P 2400 2200
F 0 "R315" V 2300 2200 50  0000 C CNN
F 1 "100R" V 2200 2200 50  0000 C CNN
F 2 "Resistors_SMD:R_0603_HandSoldering" V 2330 2200 50  0001 C CNN
F 3 "~" H 2400 2200 50  0001 C CNN
	1    2400 2200
	0    -1   -1   0   
$EndComp
$Comp
L Device:D D302
U 1 1 638487EA
P 2350 1700
F 0 "D302" H 2350 1917 50  0000 C CNN
F 1 "D" H 2350 1826 50  0000 C CNN
F 2 "Diodes_SMD:D_MiniMELF" H 2350 1700 50  0001 C CNN
F 3 "~" H 2350 1700 50  0001 C CNN
	1    2350 1700
	1    0    0    -1  
$EndComp
Wire Wire Line
	2150 1700 2150 1750
$Comp
L power:+12V #PWR0305
U 1 1 6384C750
P 1800 1550
F 0 "#PWR0305" H 1800 1400 50  0001 C CNN
F 1 "+12V" H 1815 1723 50  0000 C CNN
F 2 "" H 1800 1550 50  0001 C CNN
F 3 "" H 1800 1550 50  0001 C CNN
	1    1800 1550
	1    0    0    -1  
$EndComp
Wire Wire Line
	1800 1550 1800 1600
$Comp
L Device:C C310
U 1 1 63853F1C
P 2650 1950
F 0 "C310" H 2535 1904 50  0000 R CNN
F 1 "4.7nF" H 2535 1995 50  0000 R CNN
F 2 "Capacitors_ThroughHole:C_Rect_L7.2mm_W2.5mm_P5.00mm_FKS2_FKP2_MKS2_MKP2" H 2688 1800 50  0001 C CNN
F 3 "~" H 2650 1950 50  0001 C CNN
	1    2650 1950
	-1   0    0    1   
$EndComp
Wire Wire Line
	2500 1700 2650 1700
Wire Wire Line
	2650 1700 2650 1800
Connection ~ 2650 1700
$Comp
L Device:R R316
U 1 1 63857DAE
P 2450 850
F 0 "R316" V 2243 850 50  0000 C CNN
F 1 "18k" V 2334 850 50  0000 C CNN
F 2 "Resistors_SMD:R_0603_HandSoldering" V 2380 850 50  0001 C CNN
F 3 "~" H 2450 850 50  0001 C CNN
	1    2450 850 
	0    1    1    0   
$EndComp
Wire Wire Line
	1350 850  1400 850 
$Comp
L power:+12V #PWR0301
U 1 1 638C978C
P 1350 800
F 0 "#PWR0301" H 1350 650 50  0001 C CNN
F 1 "+12V" H 1365 973 50  0000 C CNN
F 2 "" H 1350 800 50  0001 C CNN
F 3 "" H 1350 800 50  0001 C CNN
	1    1350 800 
	1    0    0    -1  
$EndComp
$Comp
L power:GND #PWR0309
U 1 1 638C2C01
P 2250 1300
F 0 "#PWR0309" H 2250 1050 50  0001 C CNN
F 1 "GND" H 2255 1127 50  0001 C CNN
F 2 "" H 2250 1300 50  0001 C CNN
F 3 "" H 2250 1300 50  0001 C CNN
	1    2250 1300
	-1   0    0    -1  
$EndComp
$Comp
L Device:C C306
U 1 1 63877D67
P 2050 1250
F 0 "C306" V 2200 1250 50  0000 C CNN
F 1 "330nF" V 2300 1250 50  0000 C CNN
F 2 "Capacitors_ThroughHole:C_Rect_L7.2mm_W3.5mm_P5.00mm_FKS2_FKP2_MKS2_MKP2" H 2088 1100 50  0001 C CNN
F 3 "~" H 2050 1250 50  0001 C CNN
	1    2050 1250
	0    -1   1    0   
$EndComp
$Comp
L Device:R R310
U 1 1 638769F1
P 1850 1050
F 0 "R310" H 1780 1004 50  0000 R CNN
F 1 "18k" H 1780 1095 50  0000 R CNN
F 2 "Resistors_SMD:R_0603_HandSoldering" V 1780 1050 50  0001 C CNN
F 3 "~" H 1850 1050 50  0001 C CNN
	1    1850 1050
	-1   0    0    1   
$EndComp
$Comp
L Device:C C307
U 1 1 63876371
P 2250 1050
F 0 "C307" H 2135 1096 50  0000 R CNN
F 1 "220nF" H 2135 1005 50  0000 R CNN
F 2 "Capacitors_ThroughHole:C_Rect_L7.2mm_W3.0mm_P5.00mm_FKS2_FKP2_MKS2_MKP2" H 2288 900 50  0001 C CNN
F 3 "~" H 2250 1050 50  0001 C CNN
	1    2250 1050
	-1   0    0    -1  
$EndComp
$Comp
L power:GND #PWR0310
U 1 1 638F1CE6
P 2650 2250
F 0 "#PWR0310" H 2650 2000 50  0001 C CNN
F 1 "GND" H 2655 2077 50  0001 C CNN
F 2 "" H 2650 2250 50  0001 C CNN
F 3 "" H 2650 2250 50  0001 C CNN
	1    2650 2250
	1    0    0    -1  
$EndComp
Wire Wire Line
	2650 2100 2650 2200
$Comp
L Device:R R303
U 1 1 638F9E48
P 1400 1200
F 0 "R303" H 1350 1250 50  0000 R CNN
F 1 "100k" H 1350 1150 50  0000 R CNN
F 2 "Resistors_SMD:R_0603_HandSoldering" V 1330 1200 50  0001 C CNN
F 3 "~" H 1400 1200 50  0001 C CNN
	1    1400 1200
	0    1    -1   0   
$EndComp
Wire Wire Line
	1200 1200 1250 1200
Wire Wire Line
	1550 1200 1600 1200
Wire Wire Line
	1600 1200 1600 1500
Wire Wire Line
	1600 1200 1600 1150
Connection ~ 1600 1200
Wire Wire Line
	1200 1500 1600 1500
Wire Wire Line
	1850 1200 1850 1250
Wire Wire Line
	2200 1700 2150 1700
Wire Wire Line
	1350 800  1350 850 
Wire Wire Line
	1800 850  1850 850 
Wire Wire Line
	2250 850  2250 900 
Wire Wire Line
	1850 900  1850 850 
Connection ~ 1850 850 
Wire Wire Line
	1850 850  2250 850 
Wire Wire Line
	2200 1250 2250 1250
Wire Wire Line
	2250 1250 2250 1200
Wire Wire Line
	2250 1250 2250 1300
Connection ~ 2250 1250
Wire Wire Line
	1900 1250 1850 1250
Wire Wire Line
	2250 850  2300 850 
Connection ~ 2250 850 
Wire Wire Line
	2150 2200 2250 2200
Wire Wire Line
	2150 2150 2150 2200
Wire Wire Line
	2550 2200 2650 2200
Connection ~ 2650 2200
Wire Wire Line
	2650 2200 2650 2250
$Comp
L Device:C C312
U 1 1 63ACD346
P 3050 1050
F 0 "C312" H 3250 1100 50  0000 R CNN
F 1 "47nF" H 3350 1000 50  0000 R CNN
F 2 "Capacitors_ThroughHole:C_Rect_L7.2mm_W2.5mm_P5.00mm_FKS2_FKP2_MKS2_MKP2" H 3088 900 50  0001 C CNN
F 3 "~" H 3050 1050 50  0001 C CNN
	1    3050 1050
	-1   0    0    -1  
$EndComp
$Comp
L Device:R R321
U 1 1 63AD35E9
P 2850 850
F 0 "R321" V 2643 850 50  0000 C CNN
F 1 "27k" V 2734 850 50  0000 C CNN
F 2 "Resistors_SMD:R_0603_HandSoldering" V 2780 850 50  0001 C CNN
F 3 "~" H 2850 850 50  0001 C CNN
	1    2850 850 
	0    1    1    0   
$EndComp
$Comp
L Device:R_POT RV304
U 1 1 63AD8F80
P 3250 1250
F 0 "RV304" H 3180 1204 50  0000 R CNN
F 1 "100k" H 3180 1295 50  0000 R CNN
F 2 "Potentiometer:Potentiometer_Alpha_RD901F-40-xxx-xxx-00D" H 3250 1250 50  0001 C CNN
F 3 "~" H 3250 1250 50  0001 C CNN
	1    3250 1250
	-1   0    0    1   
$EndComp
$Comp
L Amplifier_Operational:TL074 U301
U 3 1 63ADE61F
P 9500 950
F 0 "U301" H 9550 1200 50  0000 C CNN
F 1 "TL074" H 9600 1100 50  0000 C CNN
F 2 "Housings_SOIC:SOIC-14_3.9x8.7mm_Pitch1.27mm" H 9450 1050 50  0001 C CNN
F 3 "http://www.ti.com/lit/ds/symlink/tl071.pdf" H 9550 1150 50  0001 C CNN
	3    9500 950 
	1    0    0    -1  
$EndComp
$Comp
L Device:R R331
U 1 1 63AE4FC9
P 4150 1250
F 0 "R331" V 3943 1250 50  0000 C CNN
F 1 "270k" V 4034 1250 50  0000 C CNN
F 2 "Resistors_SMD:R_0603_HandSoldering" V 4080 1250 50  0001 C CNN
F 3 "~" H 4150 1250 50  0001 C CNN
	1    4150 1250
	0    -1   1    0   
$EndComp
Wire Wire Line
	3650 1250 3650 1050
Wire Wire Line
	3650 1050 3700 1050
Wire Wire Line
	4300 950  4350 950 
Wire Wire Line
	4350 950  4350 1250
Wire Wire Line
	4350 1250 4300 1250
$Comp
L power:GND #PWR0319
U 1 1 63AF0D51
P 3650 900
F 0 "#PWR0319" H 3650 650 50  0001 C CNN
F 1 "GND" H 3655 727 50  0001 C CNN
F 2 "" H 3650 900 50  0001 C CNN
F 3 "" H 3650 900 50  0001 C CNN
	1    3650 900 
	1    0    0    -1  
$EndComp
Wire Wire Line
	3650 900  3650 850 
Wire Wire Line
	3650 850  3700 850 
$Comp
L power:GND #PWR0317
U 1 1 63B04D7C
P 3250 1450
F 0 "#PWR0317" H 3250 1200 50  0001 C CNN
F 1 "GND" H 3255 1277 50  0001 C CNN
F 2 "" H 3250 1450 50  0001 C CNN
F 3 "" H 3250 1450 50  0001 C CNN
	1    3250 1450
	1    0    0    -1  
$EndComp
Wire Wire Line
	3250 1400 3250 1450
$Comp
L Connector:AudioJack2_SwitchT J302
U 1 1 63B33F23
P 5050 950
F 0 "J302" H 4870 883 50  0000 R CNN
F 1 "OUT_CB" H 4870 974 50  0000 R CNN
F 2 "Connectors:Cliff_FC681374V" H 5050 950 50  0001 C CNN
F 3 "~" H 5050 950 50  0001 C CNN
	1    5050 950 
	-1   0    0    1   
$EndComp
Connection ~ 4350 950 
$Comp
L power:GND #PWR0325
U 1 1 63B42078
P 4800 1100
F 0 "#PWR0325" H 4800 850 50  0001 C CNN
F 1 "GND" H 4805 927 50  0001 C CNN
F 2 "" H 4800 1100 50  0001 C CNN
F 3 "" H 4800 1100 50  0001 C CNN
	1    4800 1100
	1    0    0    -1  
$EndComp
Wire Wire Line
	4850 1050 4800 1050
Wire Wire Line
	4800 1050 4800 1100
$Comp
L Amplifier_Operational:TL074 U301
U 4 1 63B96E85
P 4000 950
F 0 "U301" H 4000 1317 50  0000 C CNN
F 1 "TL074" H 4000 1226 50  0000 C CNN
F 2 "Housings_SOIC:SOIC-14_3.9x8.7mm_Pitch1.27mm" H 3950 1050 50  0001 C CNN
F 3 "http://www.ti.com/lit/ds/symlink/tl071.pdf" H 4050 1150 50  0001 C CNN
	4    4000 950 
	1    0    0    -1  
$EndComp
$Comp
L Device:R R364
U 1 1 63B9C6DA
P 10050 950
F 0 "R364" V 9843 950 50  0000 C CNN
F 1 "1k" V 9934 950 50  0000 C CNN
F 2 "Resistors_SMD:R_0603_HandSoldering" V 9980 950 50  0001 C CNN
F 3 "~" H 10050 950 50  0001 C CNN
	1    10050 950 
	0    -1   1    0   
$EndComp
$Comp
L Device:R R328
U 1 1 63BB18ED
P 3450 1050
F 0 "R328" V 3243 1050 50  0000 C CNN
F 1 "10k" V 3334 1050 50  0000 C CNN
F 2 "Resistors_SMD:R_0603_HandSoldering" V 3380 1050 50  0001 C CNN
F 3 "~" H 3450 1050 50  0001 C CNN
	1    3450 1050
	0    -1   1    0   
$EndComp
Wire Wire Line
	3600 1050 3650 1050
Connection ~ 3650 1050
Wire Wire Line
	3250 1100 3250 1050
Wire Wire Line
	3250 1050 3300 1050
Wire Wire Line
	3650 1250 4000 1250
$Comp
L Device:R R355
U 1 1 63C0B499
P 9150 1450
F 0 "R355" H 9100 1500 50  0000 R CNN
F 1 "100k" H 9100 1400 50  0000 R CNN
F 2 "Resistors_SMD:R_0603_HandSoldering" V 9080 1450 50  0001 C CNN
F 3 "~" H 9150 1450 50  0001 C CNN
	1    9150 1450
	1    0    0    1   
$EndComp
$Comp
L Device:R R362
U 1 1 63C1188B
P 9650 1250
F 0 "R362" V 9443 1250 50  0000 C CNN
F 1 "100k" V 9534 1250 50  0000 C CNN
F 2 "Resistors_SMD:R_0603_HandSoldering" V 9580 1250 50  0001 C CNN
F 3 "~" H 9650 1250 50  0001 C CNN
	1    9650 1250
	0    -1   1    0   
$EndComp
Wire Wire Line
	9800 950  9850 950 
Wire Wire Line
	9850 950  9850 1250
Wire Wire Line
	9850 1250 9800 1250
Wire Wire Line
	9200 1050 9150 1050
Wire Wire Line
	9150 1050 9150 1250
Wire Wire Line
	9150 1250 9500 1250
Wire Wire Line
	9150 1250 9150 1300
Connection ~ 9150 1250
$Comp
L power:GND #PWR0346
U 1 1 63C23E34
P 9150 1650
F 0 "#PWR0346" H 9150 1400 50  0001 C CNN
F 1 "GND" H 9155 1477 50  0001 C CNN
F 2 "" H 9150 1650 50  0001 C CNN
F 3 "" H 9150 1650 50  0001 C CNN
	1    9150 1650
	1    0    0    -1  
$EndComp
Wire Wire Line
	9150 1600 9150 1650
$Comp
L Device:R_POT RV307
U 1 1 63C3B509
P 8650 850
F 0 "RV307" H 8581 804 50  0000 R CNN
F 1 "100k" H 8581 895 50  0000 R CNN
F 2 "Potentiometer:Potentiometer_Alpha_RD901F-40-xxx-xxx-00D" H 8650 850 50  0001 C CNN
F 3 "~" H 8650 850 50  0001 C CNN
	1    8650 850 
	1    0    0    1   
$EndComp
$Comp
L Device:R R352
U 1 1 63C3D043
P 8850 1050
F 0 "R352" H 8780 1096 50  0000 R CNN
F 1 "12k" H 8780 1005 50  0000 R CNN
F 2 "Resistors_SMD:R_0603_HandSoldering" V 8780 1050 50  0001 C CNN
F 3 "~" H 8850 1050 50  0001 C CNN
	1    8850 1050
	-1   0    0    -1  
$EndComp
Wire Wire Line
	8800 850  8850 850 
Wire Wire Line
	8850 850  8850 900 
Wire Wire Line
	8850 1200 8850 1250
Wire Wire Line
	8850 1250 8650 1250
Wire Wire Line
	8650 1250 8650 1000
$Comp
L power:GND #PWR0342
U 1 1 63C493F7
P 8650 1300
F 0 "#PWR0342" H 8650 1050 50  0001 C CNN
F 1 "GND" H 8655 1127 50  0001 C CNN
F 2 "" H 8650 1300 50  0001 C CNN
F 3 "" H 8650 1300 50  0001 C CNN
	1    8650 1300
	1    0    0    -1  
$EndComp
Wire Wire Line
	8650 1250 8650 1300
Connection ~ 8650 1250
Wire Wire Line
	8850 850  9200 850 
Connection ~ 8850 850 
Wire Wire Line
	9850 950  9900 950 
Connection ~ 9850 950 
$Comp
L Connector:AudioJack2_SwitchT J304
U 1 1 63C873B5
P 10450 950
F 0 "J304" H 10270 883 50  0000 R CNN
F 1 "OUT_MIX" H 10270 974 50  0000 R CNN
F 2 "Connectors:Cliff_FC681374V" H 10450 950 50  0001 C CNN
F 3 "~" H 10450 950 50  0001 C CNN
	1    10450 950 
	-1   0    0    1   
$EndComp
Wire Wire Line
	10250 950  10200 950 
$Comp
L power:GND #PWR0350
U 1 1 63C8E29F
P 10200 1100
F 0 "#PWR0350" H 10200 850 50  0001 C CNN
F 1 "GND" H 10205 927 50  0001 C CNN
F 2 "" H 10200 1100 50  0001 C CNN
F 3 "" H 10200 1100 50  0001 C CNN
	1    10200 1100
	1    0    0    -1  
$EndComp
Wire Wire Line
	10250 1050 10200 1050
Wire Wire Line
	10200 1050 10200 1100
NoConn ~ 10250 850 
Text HLabel 13100 9150 0    50   Input ~ 0
MIX_BUS
Wire Wire Line
	13100 9150 13350 9150
Wire Wire Line
	8650 650  8650 700 
Wire Wire Line
	4850 950  4800 950 
$Comp
L Device:R R333
U 1 1 63B2C15E
P 4650 950
F 0 "R333" V 4857 950 50  0000 C CNN
F 1 "1k" V 4766 950 50  0000 C CNN
F 2 "Resistors_SMD:R_0603_HandSoldering" V 4580 950 50  0001 C CNN
F 3 "~" H 4650 950 50  0001 C CNN
	1    4650 950 
	0    1    -1   0   
$EndComp
Wire Wire Line
	4850 850  4800 850 
Wire Wire Line
	4350 950  4500 950 
$Comp
L Device:R R335
U 1 1 63D6889E
P 5050 650
F 0 "R335" H 4980 696 50  0000 R CNN
F 1 "10k" H 4980 605 50  0000 R CNN
F 2 "Resistors_SMD:R_0603_HandSoldering" V 4980 650 50  0001 C CNN
F 3 "~" H 5050 650 50  0001 C CNN
	1    5050 650 
	0    -1   1    0   
$EndComp
$Comp
L Amplifier_Operational:TL074 U301
U 5 1 63E872C5
P 4950 6750
F 0 "U301" H 5000 7000 50  0000 C CNN
F 1 "TL074" H 5050 6900 50  0000 C CNN
F 2 "Housings_SOIC:SOIC-14_3.9x8.7mm_Pitch1.27mm" H 4900 6850 50  0001 C CNN
F 3 "http://www.ti.com/lit/ds/symlink/tl071.pdf" H 5000 6950 50  0001 C CNN
	5    4950 6750
	1    0    0    -1  
$EndComp
$Comp
L Device:C C318
U 1 1 63E892A2
P 4500 6550
F 0 "C318" H 4385 6504 50  0000 R CNN
F 1 "100nF" H 4385 6595 50  0000 R CNN
F 2 "Capacitors_SMD:C_0603_HandSoldering" H 4538 6400 50  0001 C CNN
F 3 "~" H 4500 6550 50  0001 C CNN
	1    4500 6550
	-1   0    0    1   
$EndComp
$Comp
L Device:C C319
U 1 1 63E8A959
P 4500 6950
F 0 "C319" H 4385 6904 50  0000 R CNN
F 1 "100nF" H 4385 6995 50  0000 R CNN
F 2 "Capacitors_SMD:C_0603_HandSoldering" H 4538 6800 50  0001 C CNN
F 3 "~" H 4500 6950 50  0001 C CNN
	1    4500 6950
	-1   0    0    1   
$EndComp
Wire Wire Line
	4500 6400 4500 6350
Wire Wire Line
	4500 6350 4850 6350
Wire Wire Line
	4850 6350 4850 6450
Wire Wire Line
	4500 7100 4500 7150
Wire Wire Line
	4500 7150 4850 7150
Wire Wire Line
	4850 7150 4850 7050
$Comp
L power:GND #PWR0324
U 1 1 63E9959B
P 4600 6800
F 0 "#PWR0324" H 4600 6550 50  0001 C CNN
F 1 "GND" H 4605 6627 50  0001 C CNN
F 2 "" H 4600 6800 50  0001 C CNN
F 3 "" H 4600 6800 50  0001 C CNN
	1    4600 6800
	1    0    0    -1  
$EndComp
Wire Wire Line
	4500 6700 4500 6750
Wire Wire Line
	4500 6750 4600 6750
Wire Wire Line
	4600 6750 4600 6800
Connection ~ 4500 6750
Wire Wire Line
	4500 6750 4500 6800
$Comp
L power:+12V #PWR0322
U 1 1 63EBD7F9
P 4500 6300
F 0 "#PWR0322" H 4500 6150 50  0001 C CNN
F 1 "+12V" H 4515 6473 50  0000 C CNN
F 2 "" H 4500 6300 50  0001 C CNN
F 3 "" H 4500 6300 50  0001 C CNN
	1    4500 6300
	1    0    0    -1  
$EndComp
Wire Wire Line
	4500 6300 4500 6350
Connection ~ 4500 6350
$Comp
L power:-12V #PWR0323
U 1 1 63ED7DB2
P 4500 7200
F 0 "#PWR0323" H 4500 7300 50  0001 C CNN
F 1 "-12V" H 4515 7373 50  0000 C CNN
F 2 "" H 4500 7200 50  0001 C CNN
F 3 "" H 4500 7200 50  0001 C CNN
	1    4500 7200
	-1   0    0    1   
$EndComp
Wire Wire Line
	4500 7150 4500 7200
Connection ~ 4500 7150
$Comp
L Amplifier_Operational:TL074 U302
U 2 1 63F2CCE1
P 9500 4100
F 0 "U302" H 9550 4350 50  0000 C CNN
F 1 "TL074" H 9600 4250 50  0000 C CNN
F 2 "Housings_SOIC:SOIC-14_3.9x8.7mm_Pitch1.27mm" H 9450 4200 50  0001 C CNN
F 3 "http://www.ti.com/lit/ds/symlink/tl071.pdf" H 9550 4300 50  0001 C CNN
	2    9500 4100
	1    0    0    -1  
$EndComp
$Comp
L Device:R R358
U 1 1 63F309DF
P 9350 2450
F 0 "R358" V 9143 2450 50  0000 C CNN
F 1 "820k" V 9234 2450 50  0000 C CNN
F 2 "Resistors_SMD:R_0603_HandSoldering" V 9280 2450 50  0001 C CNN
F 3 "~" H 9350 2450 50  0001 C CNN
	1    9350 2450
	0    -1   1    0   
$EndComp
$Comp
L Device:C C333
U 1 1 63F3659F
P 8950 2800
F 0 "C333" V 8698 2800 50  0000 C CNN
F 1 "22nF" V 8789 2800 50  0000 C CNN
F 2 "Capacitors_ThroughHole:C_Rect_L7.2mm_W2.5mm_P5.00mm_FKS2_FKP2_MKS2_MKP2" H 8988 2650 50  0001 C CNN
F 3 "~" H 8950 2800 50  0001 C CNN
	1    8950 2800
	0    1    1    0   
$EndComp
$Comp
L Device:C C335
U 1 1 63F38A22
P 9350 2800
F 0 "C335" V 9098 2800 50  0000 C CNN
F 1 "22nF" V 9189 2800 50  0000 C CNN
F 2 "Capacitors_ThroughHole:C_Rect_L7.2mm_W2.5mm_P5.00mm_FKS2_FKP2_MKS2_MKP2" H 9388 2650 50  0001 C CNN
F 3 "~" H 9350 2800 50  0001 C CNN
	1    9350 2800
	0    1    1    0   
$EndComp
Wire Wire Line
	9500 2800 9550 2800
Wire Wire Line
	9550 2800 9550 2450
Wire Wire Line
	9550 2150 9400 2150
Wire Wire Line
	9500 2450 9550 2450
Connection ~ 9550 2450
Wire Wire Line
	9550 2450 9550 2150
Wire Wire Line
	9200 2800 9150 2800
Wire Wire Line
	8800 2250 8750 2250
Wire Wire Line
	8750 2250 8750 2450
Wire Wire Line
	8750 2800 8800 2800
Wire Wire Line
	9200 2450 8750 2450
Connection ~ 8750 2450
Wire Wire Line
	8750 2450 8750 2800
$Comp
L Device:R R349
U 1 1 63F8CBDF
P 8350 2050
F 0 "R349" V 8143 2050 50  0000 C CNN
F 1 "220k" V 8234 2050 50  0000 C CNN
F 2 "Resistors_SMD:R_0603_HandSoldering" V 8280 2050 50  0001 C CNN
F 3 "~" H 8350 2050 50  0001 C CNN
	1    8350 2050
	0    -1   1    0   
$EndComp
$Comp
L Device:R R351
U 1 1 63F8F4FD
P 8550 2250
F 0 "R351" H 8480 2204 50  0000 R CNN
F 1 "4.7k" H 8480 2295 50  0000 R CNN
F 2 "Resistors_SMD:R_0603_HandSoldering" V 8480 2250 50  0001 C CNN
F 3 "~" H 8550 2250 50  0001 C CNN
	1    8550 2250
	1    0    0    1   
$EndComp
$Comp
L power:GND #PWR0341
U 1 1 63F92D43
P 8550 2450
F 0 "#PWR0341" H 8550 2200 50  0001 C CNN
F 1 "GND" H 8555 2277 50  0001 C CNN
F 2 "" H 8550 2450 50  0001 C CNN
F 3 "" H 8550 2450 50  0001 C CNN
	1    8550 2450
	1    0    0    -1  
$EndComp
Wire Wire Line
	8550 2400 8550 2450
Wire Wire Line
	8500 2050 8550 2050
Wire Wire Line
	8550 2050 8550 2100
Connection ~ 8550 2050
$Comp
L Device:R R356
U 1 1 6402CB87
P 9150 3000
F 0 "R356" H 9081 2954 50  0000 R CNN
F 1 "680R" H 9081 3045 50  0000 R CNN
F 2 "Resistors_SMD:R_0603_HandSoldering" V 9080 3000 50  0001 C CNN
F 3 "~" H 9150 3000 50  0001 C CNN
	1    9150 3000
	1    0    0    1   
$EndComp
Wire Wire Line
	9150 2850 9150 2800
Connection ~ 9150 2800
Wire Wire Line
	9150 2800 9100 2800
$Comp
L power:GND #PWR0347
U 1 1 640394F3
P 9150 3200
F 0 "#PWR0347" H 9150 2950 50  0001 C CNN
F 1 "GND" H 9155 3027 50  0001 C CNN
F 2 "" H 9150 3200 50  0001 C CNN
F 3 "" H 9150 3200 50  0001 C CNN
	1    9150 3200
	1    0    0    -1  
$EndComp
Wire Wire Line
	9150 3150 9150 3200
$Comp
L Device:R R360
U 1 1 6404336F
P 9550 3100
F 0 "R360" H 9480 3146 50  0000 R CNN
F 1 "180k" H 9480 3055 50  0000 R CNN
F 2 "Resistors_SMD:R_0603_HandSoldering" V 9480 3100 50  0001 C CNN
F 3 "~" H 9550 3100 50  0001 C CNN
	1    9550 3100
	-1   0    0    -1  
$EndComp
$Comp
L Device:R_POT RV306
U 1 1 64050B08
P 6700 2250
F 0 "RV306" H 6630 2204 50  0000 R CNN
F 1 "25k" H 6630 2295 50  0000 R CNN
F 2 "Potentiometer:Potentiometer_Alpha_RD901F-40-xxx-xxx-00D" H 6700 2250 50  0001 C CNN
F 3 "~" H 6700 2250 50  0001 C CNN
	1    6700 2250
	1    0    0    1   
$EndComp
$Comp
L Device:R R340
U 1 1 6405C04B
P 7050 2250
F 0 "R340" V 6843 2250 50  0000 C CNN
F 1 "33k" V 6934 2250 50  0000 C CNN
F 2 "Resistors_SMD:R_0603_HandSoldering" V 6980 2250 50  0001 C CNN
F 3 "~" H 7050 2250 50  0001 C CNN
	1    7050 2250
	0    -1   1    0   
$EndComp
Wire Wire Line
	6850 2250 6900 2250
$Comp
L Device:D D304
U 1 1 64076F92
P 6700 2600
F 0 "D304" V 6746 2520 50  0000 R CNN
F 1 "D" V 6655 2520 50  0000 R CNN
F 2 "Diodes_SMD:D_MiniMELF" H 6700 2600 50  0001 C CNN
F 3 "~" H 6700 2600 50  0001 C CNN
	1    6700 2600
	0    -1   -1   0   
$EndComp
Wire Wire Line
	6700 2400 6700 2450
$Comp
L power:GND #PWR0330
U 1 1 64082C35
P 6700 2800
F 0 "#PWR0330" H 6700 2550 50  0001 C CNN
F 1 "GND" H 6705 2627 50  0001 C CNN
F 2 "" H 6700 2800 50  0001 C CNN
F 3 "" H 6700 2800 50  0001 C CNN
	1    6700 2800
	1    0    0    -1  
$EndComp
Wire Wire Line
	6700 2750 6700 2800
Wire Wire Line
	6550 2050 6700 2050
Wire Wire Line
	6700 2050 6700 2100
$Comp
L power:+12V #PWR0334
U 1 1 640BED26
P 7100 2550
F 0 "#PWR0334" H 7100 2400 50  0001 C CNN
F 1 "+12V" H 7115 2723 50  0000 C CNN
F 2 "" H 7100 2550 50  0001 C CNN
F 3 "" H 7100 2550 50  0001 C CNN
	1    7100 2550
	1    0    0    -1  
$EndComp
$Comp
L Device:CP C326
U 1 1 640CE394
P 7600 2800
F 0 "C326" H 7718 2846 50  0000 L CNN
F 1 "1µF" H 7718 2755 50  0000 L CNN
F 2 "Capacitors_ThroughHole:CP_Radial_D4.0mm_P1.50mm" H 7638 2650 50  0001 C CNN
F 3 "~" H 7600 2800 50  0001 C CNN
	1    7600 2800
	1    0    0    -1  
$EndComp
$Comp
L power:GND #PWR0336
U 1 1 640CEA47
P 7600 3000
F 0 "#PWR0336" H 7600 2750 50  0001 C CNN
F 1 "GND" H 7605 2827 50  0001 C CNN
F 2 "" H 7600 3000 50  0001 C CNN
F 3 "" H 7600 3000 50  0001 C CNN
	1    7600 3000
	1    0    0    -1  
$EndComp
Wire Wire Line
	7600 2950 7600 3000
$Comp
L Device:R R344
U 1 1 640DBCCE
P 7800 2600
F 0 "R344" V 7593 2600 50  0000 C CNN
F 1 "10k" V 7684 2600 50  0000 C CNN
F 2 "Resistors_SMD:R_0603_HandSoldering" V 7730 2600 50  0001 C CNN
F 3 "~" H 7800 2600 50  0001 C CNN
	1    7800 2600
	0    -1   1    0   
$EndComp
Wire Wire Line
	7550 2600 7600 2600
Wire Wire Line
	7600 2600 7650 2600
Connection ~ 7600 2600
Wire Wire Line
	7600 2600 7600 2650
$Comp
L Device:C C328
U 1 1 640F5BC1
P 8000 2800
F 0 "C328" H 7885 2754 50  0000 R CNN
F 1 "100nF" H 7885 2845 50  0000 R CNN
F 2 "Capacitors_ThroughHole:C_Rect_L7.2mm_W2.5mm_P5.00mm_FKS2_FKP2_MKS2_MKP2" H 8038 2650 50  0001 C CNN
F 3 "~" H 8000 2800 50  0001 C CNN
	1    8000 2800
	-1   0    0    1   
$EndComp
$Comp
L power:GND #PWR0338
U 1 1 640F7404
P 8000 3000
F 0 "#PWR0338" H 8000 2750 50  0001 C CNN
F 1 "GND" H 8005 2827 50  0001 C CNN
F 2 "" H 8000 3000 50  0001 C CNN
F 3 "" H 8000 3000 50  0001 C CNN
	1    8000 3000
	1    0    0    -1  
$EndComp
Wire Wire Line
	8000 2950 8000 3000
Wire Wire Line
	7950 2600 8000 2600
Wire Wire Line
	8000 2600 8000 2650
$Comp
L Device:R R350
U 1 1 641637AB
P 8400 3050
F 0 "R350" H 8330 3004 50  0000 R CNN
F 1 "18k" H 8330 3095 50  0000 R CNN
F 2 "Resistors_SMD:R_0603_HandSoldering" V 8330 3050 50  0001 C CNN
F 3 "~" H 8400 3050 50  0001 C CNN
	1    8400 3050
	-1   0    0    1   
$EndComp
Wire Wire Line
	8000 2600 8400 2600
Wire Wire Line
	8400 2600 8400 2900
Connection ~ 8000 2600
$Comp
L Device:C C324
U 1 1 64190FA0
P 7150 3650
F 0 "C324" V 6898 3650 50  0000 C CNN
F 1 "10nF" V 6989 3650 50  0000 C CNN
F 2 "Capacitors_ThroughHole:C_Rect_L7.2mm_W2.5mm_P5.00mm_FKS2_FKP2_MKS2_MKP2" H 7188 3500 50  0001 C CNN
F 3 "~" H 7150 3650 50  0001 C CNN
	1    7150 3650
	0    1    1    0   
$EndComp
Wire Wire Line
	7000 3650 6950 3650
$Comp
L Device:R R343
U 1 1 64190FAD
P 7350 3450
F 0 "R343" H 7280 3496 50  0000 R CNN
F 1 "1M" H 7280 3405 50  0000 R CNN
F 2 "Resistors_SMD:R_0603_HandSoldering" V 7280 3450 50  0001 C CNN
F 3 "~" H 7350 3450 50  0001 C CNN
	1    7350 3450
	-1   0    0    -1  
$EndComp
Wire Wire Line
	7300 3650 7350 3650
Wire Wire Line
	7350 3650 7350 3600
Connection ~ 7350 3650
Wire Wire Line
	7350 3650 7400 3650
$Comp
L Device:R R347
U 1 1 64190FB7
P 7950 3900
F 0 "R347" V 7850 3900 50  0000 C CNN
F 1 "100R" V 7750 3900 50  0000 C CNN
F 2 "Resistors_SMD:R_0603_HandSoldering" V 7880 3900 50  0001 C CNN
F 3 "~" H 7950 3900 50  0001 C CNN
	1    7950 3900
	0    -1   -1   0   
$EndComp
$Comp
L Device:D D306
U 1 1 64190FBD
P 7950 3400
F 0 "D306" H 7950 3617 50  0000 C CNN
F 1 "D" H 7950 3526 50  0000 C CNN
F 2 "Diodes_SMD:D_MiniMELF" H 7950 3400 50  0001 C CNN
F 3 "~" H 7950 3400 50  0001 C CNN
	1    7950 3400
	1    0    0    -1  
$EndComp
Wire Wire Line
	7700 3400 7700 3450
Wire Wire Line
	7350 3250 7350 3300
$Comp
L Device:C C330
U 1 1 64190FC5
P 8200 3700
F 0 "C330" H 8085 3654 50  0000 R CNN
F 1 "n.p." H 8085 3745 50  0000 R CNN
F 2 "Capacitors_ThroughHole:C_Rect_L7.2mm_W2.5mm_P5.00mm_FKS2_FKP2_MKS2_MKP2" H 8238 3550 50  0001 C CNN
F 3 "~" H 8200 3700 50  0001 C CNN
	1    8200 3700
	-1   0    0    1   
$EndComp
Wire Wire Line
	8100 3400 8200 3400
Wire Wire Line
	8200 3400 8200 3550
Connection ~ 8200 3400
$Comp
L power:GND #PWR0340
U 1 1 64190FCE
P 8200 3950
F 0 "#PWR0340" H 8200 3700 50  0001 C CNN
F 1 "GND" H 8205 3777 50  0001 C CNN
F 2 "" H 8200 3950 50  0001 C CNN
F 3 "" H 8200 3950 50  0001 C CNN
	1    8200 3950
	1    0    0    -1  
$EndComp
Wire Wire Line
	8200 3850 8200 3900
Wire Wire Line
	7800 3400 7700 3400
Wire Wire Line
	7700 3900 7800 3900
Wire Wire Line
	7700 3850 7700 3900
Wire Wire Line
	8100 3900 8200 3900
Connection ~ 8200 3900
Wire Wire Line
	8200 3900 8200 3950
$Comp
L power:+12V #PWR0335
U 1 1 6419F398
P 7350 3250
F 0 "#PWR0335" H 7350 3100 50  0001 C CNN
F 1 "+12V" H 7365 3423 50  0000 C CNN
F 2 "" H 7350 3250 50  0001 C CNN
F 3 "" H 7350 3250 50  0001 C CNN
	1    7350 3250
	1    0    0    -1  
$EndComp
$Comp
L Device:R R337
U 1 1 641A149D
P 6750 3650
F 0 "R337" V 6543 3650 50  0000 C CNN
F 1 "33k" V 6634 3650 50  0000 C CNN
F 2 "Resistors_SMD:R_0603_HandSoldering" V 6680 3650 50  0001 C CNN
F 3 "~" H 6750 3650 50  0001 C CNN
	1    6750 3650
	0    -1   1    0   
$EndComp
$Comp
L Device:C C322
U 1 1 641A1843
P 6950 3850
F 0 "C322" H 6835 3804 50  0000 R CNN
F 1 "1nF" H 6835 3895 50  0000 R CNN
F 2 "Capacitors_ThroughHole:C_Rect_L7.2mm_W2.5mm_P5.00mm_FKS2_FKP2_MKS2_MKP2" H 6988 3700 50  0001 C CNN
F 3 "~" H 6950 3850 50  0001 C CNN
	1    6950 3850
	-1   0    0    1   
$EndComp
Wire Wire Line
	6900 3650 6950 3650
Wire Wire Line
	6950 3650 6950 3700
$Comp
L power:GND #PWR0333
U 1 1 641AF4EE
P 6950 4050
F 0 "#PWR0333" H 6950 3800 50  0001 C CNN
F 1 "GND" H 6955 3877 50  0001 C CNN
F 2 "" H 6950 4050 50  0001 C CNN
F 3 "" H 6950 4050 50  0001 C CNN
	1    6950 4050
	1    0    0    -1  
$EndComp
Wire Wire Line
	6950 4000 6950 4050
Connection ~ 6950 3650
Wire Wire Line
	6550 3650 6600 3650
Wire Wire Line
	8400 3200 8400 3400
Wire Wire Line
	8200 3400 8400 3400
Wire Wire Line
	8450 3400 8400 3400
Connection ~ 8400 3400
$Comp
L Device:C C332
U 1 1 6423396C
P 8600 3400
F 0 "C332" V 8348 3400 50  0000 C CNN
F 1 "10nF" V 8439 3400 50  0000 C CNN
F 2 "Capacitors_ThroughHole:C_Rect_L7.2mm_W2.5mm_P5.00mm_FKS2_FKP2_MKS2_MKP2" H 8638 3250 50  0001 C CNN
F 3 "~" H 8600 3400 50  0001 C CNN
	1    8600 3400
	0    1    1    0   
$EndComp
$Comp
L Device:R R354
U 1 1 6428794F
P 8950 3400
F 0 "R354" V 9157 3400 50  0000 C CNN
F 1 "27k" V 9066 3400 50  0000 C CNN
F 2 "Resistors_SMD:R_0603_HandSoldering" V 8880 3400 50  0001 C CNN
F 3 "~" H 8950 3400 50  0001 C CNN
	1    8950 3400
	0    1    -1   0   
$EndComp
Wire Wire Line
	8750 3400 8800 3400
$Comp
L Device:R_POT RV309
U 1 1 642CCAD6
P 9350 3600
F 0 "RV309" V 9235 3600 50  0000 C CNN
F 1 "100k" V 9144 3600 50  0000 C CNN
F 2 "Potentiometer:Potentiometer_Alpha_RD901F-40-xxx-xxx-00D" H 9350 3600 50  0001 C CNN
F 3 "~" H 9350 3600 50  0001 C CNN
	1    9350 3600
	0    1    -1   0   
$EndComp
$Comp
L power:GND #PWR0349
U 1 1 642DF5BB
P 9550 3650
F 0 "#PWR0349" H 9550 3400 50  0001 C CNN
F 1 "GND" H 9555 3477 50  0001 C CNN
F 2 "" H 9550 3650 50  0001 C CNN
F 3 "" H 9550 3650 50  0001 C CNN
	1    9550 3650
	1    0    0    -1  
$EndComp
Wire Wire Line
	9550 3600 9550 3650
$Comp
L Device:R R363
U 1 1 64302BFB
P 9650 4400
F 0 "R363" V 9443 4400 50  0000 C CNN
F 1 "220k" V 9534 4400 50  0000 C CNN
F 2 "Resistors_SMD:R_0603_HandSoldering" V 9580 4400 50  0001 C CNN
F 3 "~" H 9650 4400 50  0001 C CNN
	1    9650 4400
	0    -1   1    0   
$EndComp
Wire Wire Line
	9150 4400 9150 4200
Wire Wire Line
	9150 4200 9200 4200
$Comp
L power:GND #PWR0344
U 1 1 64302C03
P 9050 4050
F 0 "#PWR0344" H 9050 3800 50  0001 C CNN
F 1 "GND" H 9055 3877 50  0001 C CNN
F 2 "" H 9050 4050 50  0001 C CNN
F 3 "" H 9050 4050 50  0001 C CNN
	1    9050 4050
	1    0    0    -1  
$EndComp
Wire Wire Line
	9050 4050 9050 4000
Wire Wire Line
	9050 4000 9200 4000
$Comp
L Device:R R357
U 1 1 64302C0B
P 9150 3800
F 0 "R357" H 9080 3754 50  0000 R CNN
F 1 "10k" H 9080 3845 50  0000 R CNN
F 2 "Resistors_SMD:R_0603_HandSoldering" V 9080 3800 50  0001 C CNN
F 3 "~" H 9150 3800 50  0001 C CNN
	1    9150 3800
	1    0    0    1   
$EndComp
Wire Wire Line
	9150 3950 9150 4200
Connection ~ 9150 4200
Wire Wire Line
	9150 4400 9500 4400
Wire Wire Line
	9800 4100 9850 4100
Wire Wire Line
	9850 4100 9850 4400
Wire Wire Line
	9850 4400 9800 4400
$Comp
L Connector:AudioJack2_SwitchT J305
U 1 1 6433EFAC
P 10450 4100
F 0 "J305" H 10270 4033 50  0000 R CNN
F 1 "OUT_SNARE" H 10270 4124 50  0000 R CNN
F 2 "Connectors:Cliff_FC681374V" H 10450 4100 50  0001 C CNN
F 3 "~" H 10450 4100 50  0001 C CNN
	1    10450 4100
	-1   0    0    1   
$EndComp
$Comp
L power:GND #PWR0351
U 1 1 6433EFB2
P 10200 4250
F 0 "#PWR0351" H 10200 4000 50  0001 C CNN
F 1 "GND" H 10205 4077 50  0001 C CNN
F 2 "" H 10200 4250 50  0001 C CNN
F 3 "" H 10200 4250 50  0001 C CNN
	1    10200 4250
	1    0    0    -1  
$EndComp
Wire Wire Line
	10250 4200 10200 4200
Wire Wire Line
	10200 4200 10200 4250
Wire Wire Line
	10250 4100 10200 4100
$Comp
L Device:R R365
U 1 1 6433EFBB
P 10050 4100
F 0 "R365" V 10257 4100 50  0000 C CNN
F 1 "1k" V 10166 4100 50  0000 C CNN
F 2 "Resistors_SMD:R_0603_HandSoldering" V 9980 4100 50  0001 C CNN
F 3 "~" H 10050 4100 50  0001 C CNN
	1    10050 4100
	0    1    -1   0   
$EndComp
Wire Wire Line
	10250 4000 10200 4000
$Comp
L Device:R R367
U 1 1 6433EFC2
P 10450 3800
F 0 "R367" H 10380 3846 50  0000 R CNN
F 1 "10k" H 10380 3755 50  0000 R CNN
F 2 "Resistors_SMD:R_0603_HandSoldering" V 10380 3800 50  0001 C CNN
F 3 "~" H 10450 3800 50  0001 C CNN
	1    10450 3800
	0    -1   1    0   
$EndComp
Wire Wire Line
	9900 4100 9850 4100
Connection ~ 9850 4100
Wire Wire Line
	6700 2050 8200 2050
Connection ~ 6700 2050
Wire Wire Line
	8550 2050 8750 2050
Wire Wire Line
	8750 2050 8750 1800
Wire Wire Line
	8750 1800 6550 1800
Connection ~ 8750 2050
Wire Wire Line
	8750 2050 8800 2050
Wire Wire Line
	7100 2550 7100 2600
Wire Wire Line
	7100 2600 7150 2600
Wire Wire Line
	7350 1950 7350 2250
Connection ~ 7350 2250
Wire Wire Line
	7350 2250 7350 2300
Wire Wire Line
	6550 1950 7350 1950
Wire Wire Line
	7200 2250 7350 2250
Wire Wire Line
	9550 3400 9550 3250
Wire Wire Line
	9550 2950 9550 2800
Connection ~ 9550 2800
Wire Wire Line
	9150 3650 9150 3600
Wire Wire Line
	9150 3600 9200 3600
Wire Wire Line
	9500 3600 9550 3600
$Comp
L Device:C C323
U 1 1 648115D4
P 7100 6150
F 0 "C323" V 6848 6150 50  0000 C CNN
F 1 "47nF" V 6939 6150 50  0000 C CNN
F 2 "Capacitors_ThroughHole:C_Rect_L7.2mm_W2.5mm_P5.00mm_FKS2_FKP2_MKS2_MKP2" H 7138 6000 50  0001 C CNN
F 3 "~" H 7100 6150 50  0001 C CNN
	1    7100 6150
	0    1    1    0   
$EndComp
Wire Wire Line
	6950 6150 6900 6150
Wire Wire Line
	7250 6150 7300 6150
$Comp
L Device:R R346
U 1 1 648115EB
P 7900 6200
F 0 "R346" V 7800 6200 50  0000 C CNN
F 1 "100R" V 7700 6200 50  0000 C CNN
F 2 "Resistors_SMD:R_0603_HandSoldering" V 7830 6200 50  0001 C CNN
F 3 "~" H 7900 6200 50  0001 C CNN
	1    7900 6200
	0    -1   -1   0   
$EndComp
Wire Wire Line
	7650 5700 7650 5750
Wire Wire Line
	8000 5700 8050 5700
Wire Wire Line
	8150 5700 8150 5800
$Comp
L Device:R R345
U 1 1 64811608
P 7850 4850
F 0 "R345" V 7643 4850 50  0000 C CNN
F 1 "18k" V 7734 4850 50  0000 C CNN
F 2 "Resistors_SMD:R_0603_HandSoldering" V 7780 4850 50  0001 C CNN
F 3 "~" H 7850 4850 50  0001 C CNN
	1    7850 4850
	0    1    1    0   
$EndComp
Wire Wire Line
	6700 4850 6750 4850
$Comp
L power:+12V #PWR0331
U 1 1 6481160F
P 6700 4800
F 0 "#PWR0331" H 6700 4650 50  0001 C CNN
F 1 "+12V" H 6715 4973 50  0000 C CNN
F 2 "" H 6700 4800 50  0001 C CNN
F 3 "" H 6700 4800 50  0001 C CNN
	1    6700 4800
	1    0    0    -1  
$EndComp
$Comp
L power:GND #PWR0337
U 1 1 64811615
P 7600 5300
F 0 "#PWR0337" H 7600 5050 50  0001 C CNN
F 1 "GND" H 7605 5127 50  0001 C CNN
F 2 "" H 7600 5300 50  0001 C CNN
F 3 "" H 7600 5300 50  0001 C CNN
	1    7600 5300
	-1   0    0    -1  
$EndComp
$Comp
L Device:R R342
U 1 1 64811621
P 7200 5050
F 0 "R342" H 7130 5004 50  0000 R CNN
F 1 "6.8k" H 7130 5095 50  0000 R CNN
F 2 "Resistors_SMD:R_0603_HandSoldering" V 7130 5050 50  0001 C CNN
F 3 "~" H 7200 5050 50  0001 C CNN
	1    7200 5050
	-1   0    0    1   
$EndComp
$Comp
L Device:C C327
U 1 1 64811627
P 7600 5050
F 0 "C327" H 7485 5096 50  0000 R CNN
F 1 "150nF" H 7485 5005 50  0000 R CNN
F 2 "Capacitors_ThroughHole:C_Rect_L7.2mm_W3.0mm_P5.00mm_FKS2_FKP2_MKS2_MKP2" H 7638 4900 50  0001 C CNN
F 3 "~" H 7600 5050 50  0001 C CNN
	1    7600 5050
	-1   0    0    -1  
$EndComp
$Comp
L power:GND #PWR0339
U 1 1 6481162D
P 8150 6250
F 0 "#PWR0339" H 8150 6000 50  0001 C CNN
F 1 "GND" H 8155 6077 50  0001 C CNN
F 2 "" H 8150 6250 50  0001 C CNN
F 3 "" H 8150 6250 50  0001 C CNN
	1    8150 6250
	1    0    0    -1  
$EndComp
Wire Wire Line
	8150 6100 8150 6200
$Comp
L Device:R R338
U 1 1 64811634
P 6750 5200
F 0 "R338" H 6700 5250 50  0000 R CNN
F 1 "91k" H 6700 5150 50  0000 R CNN
F 2 "Resistors_SMD:R_0603_HandSoldering" V 6680 5200 50  0001 C CNN
F 3 "~" H 6750 5200 50  0001 C CNN
	1    6750 5200
	0    1    -1   0   
$EndComp
Wire Wire Line
	6550 5200 6600 5200
Wire Wire Line
	6900 5200 6950 5200
Wire Wire Line
	6950 5200 6950 5500
Wire Wire Line
	6950 5200 6950 5150
Connection ~ 6950 5200
Wire Wire Line
	6550 5500 6950 5500
Wire Wire Line
	7200 5200 7200 5250
Wire Wire Line
	6700 4800 6700 4850
Wire Wire Line
	7150 4850 7200 4850
Wire Wire Line
	7600 4850 7600 4900
Wire Wire Line
	7200 4900 7200 4850
Connection ~ 7200 4850
Wire Wire Line
	7200 4850 7600 4850
Wire Wire Line
	7550 5250 7600 5250
Wire Wire Line
	7600 5250 7600 5200
Wire Wire Line
	7600 5250 7600 5300
Connection ~ 7600 5250
Wire Wire Line
	7250 5250 7200 5250
Connection ~ 7600 4850
Wire Wire Line
	8150 5700 8050 5700
Wire Wire Line
	7650 6200 7750 6200
Wire Wire Line
	7650 6150 7650 6200
Wire Wire Line
	8050 6200 8150 6200
Connection ~ 8150 6200
Wire Wire Line
	8150 6200 8150 6250
Connection ~ 8050 5700
$Comp
L Device:CP C325
U 1 1 64829761
P 7400 5250
F 0 "C325" V 7250 5250 50  0000 C CNN
F 1 "2.2µF" V 7150 5250 50  0000 C CNN
F 2 "Capacitors_ThroughHole:CP_Radial_D4.0mm_P1.50mm" H 7438 5100 50  0001 C CNN
F 3 "~" H 7400 5250 50  0001 C CNN
	1    7400 5250
	0    -1   -1   0   
$EndComp
$Comp
L Device:R R339
U 1 1 64834B24
P 6750 6150
F 0 "R339" V 6543 6150 50  0000 C CNN
F 1 "33k" V 6634 6150 50  0000 C CNN
F 2 "Resistors_SMD:R_0603_HandSoldering" V 6680 6150 50  0001 C CNN
F 3 "~" H 6750 6150 50  0001 C CNN
	1    6750 6150
	0    -1   1    0   
$EndComp
Wire Wire Line
	6550 6150 6600 6150
Wire Wire Line
	7600 4850 7700 4850
$Comp
L Connector:AudioJack2_SwitchT J306
U 1 1 64BB2490
P 10450 4950
F 0 "J306" H 10270 4883 50  0000 R CNN
F 1 "OUT_CLAP" H 10270 4974 50  0000 R CNN
F 2 "Connectors:Cliff_FC681374V" H 10450 4950 50  0001 C CNN
F 3 "~" H 10450 4950 50  0001 C CNN
	1    10450 4950
	-1   0    0    1   
$EndComp
$Comp
L power:GND #PWR0352
U 1 1 64BB2496
P 10200 5100
F 0 "#PWR0352" H 10200 4850 50  0001 C CNN
F 1 "GND" H 10205 4927 50  0001 C CNN
F 2 "" H 10200 5100 50  0001 C CNN
F 3 "" H 10200 5100 50  0001 C CNN
	1    10200 5100
	1    0    0    -1  
$EndComp
Wire Wire Line
	10250 5050 10200 5050
Wire Wire Line
	10200 5050 10200 5100
$Comp
L Device:R R366
U 1 1 64BB249F
P 10050 4950
F 0 "R366" V 9843 4950 50  0000 C CNN
F 1 "1k" V 9934 4950 50  0000 C CNN
F 2 "Resistors_SMD:R_0603_HandSoldering" V 9980 4950 50  0001 C CNN
F 3 "~" H 10050 4950 50  0001 C CNN
	1    10050 4950
	0    -1   1    0   
$EndComp
$Comp
L Device:R R348
U 1 1 648EE8B5
P 8250 4850
F 0 "R348" V 8457 4850 50  0000 C CNN
F 1 "27k" V 8366 4850 50  0000 C CNN
F 2 "Resistors_SMD:R_0603_HandSoldering" V 8180 4850 50  0001 C CNN
F 3 "~" H 8250 4850 50  0001 C CNN
	1    8250 4850
	0    -1   -1   0   
$EndComp
$Comp
L Device:C C331
U 1 1 6481165F
P 8450 5050
F 0 "C331" H 8550 5050 50  0000 L CNN
F 1 "47nF" H 8550 5000 50  0000 L TNN
F 2 "Capacitors_ThroughHole:C_Rect_L7.2mm_W2.5mm_P5.00mm_FKS2_FKP2_MKS2_MKP2" H 8488 4900 50  0001 C CNN
F 3 "~" H 8450 5050 50  0001 C CNN
	1    8450 5050
	-1   0    0    -1  
$EndComp
Connection ~ 9850 5250
Wire Wire Line
	9850 5600 9850 5250
Wire Wire Line
	9850 4950 9850 5250
Wire Wire Line
	9050 4850 9100 4850
Wire Wire Line
	9050 4900 9050 4850
$Comp
L power:GND #PWR0345
U 1 1 64A2B5D6
P 9050 4900
F 0 "#PWR0345" H 9050 4650 50  0001 C CNN
F 1 "GND" H 9055 4727 50  0001 C CNN
F 2 "" H 9050 4900 50  0001 C CNN
F 3 "" H 9050 4900 50  0001 C CNN
	1    9050 4900
	1    0    0    -1  
$EndComp
Wire Wire Line
	9450 5950 9450 6000
$Comp
L power:GND #PWR0348
U 1 1 649FAD07
P 9450 6000
F 0 "#PWR0348" H 9450 5750 50  0001 C CNN
F 1 "GND" H 9455 5827 50  0001 C CNN
F 2 "" H 9450 6000 50  0001 C CNN
F 3 "" H 9450 6000 50  0001 C CNN
	1    9450 6000
	1    0    0    -1  
$EndComp
Wire Wire Line
	9450 5600 9500 5600
Connection ~ 9450 5600
Wire Wire Line
	9450 5600 9450 5650
Wire Wire Line
	9400 5600 9450 5600
$Comp
L Device:R R359
U 1 1 649CBA98
P 9450 5800
F 0 "R359" H 9380 5846 50  0000 R CNN
F 1 "18k" H 9380 5755 50  0000 R CNN
F 2 "Resistors_SMD:R_0603_HandSoldering" V 9380 5800 50  0001 C CNN
F 3 "~" H 9450 5800 50  0001 C CNN
	1    9450 5800
	1    0    0    -1  
$EndComp
Connection ~ 9050 5250
Wire Wire Line
	9050 5600 9100 5600
Wire Wire Line
	9050 5250 9050 5600
Wire Wire Line
	9850 5600 9800 5600
$Comp
L Device:C C336
U 1 1 6498688E
P 9650 5600
F 0 "C336" V 9398 5600 50  0000 C CNN
F 1 "1nF" V 9489 5600 50  0000 C CNN
F 2 "Capacitors_ThroughHole:C_Rect_L7.2mm_W2.5mm_P5.00mm_FKS2_FKP2_MKS2_MKP2" H 9688 5450 50  0001 C CNN
F 3 "~" H 9650 5600 50  0001 C CNN
	1    9650 5600
	0    1    1    0   
$EndComp
$Comp
L Device:C C334
U 1 1 64983E40
P 9250 5600
F 0 "C334" V 8998 5600 50  0000 C CNN
F 1 "1nF" V 9089 5600 50  0000 C CNN
F 2 "Capacitors_ThroughHole:C_Rect_L7.2mm_W2.5mm_P5.00mm_FKS2_FKP2_MKS2_MKP2" H 9288 5450 50  0001 C CNN
F 3 "~" H 9250 5600 50  0001 C CNN
	1    9250 5600
	0    1    1    0   
$EndComp
Wire Wire Line
	9050 5250 9400 5250
Wire Wire Line
	9050 5050 9050 5250
Wire Wire Line
	9100 5050 9050 5050
Wire Wire Line
	9850 5250 9700 5250
Wire Wire Line
	9700 4950 9850 4950
$Comp
L Device:R R361
U 1 1 64953C1D
P 9550 5250
F 0 "R361" V 9343 5250 50  0000 C CNN
F 1 "330k" V 9434 5250 50  0000 C CNN
F 2 "Resistors_SMD:R_0603_HandSoldering" V 9480 5250 50  0001 C CNN
F 3 "~" H 9550 5250 50  0001 C CNN
	1    9550 5250
	0    -1   1    0   
$EndComp
Connection ~ 9050 5050
Wire Wire Line
	9000 5050 9050 5050
$Comp
L Device:R R353
U 1 1 6494DC3E
P 8850 5050
F 0 "R353" V 8643 5050 50  0000 C CNN
F 1 "10k" V 8734 5050 50  0000 C CNN
F 2 "Resistors_SMD:R_0603_HandSoldering" V 8780 5050 50  0001 C CNN
F 3 "~" H 8850 5050 50  0001 C CNN
	1    8850 5050
	0    -1   1    0   
$EndComp
Wire Wire Line
	8650 5400 8650 5450
Wire Wire Line
	8650 5050 8700 5050
Wire Wire Line
	8650 5100 8650 5050
$Comp
L power:GND #PWR0343
U 1 1 64908D09
P 8650 5450
F 0 "#PWR0343" H 8650 5200 50  0001 C CNN
F 1 "GND" H 8655 5277 50  0001 C CNN
F 2 "" H 8650 5450 50  0001 C CNN
F 3 "" H 8650 5450 50  0001 C CNN
	1    8650 5450
	1    0    0    -1  
$EndComp
$Comp
L Device:R_POT RV308
U 1 1 64907C86
P 8650 5250
F 0 "RV308" H 8580 5204 50  0000 R CNN
F 1 "100k" H 8580 5295 50  0000 R CNN
F 2 "Potentiometer:Potentiometer_Alpha_RD901F-40-xxx-xxx-00D" H 8650 5250 50  0001 C CNN
F 3 "~" H 8650 5250 50  0001 C CNN
	1    8650 5250
	-1   0    0    1   
$EndComp
Wire Wire Line
	8000 4850 8050 4850
Wire Wire Line
	8050 4850 8050 5700
Wire Wire Line
	8100 4850 8050 4850
Connection ~ 8050 4850
Wire Wire Line
	8400 4850 8450 4850
Wire Wire Line
	8450 4850 8450 4900
Wire Wire Line
	8450 5200 8450 5250
Wire Wire Line
	8450 5250 8500 5250
Wire Wire Line
	9850 5600 9850 5650
Connection ~ 9850 5600
Wire Wire Line
	10200 4850 10250 4850
Wire Wire Line
	7700 5700 7650 5700
$Comp
L Device:D D305
U 1 1 648115F1
P 7850 5700
F 0 "D305" H 7850 5917 50  0000 C CNN
F 1 "D" H 7850 5826 50  0000 C CNN
F 2 "Diodes_SMD:D_MiniMELF" H 7850 5700 50  0001 C CNN
F 3 "~" H 7850 5700 50  0001 C CNN
	1    7850 5700
	1    0    0    -1  
$EndComp
$Comp
L power:+12V #PWR0332
U 1 1 648115F8
P 6750 5750
F 0 "#PWR0332" H 6750 5600 50  0001 C CNN
F 1 "+12V" H 6765 5923 50  0000 C CNN
F 2 "" H 6750 5750 50  0001 C CNN
F 3 "" H 6750 5750 50  0001 C CNN
	1    6750 5750
	1    0    0    -1  
$EndComp
Wire Wire Line
	7300 5950 7300 6150
Connection ~ 7300 5950
Wire Wire Line
	7300 5950 7350 5950
$Comp
L Device:R R341
U 1 1 648115E1
P 7100 5800
F 0 "R341" H 7030 5846 50  0000 R CNN
F 1 "1M" H 7030 5755 50  0000 R CNN
F 2 "Resistors_SMD:R_0603_HandSoldering" V 7030 5800 50  0001 C CNN
F 3 "~" H 7100 5800 50  0001 C CNN
	1    7100 5800
	0    -1   1    0   
$EndComp
Wire Wire Line
	6750 5750 6750 5800
Wire Wire Line
	6750 5800 6950 5800
Wire Wire Line
	7250 5800 7300 5800
Wire Wire Line
	7300 5800 7300 5950
$Comp
L Device:C C329
U 1 1 648115FF
P 8150 5950
F 0 "C329" H 8035 5904 50  0000 R CNN
F 1 "100pF n.p." H 8035 5995 50  0000 R CNN
F 2 "Capacitors_ThroughHole:C_Rect_L7.2mm_W2.5mm_P5.00mm_FKS2_FKP2_MKS2_MKP2" H 8188 5800 50  0001 C CNN
F 3 "~" H 8150 5950 50  0001 C CNN
	1    8150 5950
	-1   0    0    1   
$EndComp
$Comp
L Device:C C303
U 1 1 6527B195
P 1700 4150
F 0 "C303" V 1448 4150 50  0000 C CNN
F 1 "47nF" V 1539 4150 50  0000 C CNN
F 2 "Capacitors_ThroughHole:C_Rect_L7.2mm_W2.5mm_P5.00mm_FKS2_FKP2_MKS2_MKP2" H 1738 4000 50  0001 C CNN
F 3 "~" H 1700 4150 50  0001 C CNN
	1    1700 4150
	0    1    1    0   
$EndComp
Wire Wire Line
	1550 4150 1500 4150
Wire Wire Line
	1850 4150 1900 4150
$Comp
L Device:R R318
U 1 1 6527B1A3
P 2450 4200
F 0 "R318" V 2350 4200 50  0000 C CNN
F 1 "100R" V 2250 4200 50  0000 C CNN
F 2 "Resistors_SMD:R_0603_HandSoldering" V 2380 4200 50  0001 C CNN
F 3 "~" H 2450 4200 50  0001 C CNN
	1    2450 4200
	0    -1   -1   0   
$EndComp
Wire Wire Line
	2250 3550 2250 3750
$Comp
L Device:R R317
U 1 1 6527B1AC
P 2450 2850
F 0 "R317" V 2657 2850 50  0000 C CNN
F 1 "18k" V 2566 2850 50  0000 C CNN
F 2 "Resistors_SMD:R_0603_HandSoldering" V 2380 2850 50  0001 C CNN
F 3 "~" H 2450 2850 50  0001 C CNN
	1    2450 2850
	0    -1   -1   0   
$EndComp
Wire Wire Line
	1750 2850 1800 2850
$Comp
L power:+12V #PWR0304
U 1 1 6527B1B3
P 1750 2800
F 0 "#PWR0304" H 1750 2650 50  0001 C CNN
F 1 "+12V" H 1765 2973 50  0000 C CNN
F 2 "" H 1750 2800 50  0001 C CNN
F 3 "" H 1750 2800 50  0001 C CNN
	1    1750 2800
	1    0    0    -1  
$EndComp
$Comp
L power:GND #PWR0311
U 1 1 6527B1CB
P 2650 4250
F 0 "#PWR0311" H 2650 4000 50  0001 C CNN
F 1 "GND" H 2655 4077 50  0001 C CNN
F 2 "" H 2650 4250 50  0001 C CNN
F 3 "" H 2650 4250 50  0001 C CNN
	1    2650 4250
	1    0    0    -1  
$EndComp
$Comp
L Device:R R304
U 1 1 6527B1D2
P 1400 3200
F 0 "R304" H 1350 3250 50  0000 R CNN
F 1 "91k" H 1350 3150 50  0000 R CNN
F 2 "Resistors_SMD:R_0603_HandSoldering" V 1330 3200 50  0001 C CNN
F 3 "~" H 1400 3200 50  0001 C CNN
	1    1400 3200
	0    1    -1   0   
$EndComp
Wire Wire Line
	1200 3200 1250 3200
Wire Wire Line
	1200 2800 1600 2800
Wire Wire Line
	1750 2800 1750 2850
Wire Wire Line
	2250 4200 2300 4200
Wire Wire Line
	2250 4150 2250 4200
Wire Wire Line
	2600 4200 2650 4200
Connection ~ 2650 3550
$Comp
L Device:R R301
U 1 1 6527B200
P 1350 4150
F 0 "R301" V 1143 4150 50  0000 C CNN
F 1 "33k" V 1234 4150 50  0000 C CNN
F 2 "Resistors_SMD:R_0603_HandSoldering" V 1280 4150 50  0001 C CNN
F 3 "~" H 1350 4150 50  0001 C CNN
	1    1350 4150
	0    -1   1    0   
$EndComp
Wire Wire Line
	1150 4150 1200 4150
$Comp
L Connector:AudioJack2_SwitchT J303
U 1 1 6527B208
P 5050 2950
F 0 "J303" H 4870 2883 50  0000 R CNN
F 1 "OUT_MARACAS" H 4870 2974 50  0000 R CNN
F 2 "Connectors:Cliff_FC681374V" H 5050 2950 50  0001 C CNN
F 3 "~" H 5050 2950 50  0001 C CNN
	1    5050 2950
	-1   0    0    1   
$EndComp
$Comp
L power:GND #PWR0326
U 1 1 6527B20E
P 4800 3100
F 0 "#PWR0326" H 4800 2850 50  0001 C CNN
F 1 "GND" H 4805 2927 50  0001 C CNN
F 2 "" H 4800 3100 50  0001 C CNN
F 3 "" H 4800 3100 50  0001 C CNN
	1    4800 3100
	1    0    0    -1  
$EndComp
Wire Wire Line
	4850 3050 4800 3050
Wire Wire Line
	4800 3050 4800 3100
$Comp
L Device:R R334
U 1 1 6527B217
P 4650 2950
F 0 "R334" V 4443 2950 50  0000 C CNN
F 1 "1k" V 4534 2950 50  0000 C CNN
F 2 "Resistors_SMD:R_0603_HandSoldering" V 4580 2950 50  0001 C CNN
F 3 "~" H 4650 2950 50  0001 C CNN
	1    4650 2950
	0    -1   1    0   
$EndComp
$Comp
L Device:R R322
U 1 1 6527B223
P 2850 2850
F 0 "R322" V 3057 2850 50  0000 C CNN
F 1 "27k" V 2966 2850 50  0000 C CNN
F 2 "Resistors_SMD:R_0603_HandSoldering" V 2780 2850 50  0001 C CNN
F 3 "~" H 2850 2850 50  0001 C CNN
	1    2850 2850
	0    -1   -1   0   
$EndComp
$Comp
L Device:C C313
U 1 1 6527B229
P 3050 3050
F 0 "C313" H 3300 3100 50  0000 R CNN
F 1 "4.7nF" H 3350 3000 50  0000 R CNN
F 2 "Capacitors_ThroughHole:C_Rect_L7.2mm_W2.5mm_P5.00mm_FKS2_FKP2_MKS2_MKP2" H 3088 2900 50  0001 C CNN
F 3 "~" H 3050 3050 50  0001 C CNN
	1    3050 3050
	-1   0    0    -1  
$EndComp
Connection ~ 4450 3250
Wire Wire Line
	4450 3600 4450 3250
Wire Wire Line
	4450 2950 4450 3250
Wire Wire Line
	3650 2850 3700 2850
Wire Wire Line
	3650 2900 3650 2850
$Comp
L power:GND #PWR0320
U 1 1 6527B234
P 3650 2900
F 0 "#PWR0320" H 3650 2650 50  0001 C CNN
F 1 "GND" H 3655 2727 50  0001 C CNN
F 2 "" H 3650 2900 50  0001 C CNN
F 3 "" H 3650 2900 50  0001 C CNN
	1    3650 2900
	1    0    0    -1  
$EndComp
Wire Wire Line
	4050 3950 4050 4000
$Comp
L power:GND #PWR0321
U 1 1 6527B23B
P 4050 4000
F 0 "#PWR0321" H 4050 3750 50  0001 C CNN
F 1 "GND" H 4055 3827 50  0001 C CNN
F 2 "" H 4050 4000 50  0001 C CNN
F 3 "" H 4050 4000 50  0001 C CNN
	1    4050 4000
	1    0    0    -1  
$EndComp
Wire Wire Line
	4050 3600 4100 3600
Connection ~ 4050 3600
Wire Wire Line
	4050 3600 4050 3650
Wire Wire Line
	4000 3600 4050 3600
$Comp
L Device:R R330
U 1 1 6527B245
P 4050 3800
F 0 "R330" H 4120 3846 50  0000 L CNN
F 1 "220R" H 4120 3755 50  0000 L CNN
F 2 "Resistors_SMD:R_0603_HandSoldering" V 3980 3800 50  0001 C CNN
F 3 "~" H 4050 3800 50  0001 C CNN
	1    4050 3800
	1    0    0    -1  
$EndComp
Connection ~ 3650 3250
Wire Wire Line
	3650 3600 3700 3600
Wire Wire Line
	3650 3250 3650 3600
Wire Wire Line
	4450 3600 4400 3600
$Comp
L Device:C C317
U 1 1 6527B24F
P 4250 3600
F 0 "C317" V 3998 3600 50  0000 C CNN
F 1 "1nF" V 4089 3600 50  0000 C CNN
F 2 "Capacitors_ThroughHole:C_Rect_L7.2mm_W2.5mm_P5.00mm_FKS2_FKP2_MKS2_MKP2" H 4288 3450 50  0001 C CNN
F 3 "~" H 4250 3600 50  0001 C CNN
	1    4250 3600
	0    1    1    0   
$EndComp
$Comp
L Device:C C316
U 1 1 6527B255
P 3850 3600
F 0 "C316" V 3598 3600 50  0000 C CNN
F 1 "1nF" V 3689 3600 50  0000 C CNN
F 2 "Capacitors_ThroughHole:C_Rect_L7.2mm_W2.5mm_P5.00mm_FKS2_FKP2_MKS2_MKP2" H 3888 3450 50  0001 C CNN
F 3 "~" H 3850 3600 50  0001 C CNN
	1    3850 3600
	0    1    1    0   
$EndComp
Wire Wire Line
	3650 3250 4000 3250
Wire Wire Line
	3650 3050 3650 3250
Wire Wire Line
	3700 3050 3650 3050
Wire Wire Line
	4450 3250 4300 3250
Wire Wire Line
	4300 2950 4450 2950
$Comp
L Device:R R332
U 1 1 6527B260
P 4150 3250
F 0 "R332" V 3943 3250 50  0000 C CNN
F 1 "330k" V 4034 3250 50  0000 C CNN
F 2 "Resistors_SMD:R_0603_HandSoldering" V 4080 3250 50  0001 C CNN
F 3 "~" H 4150 3250 50  0001 C CNN
	1    4150 3250
	0    -1   1    0   
$EndComp
$Comp
L Amplifier_Operational:TL074 U302
U 3 1 6527B266
P 9100 2150
F 0 "U302" H 9150 2400 50  0000 C CNN
F 1 "TL074" H 9200 2300 50  0000 C CNN
F 2 "Housings_SOIC:SOIC-14_3.9x8.7mm_Pitch1.27mm" H 9050 2250 50  0001 C CNN
F 3 "http://www.ti.com/lit/ds/symlink/tl071.pdf" H 9150 2350 50  0001 C CNN
	3    9100 2150
	1    0    0    -1  
$EndComp
Connection ~ 3650 3050
Wire Wire Line
	3600 3050 3650 3050
$Comp
L Device:R R329
U 1 1 6527B26E
P 3450 3050
F 0 "R329" V 3243 3050 50  0000 C CNN
F 1 "10k" V 3334 3050 50  0000 C CNN
F 2 "Resistors_SMD:R_0603_HandSoldering" V 3380 3050 50  0001 C CNN
F 3 "~" H 3450 3050 50  0001 C CNN
	1    3450 3050
	0    -1   1    0   
$EndComp
Wire Wire Line
	3250 3400 3250 3450
Wire Wire Line
	3250 3050 3300 3050
Wire Wire Line
	3250 3100 3250 3050
$Comp
L power:GND #PWR0318
U 1 1 6527B277
P 3250 3450
F 0 "#PWR0318" H 3250 3200 50  0001 C CNN
F 1 "GND" H 3255 3277 50  0001 C CNN
F 2 "" H 3250 3450 50  0001 C CNN
F 3 "" H 3250 3450 50  0001 C CNN
	1    3250 3450
	1    0    0    -1  
$EndComp
$Comp
L Device:R_POT RV305
U 1 1 6527B27D
P 3250 3250
F 0 "RV305" H 3180 3204 50  0000 R CNN
F 1 "100k" H 3180 3295 50  0000 R CNN
F 2 "Potentiometer:Potentiometer_Alpha_RD901F-40-xxx-xxx-00D" H 3250 3250 50  0001 C CNN
F 3 "~" H 3250 3250 50  0001 C CNN
	1    3250 3250
	-1   0    0    1   
$EndComp
Wire Wire Line
	3000 2850 3050 2850
Wire Wire Line
	3050 2850 3050 2900
Wire Wire Line
	3050 3200 3050 3250
Wire Wire Line
	3050 3250 3100 3250
Wire Wire Line
	4800 2850 4850 2850
$Comp
L Device:D D303
U 1 1 6527B290
P 2450 3550
F 0 "D303" H 2450 3767 50  0000 C CNN
F 1 "D" H 2450 3676 50  0000 C CNN
F 2 "Diodes_SMD:D_MiniMELF" H 2450 3550 50  0001 C CNN
F 3 "~" H 2450 3550 50  0001 C CNN
	1    2450 3550
	1    0    0    -1  
$EndComp
$Comp
L power:+12V #PWR0302
U 1 1 6527B296
P 1500 3600
F 0 "#PWR0302" H 1500 3450 50  0001 C CNN
F 1 "+12V" H 1515 3773 50  0000 C CNN
F 2 "" H 1500 3600 50  0001 C CNN
F 3 "" H 1500 3600 50  0001 C CNN
	1    1500 3600
	1    0    0    -1  
$EndComp
$Comp
L Device:R R306
U 1 1 6527B29F
P 1700 3750
F 0 "R306" H 1630 3796 50  0000 R CNN
F 1 "1M" H 1630 3705 50  0000 R CNN
F 2 "Resistors_SMD:R_0603_HandSoldering" V 1630 3750 50  0001 C CNN
F 3 "~" H 1700 3750 50  0001 C CNN
	1    1700 3750
	0    -1   1    0   
$EndComp
$Comp
L Device:C C311
U 1 1 6527B2A9
P 2650 3850
F 0 "C311" H 2535 3804 50  0000 R CNN
F 1 "15nF" H 2535 3895 50  0000 R CNN
F 2 "Capacitors_ThroughHole:C_Rect_L7.2mm_W2.5mm_P5.00mm_FKS2_FKP2_MKS2_MKP2" H 2688 3700 50  0001 C CNN
F 3 "~" H 2650 3850 50  0001 C CNN
	1    2650 3850
	-1   0    0    1   
$EndComp
$Comp
L Device:R R308
U 1 1 652DA8E1
P 1800 3200
F 0 "R308" V 2007 3200 50  0000 C CNN
F 1 "100k" V 1916 3200 50  0000 C CNN
F 2 "Resistors_SMD:R_0603_HandSoldering" V 1730 3200 50  0001 C CNN
F 3 "~" H 1800 3200 50  0001 C CNN
	1    1800 3200
	0    1    -1   0   
$EndComp
Wire Wire Line
	1550 3200 1600 3200
$Comp
L Device:D D301
U 1 1 6537E655
P 1600 3000
F 0 "D301" V 1554 3080 50  0000 L CNN
F 1 "D" V 1645 3080 50  0000 L CNN
F 2 "Diodes_SMD:D_MiniMELF" H 1600 3000 50  0001 C CNN
F 3 "~" H 1600 3000 50  0001 C CNN
	1    1600 3000
	0    1    1    0   
$EndComp
Wire Wire Line
	1600 3150 1600 3200
Connection ~ 1600 3200
Wire Wire Line
	1600 3200 1650 3200
$Comp
L Device:C C305
U 1 1 65423D9F
P 2000 3400
F 0 "C305" H 1885 3446 50  0000 R CNN
F 1 "47nF" H 1885 3355 50  0000 R CNN
F 2 "Capacitors_ThroughHole:C_Rect_L7.2mm_W2.5mm_P5.00mm_FKS2_FKP2_MKS2_MKP2" H 2038 3250 50  0001 C CNN
F 3 "~" H 2000 3400 50  0001 C CNN
	1    2000 3400
	-1   0    0    -1  
$EndComp
$Comp
L power:GND #PWR0306
U 1 1 654242AD
P 2000 3600
F 0 "#PWR0306" H 2000 3350 50  0001 C CNN
F 1 "GND" H 2005 3427 50  0001 C CNN
F 2 "" H 2000 3600 50  0001 C CNN
F 3 "" H 2000 3600 50  0001 C CNN
	1    2000 3600
	-1   0    0    -1  
$EndComp
Wire Wire Line
	2000 3550 2000 3600
Wire Wire Line
	1950 3200 2000 3200
Wire Wire Line
	2000 3200 2000 3250
Wire Wire Line
	2000 3150 2000 3200
Connection ~ 2000 3200
Wire Wire Line
	2650 2850 2700 2850
Wire Wire Line
	2650 3550 2650 3700
Wire Wire Line
	2650 4200 2650 4250
Wire Wire Line
	2650 4000 2650 4200
Connection ~ 2650 4200
Wire Wire Line
	2600 3550 2650 3550
Wire Wire Line
	2250 3550 2300 3550
Wire Wire Line
	2200 2850 2300 2850
Wire Wire Line
	2600 2850 2650 2850
Wire Wire Line
	2650 2850 2650 3550
Connection ~ 2650 2850
Wire Wire Line
	1850 3750 1900 3750
Wire Wire Line
	1900 3750 1900 3950
Wire Wire Line
	1900 3950 1950 3950
Wire Wire Line
	1900 4150 1900 3950
Connection ~ 1900 3950
Wire Wire Line
	1500 3600 1500 3750
Wire Wire Line
	1500 3750 1550 3750
Wire Wire Line
	1600 2800 1600 2850
Wire Wire Line
	2700 5050 2750 5050
Connection ~ 2700 5050
$Comp
L Amplifier_Operational:TL074 U302
U 5 1 666C4BCE
P 5750 6750
F 0 "U302" H 5800 7000 50  0000 C CNN
F 1 "TL074" H 5850 6900 50  0000 C CNN
F 2 "Housings_SOIC:SOIC-14_3.9x8.7mm_Pitch1.27mm" H 5700 6850 50  0001 C CNN
F 3 "http://www.ti.com/lit/ds/symlink/tl071.pdf" H 5800 6950 50  0001 C CNN
	5    5750 6750
	1    0    0    -1  
$EndComp
$Comp
L Device:C C320
U 1 1 666C4BD4
P 5300 6550
F 0 "C320" H 5185 6504 50  0000 R CNN
F 1 "100nF" H 5185 6595 50  0000 R CNN
F 2 "Capacitors_SMD:C_0603_HandSoldering" H 5338 6400 50  0001 C CNN
F 3 "~" H 5300 6550 50  0001 C CNN
	1    5300 6550
	-1   0    0    1   
$EndComp
$Comp
L Device:C C321
U 1 1 666C4BDA
P 5300 6950
F 0 "C321" H 5185 6904 50  0000 R CNN
F 1 "100nF" H 5185 6995 50  0000 R CNN
F 2 "Capacitors_SMD:C_0603_HandSoldering" H 5338 6800 50  0001 C CNN
F 3 "~" H 5300 6950 50  0001 C CNN
	1    5300 6950
	-1   0    0    1   
$EndComp
Wire Wire Line
	5300 6400 5300 6350
Wire Wire Line
	5300 6350 5650 6350
Wire Wire Line
	5650 6350 5650 6450
Wire Wire Line
	5300 7100 5300 7150
Wire Wire Line
	5300 7150 5650 7150
Wire Wire Line
	5650 7150 5650 7050
$Comp
L power:GND #PWR0329
U 1 1 666C4BE6
P 5400 6800
F 0 "#PWR0329" H 5400 6550 50  0001 C CNN
F 1 "GND" H 5405 6627 50  0001 C CNN
F 2 "" H 5400 6800 50  0001 C CNN
F 3 "" H 5400 6800 50  0001 C CNN
	1    5400 6800
	1    0    0    -1  
$EndComp
Wire Wire Line
	5300 6700 5300 6750
Wire Wire Line
	5300 6750 5400 6750
Wire Wire Line
	5400 6750 5400 6800
Connection ~ 5300 6750
Wire Wire Line
	5300 6750 5300 6800
$Comp
L power:+12V #PWR0327
U 1 1 666C4BF1
P 5300 6300
F 0 "#PWR0327" H 5300 6150 50  0001 C CNN
F 1 "+12V" H 5315 6473 50  0000 C CNN
F 2 "" H 5300 6300 50  0001 C CNN
F 3 "" H 5300 6300 50  0001 C CNN
	1    5300 6300
	1    0    0    -1  
$EndComp
Wire Wire Line
	5300 6300 5300 6350
Connection ~ 5300 6350
$Comp
L power:-12V #PWR0328
U 1 1 666C4BF9
P 5300 7200
F 0 "#PWR0328" H 5300 7300 50  0001 C CNN
F 1 "-12V" H 5315 7373 50  0000 C CNN
F 2 "" H 5300 7200 50  0001 C CNN
F 3 "" H 5300 7200 50  0001 C CNN
	1    5300 7200
	-1   0    0    1   
$EndComp
Wire Wire Line
	5300 7150 5300 7200
Connection ~ 5300 7150
Wire Wire Line
	4800 2950 4850 2950
Wire Wire Line
	4500 2950 4450 2950
Connection ~ 4450 2950
Wire Wire Line
	10200 4950 10250 4950
Wire Wire Line
	9900 4950 9850 4950
Connection ~ 9850 4950
Wire Wire Line
	9350 3450 9350 3400
Connection ~ 9350 3400
Wire Wire Line
	9350 3400 9550 3400
Wire Wire Line
	9100 3400 9350 3400
Wire Wire Line
	2700 850  2650 850 
Wire Wire Line
	3000 850  3050 850 
Wire Wire Line
	3050 850  3050 900 
Wire Wire Line
	3050 1200 3050 1250
Wire Wire Line
	3050 1250 3100 1250
Wire Wire Line
	2650 850  2650 1700
Connection ~ 2650 850 
Wire Wire Line
	2650 850  2600 850 
Wire Wire Line
	4900 650  4800 650 
Wire Wire Line
	4800 650  4800 850 
$Comp
L Device:R R336
U 1 1 6378EE40
P 5050 2650
F 0 "R336" H 4980 2696 50  0000 R CNN
F 1 "10k" H 4980 2605 50  0000 R CNN
F 2 "Resistors_SMD:R_0603_HandSoldering" V 4980 2650 50  0001 C CNN
F 3 "~" H 5050 2650 50  0001 C CNN
	1    5050 2650
	0    -1   1    0   
$EndComp
Wire Wire Line
	4800 2850 4800 2650
Wire Wire Line
	4800 2650 4900 2650
$Comp
L Device:R R327
U 1 1 637FA0AA
P 3300 4750
F 0 "R327" H 3230 4796 50  0000 R CNN
F 1 "10k" H 3230 4705 50  0000 R CNN
F 2 "Resistors_SMD:R_0603_HandSoldering" V 3230 4750 50  0001 C CNN
F 3 "~" H 3300 4750 50  0001 C CNN
	1    3300 4750
	0    -1   1    0   
$EndComp
Wire Wire Line
	3100 4950 3050 4950
Wire Wire Line
	3050 4950 3050 4750
Wire Wire Line
	3050 4750 3150 4750
Wire Wire Line
	3450 4750 5650 4750
Wire Wire Line
	5650 4750 5650 2650
Wire Wire Line
	5650 2650 5200 2650
Wire Wire Line
	5650 2650 5650 650 
Wire Wire Line
	5650 650  5200 650 
Connection ~ 5650 2650
Wire Wire Line
	10300 3800 10200 3800
Wire Wire Line
	10200 3800 10200 4000
$Comp
L Device:R R368
U 1 1 63937E35
P 10450 4650
F 0 "R368" H 10380 4696 50  0000 R CNN
F 1 "10k" H 10380 4605 50  0000 R CNN
F 2 "Resistors_SMD:R_0603_HandSoldering" V 10380 4650 50  0001 C CNN
F 3 "~" H 10450 4650 50  0001 C CNN
	1    10450 4650
	0    -1   1    0   
$EndComp
Wire Wire Line
	10200 4850 10200 4650
Wire Wire Line
	10200 4650 10300 4650
Wire Wire Line
	10600 3800 11100 3800
Wire Wire Line
	11100 3800 11100 4650
Wire Wire Line
	11100 4650 10600 4650
Wire Wire Line
	11100 3800 11100 650 
Wire Wire Line
	11100 650  8650 650 
Connection ~ 11100 3800
Wire Wire Line
	8650 650  5650 650 
Connection ~ 8650 650 
Connection ~ 5650 650 
Text GLabel 1200 1200 0    50   Input ~ 0
LEVEL
Text GLabel 1200 1500 0    50   Input ~ 0
GATE_CB
Text GLabel 1200 1950 0    50   Input ~ 0
TONE_CB
Text GLabel 1200 2800 0    50   Input ~ 0
GATE_MARACAS
Text GLabel 1200 3200 0    50   Input ~ 0
LEVEL
Text GLabel 1150 4150 0    50   Input ~ 0
WHITE_NOISE
Text GLabel 1150 5950 0    50   Input ~ 0
LEVEL
Text GLabel 1150 6550 0    50   Input ~ 0
GATE_BD
Text GLabel 1150 7150 0    50   Input ~ 0
GATE_BD_ATTACK
Text GLabel 6550 1800 0    50   Input ~ 0
GATE_SNARE
Text GLabel 6550 1950 0    50   Input ~ 0
GATE_SNARE_NOISE
Text GLabel 6550 2050 0    50   Input ~ 0
LEVEL
Text GLabel 6550 3650 0    50   Input ~ 0
WHITE_NOISE
Text GLabel 6550 5200 0    50   Input ~ 0
LEVEL
Text GLabel 6550 5500 0    50   Input ~ 0
GATE_CLAP
Text GLabel 6550 6150 0    50   Input ~ 0
WHITE_NOISE
$Comp
L Amplifier_Operational:TL074 U302
U 4 1 6372A53F
P 9400 4950
F 0 "U302" H 9400 5317 50  0000 C CNN
F 1 "TL074" H 9400 5226 50  0000 C CNN
F 2 "Housings_SOIC:SOIC-14_3.9x8.7mm_Pitch1.27mm" H 9350 5050 50  0001 C CNN
F 3 "http://www.ti.com/lit/ds/symlink/tl071.pdf" H 9450 5150 50  0001 C CNN
	4    9400 4950
	1    0    0    -1  
$EndComp
$Comp
L Amplifier_Operational:TL074 U302
U 1 1 6373E3EE
P 4000 2950
F 0 "U302" H 4000 3317 50  0000 C CNN
F 1 "TL074" H 4000 3226 50  0000 C CNN
F 2 "Housings_SOIC:SOIC-14_3.9x8.7mm_Pitch1.27mm" H 3950 3050 50  0001 C CNN
F 3 "http://www.ti.com/lit/ds/symlink/tl071.pdf" H 4050 3150 50  0001 C CNN
	1    4000 2950
	1    0    0    -1  
$EndComp
$Comp
L Device:Q_NPN_BEC Q?
U 1 1 6375B7B9
P 7350 2500
AR Path="/635986C0/6375B7B9" Ref="Q?"  Part="1" 
AR Path="/635B4852/6375B7B9" Ref="Q307"  Part="1" 
F 0 "Q307" V 7585 2500 50  0000 C CNN
F 1 "BC846A" V 7676 2500 50  0000 C CNN
F 2 "TO_SOT_Packages_SMD:SOT-23" H 7550 2600 50  0001 C CNN
F 3 "~" H 7350 2500 50  0001 C CNN
	1    7350 2500
	0    -1   1    0   
$EndComp
$Comp
L Device:Q_NPN_BEC Q?
U 1 1 6378ACEC
P 2050 1950
AR Path="/635986C0/6378ACEC" Ref="Q?"  Part="1" 
AR Path="/635B4852/6378ACEC" Ref="Q303"  Part="1" 
F 0 "Q303" H 2240 1996 50  0000 L CNN
F 1 "BC846A" H 2240 1905 50  0000 L CNN
F 2 "TO_SOT_Packages_SMD:SOT-23" H 2250 2050 50  0001 C CNN
F 3 "~" H 2050 1950 50  0001 C CNN
	1    2050 1950
	1    0    0    -1  
$EndComp
$Comp
L Device:Q_NPN_BEC Q?
U 1 1 6378B6BC
P 1600 950
AR Path="/635986C0/6378B6BC" Ref="Q?"  Part="1" 
AR Path="/635B4852/6378B6BC" Ref="Q301"  Part="1" 
F 0 "Q301" V 1928 950 50  0000 C CNN
F 1 "BC846A" V 1837 950 50  0000 C CNN
F 2 "TO_SOT_Packages_SMD:SOT-23" H 1800 1050 50  0001 C CNN
F 3 "~" H 1600 950 50  0001 C CNN
	1    1600 950 
	0    -1   -1   0   
$EndComp
$Comp
L Device:Q_NPN_BEC Q?
U 1 1 6378D905
P 2150 3950
AR Path="/635986C0/6378D905" Ref="Q?"  Part="1" 
AR Path="/635B4852/6378D905" Ref="Q304"  Part="1" 
F 0 "Q304" H 2340 3996 50  0000 L CNN
F 1 "BC846A" H 2340 3905 50  0000 L CNN
F 2 "TO_SOT_Packages_SMD:SOT-23" H 2350 4050 50  0001 C CNN
F 3 "~" H 2150 3950 50  0001 C CNN
	1    2150 3950
	1    0    0    -1  
$EndComp
$Comp
L Device:Q_NPN_BEC Q?
U 1 1 6378E71A
P 2000 2950
AR Path="/635986C0/6378E71A" Ref="Q?"  Part="1" 
AR Path="/635B4852/6378E71A" Ref="Q302"  Part="1" 
F 0 "Q302" V 2328 2950 50  0000 C CNN
F 1 "BC846A" V 2237 2950 50  0000 C CNN
F 2 "TO_SOT_Packages_SMD:SOT-23" H 2200 3050 50  0001 C CNN
F 3 "~" H 2000 2950 50  0001 C CNN
	1    2000 2950
	0    -1   -1   0   
$EndComp
$Comp
L Device:Q_NPN_BEC Q?
U 1 1 63792854
P 3000 6550
AR Path="/635986C0/63792854" Ref="Q?"  Part="1" 
AR Path="/635B4852/63792854" Ref="Q305"  Part="1" 
F 0 "Q305" H 3190 6596 50  0000 L CNN
F 1 "BC846A" H 3190 6505 50  0000 L CNN
F 2 "TO_SOT_Packages_SMD:SOT-23" H 3200 6650 50  0001 C CNN
F 3 "~" H 3000 6550 50  0001 C CNN
	1    3000 6550
	1    0    0    -1  
$EndComp
$Comp
L Device:Q_NPN_BEC Q?
U 1 1 637984EC
P 6950 4950
AR Path="/635986C0/637984EC" Ref="Q?"  Part="1" 
AR Path="/635B4852/637984EC" Ref="Q306"  Part="1" 
F 0 "Q306" V 7278 4950 50  0000 C CNN
F 1 "BC846A" V 7187 4950 50  0000 C CNN
F 2 "TO_SOT_Packages_SMD:SOT-23" H 7150 5050 50  0001 C CNN
F 3 "~" H 6950 4950 50  0001 C CNN
	1    6950 4950
	0    -1   -1   0   
$EndComp
$Comp
L Device:Q_NPN_BEC Q?
U 1 1 6379974F
P 7550 5950
AR Path="/635986C0/6379974F" Ref="Q?"  Part="1" 
AR Path="/635B4852/6379974F" Ref="Q308"  Part="1" 
F 0 "Q308" H 7740 5996 50  0000 L CNN
F 1 "BC846A" H 7740 5905 50  0000 L CNN
F 2 "TO_SOT_Packages_SMD:SOT-23" H 7750 6050 50  0001 C CNN
F 3 "~" H 7550 5950 50  0001 C CNN
	1    7550 5950
	1    0    0    -1  
$EndComp
$Comp
L Device:Q_NPN_BEC Q?
U 1 1 6379D7D6
P 7600 3650
AR Path="/635986C0/6379D7D6" Ref="Q?"  Part="1" 
AR Path="/635B4852/6379D7D6" Ref="Q309"  Part="1" 
F 0 "Q309" H 7790 3696 50  0000 L CNN
F 1 "BC846A" H 7790 3605 50  0000 L CNN
F 2 "TO_SOT_Packages_SMD:SOT-23" H 7800 3750 50  0001 C CNN
F 3 "~" H 7600 3650 50  0001 C CNN
	1    7600 3650
	1    0    0    -1  
$EndComp
$Comp
L Amplifier_Operational:TL074 U301
U 2 1 635E4F7F
P 2350 5050
F 0 "U301" H 2400 5300 50  0000 C CNN
F 1 "TL074" H 2450 5200 50  0000 C CNN
F 2 "Housings_SOIC:SOIC-14_3.9x8.7mm_Pitch1.27mm" H 2300 5150 50  0001 C CNN
F 3 "http://www.ti.com/lit/ds/symlink/tl071.pdf" H 2400 5250 50  0001 C CNN
	2    2350 5050
	1    0    0    -1  
$EndComp
$Comp
L Amplifier_Operational:TL074 U301
U 1 1 635B4C61
P 2200 6050
F 0 "U301" H 2200 6417 50  0000 C CNN
F 1 "TL074" H 2200 6326 50  0000 C CNN
F 2 "Housings_SOIC:SOIC-14_3.9x8.7mm_Pitch1.27mm" H 2150 6150 50  0001 C CNN
F 3 "http://www.ti.com/lit/ds/symlink/tl071.pdf" H 2250 6250 50  0001 C CNN
	1    2200 6050
	1    0    0    -1  
$EndComp
$Comp
L Device:CP C309
U 1 1 6376C1F0
P 2450 7100
F 0 "C309" H 2568 7146 50  0000 L CNN
F 1 "1µF" H 2568 7055 50  0000 L CNN
F 2 "Capacitors_ThroughHole:CP_Radial_D4.0mm_P1.50mm" H 2488 6950 50  0001 C CNN
F 3 "~" H 2450 7100 50  0001 C CNN
	1    2450 7100
	0    1    1    0   
$EndComp
$Comp
L power:-12V #PWR?
U 1 1 63B8CF82
P 2900 7550
F 0 "#PWR?" H 2900 7650 50  0001 C CNN
F 1 "-12V" H 2915 7723 50  0000 C CNN
F 2 "" H 2900 7550 50  0001 C CNN
F 3 "" H 2900 7550 50  0001 C CNN
	1    2900 7550
	-1   0    0    1   
$EndComp
$Comp
L power:-12V #PWR?
U 1 1 63B8DEEF
P 3100 7550
F 0 "#PWR?" H 3100 7650 50  0001 C CNN
F 1 "-12V" H 3115 7723 50  0000 C CNN
F 2 "" H 3100 7550 50  0001 C CNN
F 3 "" H 3100 7550 50  0001 C CNN
	1    3100 7550
	-1   0    0    1   
$EndComp
Text Notes 9600 2750 0    50   ~ 0
TR-808 uses 27nF, 820k and \n680R here. 27nF is an unusal \ncapacitor value, 22nF is more \nstandard. 22nF, 1Meg, 820R \nshould give same sound as \nTR-808.
$EndSCHEMATC
