EESchema Schematic File Version 4
EELAYER 30 0
EELAYER END
$Descr A4 11693 8268
encoding utf-8
Sheet 1 1
Title ""
Date ""
Rev ""
Comp ""
Comment1 ""
Comment2 ""
Comment3 ""
Comment4 ""
$EndDescr
$Comp
L Isolator:4N25 U?
U 1 1 62E58734
P 2150 1550
F 0 "U?" H 2150 1875 50  0000 C CNN
F 1 "MB104" H 2150 1784 50  0000 C CNN
F 2 "Package_DIP:DIP-6_W7.62mm" H 1950 1350 50  0001 L CIN
F 3 "https://www.vishay.com/docs/83725/4n25.pdf" H 2150 1550 50  0001 L CNN
	1    2150 1550
	1    0    0    -1  
$EndComp
$Comp
L Device:R R?
U 1 1 62E5A584
P 1150 1350
F 0 "R?" V 943 1350 50  0000 C CNN
F 1 "220R" V 1034 1350 50  0000 C CNN
F 2 "" V 1080 1350 50  0001 C CNN
F 3 "~" H 1150 1350 50  0001 C CNN
	1    1150 1350
	0    1    1    0   
$EndComp
$Comp
L Device:D D?
U 1 1 62E5ACE8
P 1500 1550
F 0 "D?" V 1454 1630 50  0000 L CNN
F 1 "1N4148" V 1545 1630 50  0000 L CNN
F 2 "" H 1500 1550 50  0001 C CNN
F 3 "~" H 1500 1550 50  0001 C CNN
	1    1500 1550
	0    1    1    0   
$EndComp
Wire Wire Line
	1500 1350 1500 1400
Wire Wire Line
	1500 1700 1500 1750
Wire Wire Line
	1300 1350 1500 1350
Connection ~ 1500 1350
$Comp
L Connector:DIN-5_180degree J?
U 1 1 62E61407
P 1150 1850
F 0 "J?" H 1150 1575 50  0000 C CNN
F 1 "IN" H 1150 1484 50  0000 C CNN
F 2 "" H 1150 1850 50  0001 C CNN
F 3 "http://www.mouser.com/ds/2/18/40_c091_abd_e-75918.pdf" H 1150 1850 50  0001 C CNN
	1    1150 1850
	1    0    0    -1  
$EndComp
Wire Wire Line
	800  1350 800  1750
Wire Wire Line
	800  1750 850  1750
Wire Wire Line
	800  1350 1000 1350
NoConn ~ 1150 1550
NoConn ~ 1450 1850
NoConn ~ 850  1850
Wire Wire Line
	1850 1650 1800 1650
Wire Wire Line
	1800 1650 1800 1750
Wire Wire Line
	1800 1750 1500 1750
Connection ~ 1500 1750
Wire Wire Line
	1450 1750 1500 1750
Wire Wire Line
	1500 1350 1800 1350
Wire Wire Line
	1800 1350 1800 1450
Wire Wire Line
	1800 1450 1850 1450
$Comp
L power:GND #PWR?
U 1 1 62E77B01
P 2900 2050
F 0 "#PWR?" H 2900 1800 50  0001 C CNN
F 1 "GND" H 2905 1877 50  0001 C CNN
F 2 "" H 2900 2050 50  0001 C CNN
F 3 "" H 2900 2050 50  0001 C CNN
	1    2900 2050
	1    0    0    -1  
$EndComp
$Comp
L power:GND #PWR?
U 1 1 62E77276
P 2500 2050
F 0 "#PWR?" H 2500 1800 50  0001 C CNN
F 1 "GND" H 2505 1877 50  0001 C CNN
F 2 "" H 2500 2050 50  0001 C CNN
F 3 "" H 2500 2050 50  0001 C CNN
	1    2500 2050
	1    0    0    -1  
$EndComp
Wire Wire Line
	2500 2000 2500 2050
$Comp
L Device:R R?
U 1 1 62E7521F
P 2500 1850
F 0 "R?" H 2430 1804 50  0000 R CNN
F 1 "1k" H 2430 1895 50  0000 R CNN
F 2 "" V 2430 1850 50  0001 C CNN
F 3 "~" H 2500 1850 50  0001 C CNN
	1    2500 1850
	-1   0    0    1   
$EndComp
Connection ~ 2500 1650
Wire Wire Line
	2500 1650 2500 1700
Wire Wire Line
	2450 1650 2500 1650
Wire Wire Line
	2900 2050 2900 1850
Wire Wire Line
	2500 1650 2600 1650
$Comp
L Device:Q_NPN_CBE Q?
U 1 1 62E7383D
P 2800 1650
F 0 "Q?" H 2991 1696 50  0000 L CNN
F 1 "Q_NPN_CBE" H 2991 1605 50  0000 L CNN
F 2 "" H 3000 1750 50  0001 C CNN
F 3 "~" H 2800 1650 50  0001 C CNN
	1    2800 1650
	1    0    0    -1  
$EndComp
Wire Wire Line
	2900 1400 2900 1450
$Comp
L Device:R R?
U 1 1 62E74639
P 2700 1400
F 0 "R?" V 2493 1400 50  0000 C CNN
F 1 "3k3" V 2584 1400 50  0000 C CNN
F 2 "" V 2630 1400 50  0001 C CNN
F 3 "~" H 2700 1400 50  0001 C CNN
	1    2700 1400
	0    1    1    0   
$EndComp
Wire Wire Line
	2450 1550 2500 1550
$Comp
L power:+5V #PWR?
U 1 1 62E84DBE
P 2500 1250
F 0 "#PWR?" H 2500 1100 50  0001 C CNN
F 1 "+5V" H 2515 1423 50  0000 C CNN
F 2 "" H 2500 1250 50  0001 C CNN
F 3 "" H 2500 1250 50  0001 C CNN
	1    2500 1250
	1    0    0    -1  
$EndComp
Wire Wire Line
	2550 1400 2500 1400
Wire Wire Line
	2500 1400 2500 1550
Wire Wire Line
	2500 1250 2500 1400
Connection ~ 2500 1400
Wire Wire Line
	2850 1400 2900 1400
$Comp
L 74xx:74LS04 U?
U 6 1 62E93513
P 3500 1400
F 0 "U?" H 3500 1717 50  0000 C CNN
F 1 "74LS04" H 3500 1626 50  0000 C CNN
F 2 "" H 3500 1400 50  0001 C CNN
F 3 "http://www.ti.com/lit/gpn/sn74LS04" H 3500 1400 50  0001 C CNN
	6    3500 1400
	1    0    0    -1  
$EndComp
Wire Wire Line
	2900 1400 3150 1400
Connection ~ 2900 1400
$Comp
L 74xx:74LS04 U?
U 5 1 62E954DD
P 4150 1400
F 0 "U?" H 4150 1717 50  0000 C CNN
F 1 "74LS04" H 4150 1626 50  0000 C CNN
F 2 "" H 4150 1400 50  0001 C CNN
F 3 "http://www.ti.com/lit/gpn/sn74LS04" H 4150 1400 50  0001 C CNN
	5    4150 1400
	1    0    0    -1  
$EndComp
Wire Wire Line
	3800 1400 3850 1400
Text HLabel 5450 1400 2    50   Output ~ 0
TO_UART
$Comp
L 74xx:74LS04 U?
U 2 1 62E9A72A
P 2150 2600
F 0 "U?" H 2150 2283 50  0000 C CNN
F 1 "74LS04" H 2150 2374 50  0000 C CNN
F 2 "" H 2150 2600 50  0001 C CNN
F 3 "http://www.ti.com/lit/gpn/sn74LS04" H 2150 2600 50  0001 C CNN
	2    2150 2600
	-1   0    0    1   
$EndComp
Wire Wire Line
	3150 1400 3150 2600
Connection ~ 3150 1400
Wire Wire Line
	3150 1400 3200 1400
$Comp
L 74xx:74LS04 U?
U 4 1 62EA9809
P 4500 1750
F 0 "U?" H 4500 2067 50  0000 C CNN
F 1 "74LS04" H 4500 1976 50  0000 C CNN
F 2 "" H 4500 1750 50  0001 C CNN
F 3 "http://www.ti.com/lit/gpn/sn74LS04" H 4500 1750 50  0001 C CNN
	4    4500 1750
	0    1    1    0   
$EndComp
$Comp
L Device:R R?
U 1 1 62EB349E
P 4650 2300
F 0 "R?" V 4443 2300 50  0000 C CNN
F 1 "3k3" V 4534 2300 50  0000 C CNN
F 2 "" V 4580 2300 50  0001 C CNN
F 3 "~" H 4650 2300 50  0001 C CNN
	1    4650 2300
	-1   0    0    -1  
$EndComp
Wire Wire Line
	4650 2150 4650 2100
Wire Wire Line
	4650 2100 4500 2100
Wire Wire Line
	4350 2100 4350 2150
Wire Wire Line
	4500 2050 4500 2100
Connection ~ 4500 2100
Wire Wire Line
	4500 2100 4350 2100
$Comp
L Device:CP C?
U 1 1 62ECC85C
P 4350 2700
F 0 "C?" H 4468 2746 50  0000 L CNN
F 1 "10µF" H 4468 2655 50  0000 L CNN
F 2 "" H 4388 2550 50  0001 C CNN
F 3 "~" H 4350 2700 50  0001 C CNN
	1    4350 2700
	1    0    0    -1  
$EndComp
$Comp
L Device:D D?
U 1 1 62EB11E5
P 4350 2300
F 0 "D?" H 4350 2517 50  0000 C CNN
F 1 "1N4148" H 4350 2426 50  0000 C CNN
F 2 "" H 4350 2300 50  0001 C CNN
F 3 "~" H 4350 2300 50  0001 C CNN
	1    4350 2300
	0    1    -1   0   
$EndComp
$Comp
L power:GND #PWR?
U 1 1 62ECF299
P 4350 2900
F 0 "#PWR?" H 4350 2650 50  0001 C CNN
F 1 "GND" H 4355 2727 50  0001 C CNN
F 2 "" H 4350 2900 50  0001 C CNN
F 3 "" H 4350 2900 50  0001 C CNN
	1    4350 2900
	1    0    0    -1  
$EndComp
Wire Wire Line
	4350 2850 4350 2900
$Comp
L 74xx:74LS04 U?
U 3 1 62ED0562
P 5000 2500
F 0 "U?" H 5000 2817 50  0000 C CNN
F 1 "74LS04" H 5000 2726 50  0000 C CNN
F 2 "" H 5000 2500 50  0001 C CNN
F 3 "http://www.ti.com/lit/gpn/sn74LS04" H 5000 2500 50  0001 C CNN
	3    5000 2500
	1    0    0    -1  
$EndComp
$Comp
L Device:LED D?
U 1 1 62ED8808
P 5350 2300
F 0 "D?" V 5389 2182 50  0000 R CNN
F 1 "LED" V 5298 2182 50  0000 R CNN
F 2 "" H 5350 2300 50  0001 C CNN
F 3 "~" H 5350 2300 50  0001 C CNN
	1    5350 2300
	0    -1   -1   0   
$EndComp
Wire Wire Line
	5300 2500 5350 2500
Wire Wire Line
	5350 2500 5350 2450
$Comp
L Device:R R?
U 1 1 62ED9FD5
P 5350 1950
F 0 "R?" H 5280 1996 50  0000 R CNN
F 1 "1k" H 5280 1905 50  0000 R CNN
F 2 "" V 5280 1950 50  0001 C CNN
F 3 "~" H 5350 1950 50  0001 C CNN
	1    5350 1950
	-1   0    0    -1  
$EndComp
Wire Wire Line
	5350 2100 5350 2150
Wire Wire Line
	4450 1400 4500 1400
$Comp
L power:+5V #PWR?
U 1 1 62F0E14D
P 5350 1750
F 0 "#PWR?" H 5350 1600 50  0001 C CNN
F 1 "+5V" H 5365 1923 50  0000 C CNN
F 2 "" H 5350 1750 50  0001 C CNN
F 3 "" H 5350 1750 50  0001 C CNN
	1    5350 1750
	1    0    0    -1  
$EndComp
Wire Wire Line
	5350 1750 5350 1800
$Comp
L Connector:DIN-5_180degree J?
U 1 1 62F550CF
P 1150 2700
F 0 "J?" H 1150 2425 50  0000 C CNN
F 1 "THRU" H 1150 2334 50  0000 C CNN
F 2 "" H 1150 2700 50  0001 C CNN
F 3 "http://www.mouser.com/ds/2/18/40_c091_abd_e-75918.pdf" H 1150 2700 50  0001 C CNN
	1    1150 2700
	1    0    0    -1  
$EndComp
$Comp
L Device:R R?
U 1 1 62F55FB3
P 800 2400
F 0 "R?" H 730 2354 50  0000 R CNN
F 1 "220R" H 730 2445 50  0000 R CNN
F 2 "" V 730 2400 50  0001 C CNN
F 3 "~" H 800 2400 50  0001 C CNN
	1    800  2400
	-1   0    0    1   
$EndComp
$Comp
L power:+5V #PWR?
U 1 1 62F57960
P 800 2200
F 0 "#PWR?" H 800 2050 50  0001 C CNN
F 1 "+5V" H 815 2373 50  0000 C CNN
F 2 "" H 800 2200 50  0001 C CNN
F 3 "" H 800 2200 50  0001 C CNN
	1    800  2200
	1    0    0    -1  
$EndComp
Wire Wire Line
	850  2600 800  2600
Wire Wire Line
	800  2600 800  2550
Wire Wire Line
	800  2250 800  2200
$Comp
L Device:R R?
U 1 1 62F5A764
P 1650 2600
F 0 "R?" V 1857 2600 50  0000 C CNN
F 1 "220R" V 1766 2600 50  0000 C CNN
F 2 "" V 1580 2600 50  0001 C CNN
F 3 "~" H 1650 2600 50  0001 C CNN
	1    1650 2600
	0    -1   -1   0   
$EndComp
Wire Wire Line
	2500 2600 2450 2600
Wire Wire Line
	3150 2600 3100 2600
$Comp
L 74xx:74LS04 U?
U 1 1 62E9946C
P 2800 2600
F 0 "U?" H 2800 2283 50  0000 C CNN
F 1 "74LS04" H 2800 2374 50  0000 C CNN
F 2 "" H 2800 2600 50  0001 C CNN
F 3 "http://www.ti.com/lit/gpn/sn74LS04" H 2800 2600 50  0001 C CNN
	1    2800 2600
	-1   0    0    1   
$EndComp
Wire Wire Line
	1800 2600 1850 2600
Wire Wire Line
	1450 2600 1500 2600
Wire Wire Line
	4350 2450 4350 2500
Wire Wire Line
	4350 2500 4650 2500
Wire Wire Line
	4650 2500 4650 2450
Wire Wire Line
	4350 2550 4350 2500
Connection ~ 4350 2500
Wire Wire Line
	4650 2500 4700 2500
Connection ~ 4650 2500
Wire Wire Line
	4500 1400 4500 1450
Connection ~ 4500 1400
Wire Wire Line
	4500 1400 5450 1400
Connection ~ 3950 2950
Wire Wire Line
	3950 2950 3950 3000
Wire Wire Line
	3950 2950 3550 2950
Connection ~ 3950 1850
Wire Wire Line
	3950 1800 3950 1850
$Comp
L power:+5V #PWR?
U 1 1 6301A91F
P 3950 1800
F 0 "#PWR?" H 3950 1650 50  0001 C CNN
F 1 "+5V" H 3965 1973 50  0000 C CNN
F 2 "" H 3950 1800 50  0001 C CNN
F 3 "" H 3950 1800 50  0001 C CNN
	1    3950 1800
	1    0    0    -1  
$EndComp
Wire Wire Line
	3950 2950 3950 2550
Wire Wire Line
	3550 2900 3550 2950
Wire Wire Line
	3550 1850 3550 1900
Wire Wire Line
	3950 1850 3550 1850
$Comp
L 74xx:74LS04 U?
U 7 1 62FF7FB0
P 3550 2400
F 0 "U?" V 3800 2450 50  0000 R CNN
F 1 "74LS04" H 3700 2500 50  0001 R CNN
F 2 "" H 3550 2400 50  0001 C CNN
F 3 "http://www.ti.com/lit/gpn/sn74LS04" H 3550 2400 50  0001 C CNN
	7    3550 2400
	1    0    0    -1  
$EndComp
$Comp
L power:GND #PWR?
U 1 1 62E839B1
P 3950 3000
F 0 "#PWR?" H 3950 2750 50  0001 C CNN
F 1 "GND" H 3955 2827 50  0001 C CNN
F 2 "" H 3950 3000 50  0001 C CNN
F 3 "" H 3950 3000 50  0001 C CNN
	1    3950 3000
	1    0    0    -1  
$EndComp
Wire Wire Line
	3950 1850 3950 2250
$Comp
L Device:C C?
U 1 1 62E81769
P 3950 2400
F 0 "C?" H 4065 2446 50  0000 L CNN
F 1 "100nF" H 4065 2355 50  0000 L CNN
F 2 "" H 3988 2250 50  0001 C CNN
F 3 "~" H 3950 2400 50  0001 C CNN
	1    3950 2400
	1    0    0    -1  
$EndComp
NoConn ~ 850  2700
NoConn ~ 1150 2400
NoConn ~ 1450 2700
$EndSCHEMATC
