EESchema Schematic File Version 4
EELAYER 30 0
EELAYER END
$Descr A4 11693 8268
encoding utf-8
Sheet 1 1
Title "Modular Synth Control Voltage Controller"
Date "2022-07-12"
Rev "2"
Comp "(c) 2022 Andreas Messer"
Comment1 ""
Comment2 ""
Comment3 ""
Comment4 ""
$EndDescr
$Comp
L Reference_Voltage:LM4128 U1
U 1 1 62977D7D
P 2000 6900
F 0 "U1" H 2000 7267 50  0000 C CNN
F 1 "LM4132AMF-2.5" H 2000 7176 50  0000 C CNN
F 2 "TO_SOT_Packages_SMD:SOT-23-5" H 2050 6650 50  0001 L CIN
F 3 "http://www.ti.com/lit/ds/symlink/tl071.pdf" V 2000 7000 50  0001 C CIN
	1    2000 6900
	1    0    0    -1  
$EndComp
Text Notes 4000 1050 0    50   ~ 0
ADC 12*32 = 384 Counts <=> 0.234V Uadc <=> 1V/Oct\nADC Ranges:\n3952 <=> 2.412V Uadc <=> -3V CV\n2800 <=> 1.709V Uadc <=> 0V CV\n112 <=> 0.068V Uadc <=> 7V CV\n
Wire Wire Line
	8600 1550 9000 1550
Wire Wire Line
	8000 1650 7950 1650
Wire Wire Line
	7950 1650 7950 1950
Wire Wire Line
	7950 1950 8050 1950
$Comp
L Device:R_POT RV3
U 1 1 6297FBF9
P 8600 1950
F 0 "RV3" H 8530 1904 50  0000 R CNN
F 1 "5k" H 8530 1995 50  0000 R CNN
F 2 "Potentiometers:Potentiometer_Trimmer_Bourns_3296Z" H 8600 1950 50  0001 C CNN
F 3 "~" H 8600 1950 50  0001 C CNN
	1    8600 1950
	0    1    -1   0   
$EndComp
Wire Wire Line
	7850 1950 7950 1950
Connection ~ 7950 1950
$Comp
L Device:R_POT RV1
U 1 1 6299725F
P 7950 1150
F 0 "RV1" V 7800 1150 50  0000 C BNN
F 1 "5k" V 7850 1150 50  0000 C CNN
F 2 "Potentiometers:Potentiometer_Trimmer_Bourns_3296Z" H 7950 1150 50  0001 C CNN
F 3 "~" H 7950 1150 50  0001 C CNN
	1    7950 1150
	0    1    1    0   
$EndComp
Wire Wire Line
	7800 1150 7750 1150
Wire Wire Line
	9000 1550 9000 1300
$Comp
L Device:C C4
U 1 1 629698D2
P 7600 1350
F 0 "C4" H 7400 1350 50  0000 L CNN
F 1 "100nF" H 7300 1250 50  0000 L CNN
F 2 "Capacitors_SMD:C_0603" H 7638 1200 50  0001 C CNN
F 3 "~" H 7600 1350 50  0001 C CNN
	1    7600 1350
	1    0    0    -1  
$EndComp
Wire Wire Line
	7600 1500 7600 1550
Wire Wire Line
	7600 1200 7600 1150
Connection ~ 7600 1150
Wire Wire Line
	7600 1150 7550 1150
$Comp
L Device:R R3
U 1 1 6297DD91
P 7700 1950
F 0 "R3" V 7500 1950 50  0000 C TNN
F 1 "9.1k 1%" V 7600 1950 50  0000 C CNN
F 2 "Resistors_SMD:R_0603" V 7630 1950 50  0001 C CNN
F 3 "~" H 7700 1950 50  0001 C CNN
	1    7700 1950
	0    -1   1    0   
$EndComp
$Comp
L Device:R R5
U 1 1 6297FA8E
P 8200 1950
F 0 "R5" V 8000 1950 50  0000 C TNN
F 1 "36k 1%" V 8100 1950 50  0000 C CNN
F 2 "Resistors_SMD:R_0603" V 8130 1950 50  0001 C CNN
F 3 "~" H 8200 1950 50  0001 C CNN
	1    8200 1950
	0    -1   1    0   
$EndComp
$Comp
L Device:R R1
U 1 1 62980A6F
P 7400 1150
F 0 "R1" V 7200 1150 50  0000 C TNN
F 1 "9.1k 1%" V 7300 1150 50  0000 C CNN
F 2 "Resistors_SMD:R_0603" V 7330 1150 50  0001 C CNN
F 3 "~" H 7400 1150 50  0001 C CNN
	1    7400 1150
	0    -1   1    0   
$EndComp
Connection ~ 7750 1150
Wire Wire Line
	7750 1150 7600 1150
Wire Wire Line
	7950 1350 7950 1300
Wire Wire Line
	7750 1450 8000 1450
$Comp
L Device:C C3
U 1 1 6298835E
P 2350 7050
F 0 "C3" H 2150 7050 50  0000 L CNN
F 1 "100nF" H 2050 6950 50  0000 L CNN
F 2 "Capacitors_SMD:C_0603" H 2388 6900 50  0001 C CNN
F 3 "~" H 2350 7050 50  0001 C CNN
	1    2350 7050
	1    0    0    -1  
$EndComp
Wire Wire Line
	2000 7200 2000 7250
Wire Wire Line
	2000 7250 2350 7250
Wire Wire Line
	2350 7250 2350 7200
Connection ~ 2000 7250
Wire Wire Line
	2000 7250 2000 7300
$Comp
L Device:C C1
U 1 1 6298A2C1
P 1550 7050
F 0 "C1" H 1350 7050 50  0000 L CNN
F 1 "1µF" H 1250 6950 50  0000 L CNN
F 2 "Capacitors_SMD:C_0603" H 1588 6900 50  0001 C CNN
F 3 "~" H 1550 7050 50  0001 C CNN
	1    1550 7050
	1    0    0    -1  
$EndComp
Wire Wire Line
	1700 6900 1650 6900
Wire Wire Line
	1650 6900 1650 6800
Wire Wire Line
	1650 6800 1700 6800
Wire Wire Line
	1550 6900 1550 6800
Wire Wire Line
	1550 6800 1650 6800
Connection ~ 1650 6800
Wire Wire Line
	1550 7200 1550 7250
Wire Wire Line
	1550 7250 2000 7250
Wire Wire Line
	2300 6800 2350 6800
Wire Wire Line
	2350 6800 2350 6900
Wire Wire Line
	2350 6800 2750 6800
Connection ~ 2350 6800
Text Label 2750 6800 2    50   ~ 0
VREF_2.5V
$Comp
L Device:R R9
U 1 1 62989705
P 10150 1300
F 0 "R9" V 9950 1300 50  0000 C TNN
F 1 "1k" V 10050 1300 50  0000 C CNN
F 2 "Resistors_SMD:R_0603" V 10080 1300 50  0001 C CNN
F 3 "~" H 10150 1300 50  0001 C CNN
	1    10150 1300
	0    -1   1    0   
$EndComp
$Comp
L Connector:AudioJack2_Switch J1
U 1 1 629923E7
P 10750 1300
F 0 "J1" H 10570 1308 50  0000 R CNN
F 1 "CV1_A" H 10570 1399 50  0000 R CNN
F 2 "ProjectFootprints:Cliff_CL1384" H 10750 1500 50  0001 C CNN
F 3 "~" H 10750 1500 50  0001 C CNN
F 4 "CL1384" H 10750 1300 50  0001 C CNN "MPN"
F 5 "Cliff" H 10750 1300 50  0001 C CNN "Manufacturer"
	1    10750 1300
	-1   0    0    1   
$EndComp
Wire Wire Line
	10500 1500 10550 1500
Wire Wire Line
	10300 1300 10350 1300
Wire Wire Line
	8000 2850 7950 2850
Wire Wire Line
	7950 2850 7950 3150
Wire Wire Line
	7950 3150 8050 3150
$Comp
L Device:R_POT RV4
U 1 1 629A884A
P 8600 3150
F 0 "RV4" H 8530 3104 50  0000 R CNN
F 1 "5k" H 8530 3195 50  0000 R CNN
F 2 "Potentiometers:Potentiometer_Trimmer_Bourns_3296Z" H 8600 3150 50  0001 C CNN
F 3 "~" H 8600 3150 50  0001 C CNN
	1    8600 3150
	0    1    -1   0   
$EndComp
Wire Wire Line
	7850 3150 7950 3150
Connection ~ 7950 3150
Wire Wire Line
	8150 2350 8100 2350
Wire Wire Line
	7800 2350 7750 2350
Wire Wire Line
	8450 2350 8500 2350
Wire Wire Line
	8500 2350 8500 2400
$Comp
L Device:C C5
U 1 1 629A8865
P 7600 2550
F 0 "C5" H 7400 2550 50  0000 L CNN
F 1 "100nF" H 7300 2450 50  0000 L CNN
F 2 "Capacitors_SMD:C_0603" H 7638 2400 50  0001 C CNN
F 3 "~" H 7600 2550 50  0001 C CNN
	1    7600 2550
	1    0    0    -1  
$EndComp
Wire Wire Line
	7600 2700 7600 2750
Wire Wire Line
	7600 2400 7600 2350
Connection ~ 7600 2350
Wire Wire Line
	7600 2350 7550 2350
$Comp
L Device:R R4
U 1 1 629A8875
P 7700 3150
F 0 "R4" V 7500 3150 50  0000 C TNN
F 1 "9.1k 1%" V 7600 3150 50  0000 C CNN
F 2 "Resistors_SMD:R_0603" V 7630 3150 50  0001 C CNN
F 3 "~" H 7700 3150 50  0001 C CNN
	1    7700 3150
	0    -1   1    0   
$EndComp
$Comp
L Device:R R6
U 1 1 629A887B
P 8200 3150
F 0 "R6" V 8000 3150 50  0000 C TNN
F 1 "36k 1%" V 8100 3150 50  0000 C CNN
F 2 "Resistors_SMD:R_0603" V 8130 3150 50  0001 C CNN
F 3 "~" H 8200 3150 50  0001 C CNN
	1    8200 3150
	0    -1   1    0   
$EndComp
$Comp
L Device:R R8
U 1 1 629A8881
P 8300 2350
F 0 "R8" V 8100 2350 50  0000 C TNN
F 1 "9.1k 1%" V 8200 2350 50  0000 C CNN
F 2 "Resistors_SMD:R_0603" V 8230 2350 50  0001 C CNN
F 3 "~" H 8300 2350 50  0001 C CNN
	1    8300 2350
	0    -1   1    0   
$EndComp
$Comp
L Device:R R2
U 1 1 629A8887
P 7400 2350
F 0 "R2" V 7200 2350 50  0000 C TNN
F 1 "9.1k 1%" V 7300 2350 50  0000 C CNN
F 2 "Resistors_SMD:R_0603" V 7330 2350 50  0001 C CNN
F 3 "~" H 7400 2350 50  0001 C CNN
	1    7400 2350
	0    -1   1    0   
$EndComp
Wire Wire Line
	7750 2350 7750 2550
Connection ~ 7750 2350
Wire Wire Line
	7750 2350 7600 2350
Wire Wire Line
	7750 2550 7950 2550
Connection ~ 7750 2550
Wire Wire Line
	7750 2550 7750 2650
Wire Wire Line
	7950 2550 7950 2500
Wire Wire Line
	7750 2650 8000 2650
$Comp
L Device:R R10
U 1 1 629A8895
P 10150 1800
F 0 "R10" V 9950 1800 50  0000 C TNN
F 1 "1k" V 10050 1800 50  0000 C CNN
F 2 "Resistors_SMD:R_0603" V 10080 1800 50  0001 C CNN
F 3 "~" H 10150 1800 50  0001 C CNN
	1    10150 1800
	0    -1   1    0   
$EndComp
Wire Wire Line
	8350 3150 8400 3150
Wire Wire Line
	8400 2950 8400 3150
Connection ~ 8400 3150
Wire Wire Line
	8400 3150 8450 3150
Wire Wire Line
	10500 2000 10550 2000
Wire Wire Line
	10300 1800 10350 1800
$Comp
L ProjectSymbols:MCP48CVBX2 U2
U 1 1 62976E8B
P 6100 2250
F 0 "U2" H 5550 2700 50  0000 C CNN
F 1 "MCP48CVB22-E/MG" H 6100 2250 50  0000 C CNN
F 2 "ProjectFootprints:QFN-16-1EP_3x3mm_Pitch0.5mm_Microchip" H 6100 2250 50  0001 C CNN
F 3 "" H 6100 2250 50  0001 C CNN
F 4 "MCP48CVB22-E/MG" H 6100 2250 50  0001 C CNN "MPN"
F 5 "MicroChip" H 6100 2250 50  0001 C CNN "Manufacturer"
	1    6100 2250
	1    0    0    -1  
$EndComp
Wire Wire Line
	7550 3150 7150 3150
Wire Wire Line
	6950 2350 6950 1950
Wire Wire Line
	6950 1950 6900 1950
Connection ~ 6950 2350
Wire Wire Line
	6950 2350 6900 2350
Wire Wire Line
	6950 2350 7250 2350
Wire Wire Line
	6950 1950 6950 1150
Wire Wire Line
	6950 1150 7250 1150
Connection ~ 6950 1950
Wire Wire Line
	7050 1950 7550 1950
$Comp
L Device:C C2
U 1 1 629DF423
P 6300 1600
F 0 "C2" H 6100 1600 50  0000 L CNN
F 1 "100nF" H 6000 1500 50  0000 L CNN
F 2 "Capacitors_SMD:C_0603" H 6338 1450 50  0001 C CNN
F 3 "~" H 6300 1600 50  0001 C CNN
	1    6300 1600
	0    1    1    0   
$EndComp
Wire Wire Line
	6100 1650 6100 1600
Wire Wire Line
	6100 1600 6150 1600
Wire Wire Line
	6100 2850 6100 2900
Wire Wire Line
	6100 2900 6150 2900
Wire Wire Line
	6200 2900 6200 2850
Wire Wire Line
	6150 2950 6150 2900
Connection ~ 6150 2900
Wire Wire Line
	6150 2900 6200 2900
Wire Wire Line
	6450 1600 6500 1600
Wire Wire Line
	6500 1600 6500 1650
$Comp
L Device:R R11
U 1 1 629FDB60
P 10300 2300
F 0 "R11" V 10100 2300 50  0000 C TNN
F 1 "1k" V 10200 2300 50  0000 C CNN
F 2 "Resistors_SMD:R_0603" V 10230 2300 50  0001 C CNN
F 3 "~" H 10300 2300 50  0001 C CNN
	1    10300 2300
	0    -1   1    0   
$EndComp
Wire Wire Line
	10500 2500 10550 2500
Wire Wire Line
	10450 2300 10550 2300
Wire Wire Line
	5300 2450 5250 2450
Wire Wire Line
	5250 2450 5250 2550
Wire Wire Line
	5250 2550 5300 2550
$Comp
L Device:R R12
U 1 1 62A0FAF1
P 10300 2800
F 0 "R12" V 10100 2800 50  0000 C TNN
F 1 "1k" V 10200 2800 50  0000 C CNN
F 2 "Resistors_SMD:R_0603" V 10230 2800 50  0001 C CNN
F 3 "~" H 10300 2800 50  0001 C CNN
	1    10300 2800
	0    -1   1    0   
$EndComp
Wire Wire Line
	10500 3100 10500 3000
Wire Wire Line
	10500 3000 10550 3000
$Comp
L Connector:AudioJack2_Switch J2
U 1 1 62A2398F
P 10750 1800
F 0 "J2" H 10570 1808 50  0000 R CNN
F 1 "CV1_B" H 10570 1899 50  0000 R CNN
F 2 "ProjectFootprints:Cliff_CL1384" H 10750 2000 50  0001 C CNN
F 3 "~" H 10750 2000 50  0001 C CNN
F 4 "CL1384" H 10750 1800 50  0001 C CNN "MPN"
F 5 "Cliff" H 10750 1800 50  0001 C CNN "Manufacturer"
	1    10750 1800
	-1   0    0    1   
$EndComp
$Comp
L Connector:AudioJack2_Switch J3
U 1 1 62A24553
P 10750 2300
F 0 "J3" H 10570 2308 50  0000 R CNN
F 1 "GATE1_C" H 10570 2399 50  0000 R CNN
F 2 "ProjectFootprints:Cliff_CL1384" H 10750 2500 50  0001 C CNN
F 3 "~" H 10750 2500 50  0001 C CNN
F 4 "CL1384" H 10750 2300 50  0001 C CNN "MPN"
F 5 "Cliff" H 10750 2300 50  0001 C CNN "Manufacturer"
	1    10750 2300
	-1   0    0    1   
$EndComp
$Comp
L Connector:AudioJack2_Switch J4
U 1 1 62A25465
P 10750 2800
F 0 "J4" H 10570 2808 50  0000 R CNN
F 1 "GATE1_D" H 10570 2899 50  0000 R CNN
F 2 "ProjectFootprints:Cliff_CL1384_Border" H 10750 3000 50  0001 C CNN
F 3 "~" H 10750 3000 50  0001 C CNN
F 4 "CL1384" H 10750 2800 50  0001 C CNN "MPN"
F 5 "Cliff" H 10750 2800 50  0001 C CNN "Manufacturer"
	1    10750 2800
	-1   0    0    1   
$EndComp
$Comp
L Amplifier_Operational:TL072 U3
U 1 1 62A29323
P 8300 1550
F 0 "U3" H 8300 1917 50  0000 C CNN
F 1 "TL072" H 8300 1826 50  0000 C CNN
F 2 "Housings_SOIC:SOIC-8_3.9x4.9mm_Pitch1.27mm" H 8300 1550 50  0001 C CNN
F 3 "http://www.ti.com/lit/ds/symlink/tl071.pdf" H 8300 1550 50  0001 C CNN
	1    8300 1550
	1    0    0    -1  
$EndComp
$Comp
L Amplifier_Operational:TL072 U3
U 2 1 62A30AF3
P 8300 2750
F 0 "U3" H 8300 3117 50  0000 C CNN
F 1 "TL072" H 8300 3026 50  0000 C CNN
F 2 "Housings_SOIC:SOIC-8_3.9x4.9mm_Pitch1.27mm" H 8300 2750 50  0001 C CNN
F 3 "http://www.ti.com/lit/ds/symlink/tl071.pdf" H 8300 2750 50  0001 C CNN
	2    8300 2750
	1    0    0    -1  
$EndComp
$Comp
L Mechanical:Housing N1
U 1 1 62A57055
P 5250 6650
F 0 "N1" H 5403 6684 50  0000 L CNN
F 1 "Housing" H 5403 6593 50  0000 L CNN
F 2 "ProjectFootprints:Eurorack" H 5300 6700 50  0001 C CNN
F 3 "~" H 5300 6700 50  0001 C CNN
	1    5250 6650
	1    0    0    -1  
$EndComp
$Comp
L MCU_Microchip_ATmega:ATmega8L-8PU U4
U 1 1 62A69EF7
P 2500 2300
F 0 "U4" H 2050 3650 50  0000 C CNN
F 1 "ATmega8L-8PU" H 2500 2300 50  0000 C CNN
F 2 "Housings_DIP:DIP-28_W7.62mm" H 2500 2300 50  0001 C CIN
F 3 "http://ww1.microchip.com/downloads/en/DeviceDoc/atmel-2486-8-bit-avr-microcontroller-atmega8_l_datasheet.pdf" H 2500 2300 50  0001 C CNN
	1    2500 2300
	1    0    0    -1  
$EndComp
$Comp
L power:GND #PWR0104
U 1 1 62A6F69B
P 2550 3800
F 0 "#PWR0104" H 2550 3550 50  0001 C CNN
F 1 "GND" H 2555 3627 50  0001 C CNN
F 2 "" H 2550 3800 50  0001 C CNN
F 3 "" H 2550 3800 50  0001 C CNN
	1    2550 3800
	-1   0    0    -1  
$EndComp
Wire Wire Line
	2500 3700 2500 3750
Wire Wire Line
	2500 3750 2550 3750
Wire Wire Line
	2600 3750 2600 3700
Wire Wire Line
	2550 3750 2550 3800
Connection ~ 2550 3750
Wire Wire Line
	2550 3750 2600 3750
$Comp
L Device:R R13
U 1 1 62A783D1
P 1850 1000
F 0 "R13" V 1650 1000 50  0000 C TNN
F 1 "9.1k 1%" V 1750 1000 50  0000 C CNN
F 2 "Resistors_SMD:R_0603" V 1780 1000 50  0001 C CNN
F 3 "~" H 1850 1000 50  0001 C CNN
	1    1850 1000
	-1   0    0    -1  
$EndComp
Wire Wire Line
	1900 1200 1850 1200
Wire Wire Line
	1850 1200 1850 1150
$Comp
L power:+5V #PWR0107
U 1 1 62A81579
P 1450 750
F 0 "#PWR0107" H 1450 600 50  0001 C CNN
F 1 "+5V" H 1465 923 50  0000 C CNN
F 2 "" H 1450 750 50  0001 C CNN
F 3 "" H 1450 750 50  0001 C CNN
	1    1450 750 
	1    0    0    -1  
$EndComp
$Comp
L Device:Crystal Y1
U 1 1 62A87565
P 1200 1600
F 0 "Y1" H 1200 1868 50  0000 C CNN
F 1 "Crystal" H 1200 1777 50  0000 C CNN
F 2 "Crystals:Crystal_HC49-U_Vertical" H 1200 1600 50  0001 C CNN
F 3 "~" H 1200 1600 50  0001 C CNN
	1    1200 1600
	1    0    0    -1  
$EndComp
Wire Wire Line
	1900 1600 1400 1600
$Comp
L Device:C C7
U 1 1 62A8C2C7
P 1400 1800
F 0 "C7" H 1200 1800 50  0000 L CNN
F 1 "10pF" H 1100 1700 50  0000 L CNN
F 2 "Capacitors_SMD:C_0603" H 1438 1650 50  0001 C CNN
F 3 "~" H 1400 1800 50  0001 C CNN
	1    1400 1800
	1    0    0    -1  
$EndComp
Wire Wire Line
	1400 1650 1400 1600
Connection ~ 1400 1600
Wire Wire Line
	1400 1600 1350 1600
Wire Wire Line
	1000 1400 1000 1600
Wire Wire Line
	1000 1600 1050 1600
$Comp
L Device:C C6
U 1 1 62A9D473
P 1000 1800
F 0 "C6" H 800 1800 50  0000 L CNN
F 1 "10pF" H 700 1700 50  0000 L CNN
F 2 "Capacitors_SMD:C_0603" H 1038 1650 50  0001 C CNN
F 3 "~" H 1000 1800 50  0001 C CNN
	1    1000 1800
	1    0    0    -1  
$EndComp
Wire Wire Line
	1000 1600 1000 1650
Connection ~ 1000 1600
Wire Wire Line
	1000 1400 1900 1400
$Comp
L power:GND #PWR0110
U 1 1 62AA717D
P 1000 2000
F 0 "#PWR0110" H 1000 1750 50  0001 C CNN
F 1 "GND" H 1005 1827 50  0001 C CNN
F 2 "" H 1000 2000 50  0001 C CNN
F 3 "" H 1000 2000 50  0001 C CNN
	1    1000 2000
	-1   0    0    -1  
$EndComp
Wire Wire Line
	1000 1950 1000 2000
$Comp
L power:GND #PWR0112
U 1 1 62AAC090
P 1400 2000
F 0 "#PWR0112" H 1400 1750 50  0001 C CNN
F 1 "GND" H 1405 1827 50  0001 C CNN
F 2 "" H 1400 2000 50  0001 C CNN
F 3 "" H 1400 2000 50  0001 C CNN
	1    1400 2000
	-1   0    0    -1  
$EndComp
Wire Wire Line
	1400 1950 1400 2000
Text Label 6550 1150 0    50   ~ 0
VREF_2.5V
Wire Wire Line
	6550 1150 6950 1150
Connection ~ 6950 1150
$Comp
L power:+5V #PWR0113
U 1 1 62AB9796
P 6100 1550
F 0 "#PWR0113" H 6100 1400 50  0001 C CNN
F 1 "+5V" H 6115 1723 50  0000 C CNN
F 2 "" H 6100 1550 50  0001 C CNN
F 3 "" H 6100 1550 50  0001 C CNN
	1    6100 1550
	1    0    0    -1  
$EndComp
Wire Wire Line
	6100 1550 6100 1600
Connection ~ 6100 1600
$Comp
L Connector_Generic:Conn_02x08_Odd_Even J5
U 1 1 62BE6D47
P 1200 3150
F 0 "J5" H 1250 2525 50  0000 C CNN
F 1 "Bus" H 1250 2616 50  0000 C CNN
F 2 "Pin_Headers:Pin_Header_Straight_2x08_Pitch2.54mm" H 1200 3150 50  0001 C CNN
F 3 "~" H 1200 3150 50  0001 C CNN
	1    1200 3150
	-1   0    0    1   
$EndComp
$Comp
L power:-12V #PWR0117
U 1 1 62BED614
P 1700 3500
F 0 "#PWR0117" H 1700 3600 50  0001 C CNN
F 1 "-12V" H 1715 3673 50  0000 C CNN
F 2 "" H 1700 3500 50  0001 C CNN
F 3 "" H 1700 3500 50  0001 C CNN
	1    1700 3500
	-1   0    0    1   
$EndComp
Wire Wire Line
	900  3450 1400 3450
Wire Wire Line
	1400 3450 1700 3450
Wire Wire Line
	1700 3450 1700 3500
Connection ~ 1400 3450
Wire Wire Line
	900  3350 1400 3350
Wire Wire Line
	900  3250 1400 3250
Wire Wire Line
	900  3150 1400 3150
Wire Wire Line
	1550 3200 1550 3150
Wire Wire Line
	1550 3150 1400 3150
Connection ~ 1400 3150
Wire Wire Line
	1400 3150 1400 3250
Connection ~ 1400 3250
Wire Wire Line
	1400 3250 1400 3350
Connection ~ 1400 3350
$Comp
L power:+12V #PWR0119
U 1 1 62C2EFAE
P 1700 2700
F 0 "#PWR0119" H 1700 2550 50  0001 C CNN
F 1 "+12V" H 1715 2873 50  0000 C CNN
F 2 "" H 1700 2700 50  0001 C CNN
F 3 "" H 1700 2700 50  0001 C CNN
	1    1700 2700
	1    0    0    -1  
$EndComp
Wire Wire Line
	900  3050 1400 3050
Wire Wire Line
	900  2950 1400 2950
Wire Wire Line
	900  2850 1400 2850
Wire Wire Line
	900  2750 1400 2750
$Comp
L power:+5V #PWR0120
U 1 1 62C4FCCA
P 1500 2700
F 0 "#PWR0120" H 1500 2550 50  0001 C CNN
F 1 "+5V" H 1515 2873 50  0000 C CNN
F 2 "" H 1500 2700 50  0001 C CNN
F 3 "" H 1500 2700 50  0001 C CNN
	1    1500 2700
	1    0    0    -1  
$EndComp
Wire Wire Line
	1400 2950 1500 2950
Wire Wire Line
	1500 2950 1500 2700
Connection ~ 1400 2950
Wire Wire Line
	1400 3050 1700 3050
Wire Wire Line
	1700 3050 1700 2700
Connection ~ 1400 3050
Text Label 1900 2850 2    50   ~ 0
CV
Text Label 1900 2750 2    50   ~ 0
GATE
Wire Wire Line
	1900 2750 1400 2750
Connection ~ 1400 2750
Wire Wire Line
	1400 2850 1900 2850
Connection ~ 1400 2850
$Comp
L Device:C C8
U 1 1 62CA6A78
P 1450 1000
F 0 "C8" H 1250 1000 50  0000 L CNN
F 1 "100nF" H 1150 900 50  0000 L CNN
F 2 "Capacitors_SMD:C_0603" H 1488 850 50  0001 C CNN
F 3 "~" H 1450 1000 50  0001 C CNN
	1    1450 1000
	-1   0    0    1   
$EndComp
$Comp
L power:GND #PWR0121
U 1 1 62CAF580
P 1450 1200
F 0 "#PWR0121" H 1450 950 50  0001 C CNN
F 1 "GND" H 1455 1027 50  0001 C CNN
F 2 "" H 1450 1200 50  0001 C CNN
F 3 "" H 1450 1200 50  0001 C CNN
	1    1450 1200
	-1   0    0    -1  
$EndComp
Wire Wire Line
	1450 1150 1450 1200
Wire Wire Line
	1450 850  1450 800 
Wire Wire Line
	1450 800  1850 800 
Wire Wire Line
	1850 800  1850 850 
Wire Wire Line
	1450 750  1450 800 
Connection ~ 1450 800 
Wire Wire Line
	1850 800  2500 800 
Connection ~ 1850 800 
Wire Wire Line
	2500 800  2500 900 
$Comp
L Device:C C9
U 1 1 62CF3FD2
P 1850 2000
F 0 "C9" H 1650 2000 50  0000 L CNN
F 1 "100nF" H 1550 1900 50  0000 L CNN
F 2 "Capacitors_SMD:C_0603" H 1888 1850 50  0001 C CNN
F 3 "~" H 1850 2000 50  0001 C CNN
	1    1850 2000
	-1   0    0    1   
$EndComp
$Comp
L power:GND #PWR0122
U 1 1 62CF4576
P 1850 2200
F 0 "#PWR0122" H 1850 1950 50  0001 C CNN
F 1 "GND" H 1855 2027 50  0001 C CNN
F 2 "" H 1850 2200 50  0001 C CNN
F 3 "" H 1850 2200 50  0001 C CNN
	1    1850 2200
	-1   0    0    -1  
$EndComp
Wire Wire Line
	1850 2150 1850 2200
Wire Wire Line
	1900 1800 1850 1800
Wire Wire Line
	1850 1800 1850 1850
Wire Wire Line
	2500 800  2600 800 
Wire Wire Line
	2600 800  2600 900 
Connection ~ 2500 800 
Wire Wire Line
	10500 2000 10500 2400
Connection ~ 10500 2000
Connection ~ 10500 2500
Wire Wire Line
	10500 2500 10500 2900
Connection ~ 10500 3000
Wire Wire Line
	10500 1500 10500 1900
Wire Wire Line
	8700 2750 8700 2150
Text Label 3450 1700 2    50   ~ 0
SCK
Text Label 3450 1600 2    50   ~ 0
MISO
Text Label 3450 1500 2    50   ~ 0
MOSI
Text Label 3100 2600 0    50   ~ 0
RXD
Text Label 3100 2700 0    50   ~ 0
TXD
$Comp
L power:-12V #PWR0123
U 1 1 630B099F
P 4300 5500
F 0 "#PWR0123" H 4300 5600 50  0001 C CNN
F 1 "-12V" H 4315 5673 50  0000 C CNN
F 2 "" H 4300 5500 50  0001 C CNN
F 3 "" H 4300 5500 50  0001 C CNN
	1    4300 5500
	-1   0    0    1   
$EndComp
$Comp
L power:+12V #PWR0125
U 1 1 630DE906
P 3500 4750
F 0 "#PWR0125" H 3500 4600 50  0001 C CNN
F 1 "+12V" H 3515 4923 50  0000 C CNN
F 2 "" H 3500 4750 50  0001 C CNN
F 3 "" H 3500 4750 50  0001 C CNN
	1    3500 4750
	1    0    0    -1  
$EndComp
$Comp
L power:+5V #PWR0126
U 1 1 630E9CD3
P 3300 4750
F 0 "#PWR0126" H 3300 4600 50  0001 C CNN
F 1 "+5V" H 3315 4923 50  0000 C CNN
F 2 "" H 3300 4750 50  0001 C CNN
F 3 "" H 3300 4750 50  0001 C CNN
	1    3300 4750
	1    0    0    -1  
$EndComp
Text Label 4700 5150 2    50   ~ 0
SCK
Text Label 4700 5250 2    50   ~ 0
MISO
Text Label 3350 5150 0    50   ~ 0
MOSI
Wire Wire Line
	4700 5350 4250 5350
Wire Wire Line
	3350 5350 3750 5350
Wire Wire Line
	4700 5250 4250 5250
Text Label 4700 5350 2    50   ~ 0
CS1
Wire Wire Line
	3300 5250 3750 5250
Text Label 3350 5350 0    50   ~ 0
LAT1
Text Label 5100 2450 0    50   ~ 0
LAT0
Text Label 5050 2050 0    50   ~ 0
MISO
Text Label 5050 1950 0    50   ~ 0
MOSI
Text Label 5050 2150 0    50   ~ 0
SCK
Text Label 5050 2250 0    50   ~ 0
CS0
Text Label 4700 4950 2    50   ~ 0
VREF_2.5V
$Comp
L Connector_Generic:Conn_02x07_Odd_Even J6
U 1 1 6334D4AB
P 4050 5150
F 0 "J6" H 4100 4625 50  0000 C CNN
F 1 "INTERCONNECT" H 4100 4716 50  0000 C CNN
F 2 "Socket_Strips:Socket_Strip_Straight_2x07_Pitch2.54mm" H 4050 5150 50  0001 C CNN
F 3 "~" H 4050 5150 50  0001 C CNN
	1    4050 5150
	-1   0    0    1   
$EndComp
Wire Wire Line
	4700 5450 4250 5450
Wire Wire Line
	3750 5450 3350 5450
Wire Wire Line
	5050 1950 5300 1950
Wire Wire Line
	5300 2050 5050 2050
Wire Wire Line
	5050 2150 5300 2150
Wire Wire Line
	5300 2250 5250 2250
Wire Wire Line
	5100 2450 5250 2450
Connection ~ 5250 2450
$Comp
L power:+5V #PWR0127
U 1 1 63486AA4
P 3900 1850
F 0 "#PWR0127" H 3900 1700 50  0001 C CNN
F 1 "+5V" H 3915 2023 50  0000 C CNN
F 2 "" H 3900 1850 50  0001 C CNN
F 3 "" H 3900 1850 50  0001 C CNN
	1    3900 1850
	1    0    0    -1  
$EndComp
Wire Wire Line
	3900 1850 3900 2500
Wire Wire Line
	3900 2500 3950 2500
$Comp
L power:GND #PWR0128
U 1 1 63495B9F
P 3900 3100
F 0 "#PWR0128" H 3900 2850 50  0001 C CNN
F 1 "GND" H 3905 2927 50  0001 C CNN
F 2 "" H 3900 3100 50  0001 C CNN
F 3 "" H 3900 3100 50  0001 C CNN
	1    3900 3100
	-1   0    0    -1  
$EndComp
Wire Wire Line
	3950 2600 3900 2600
Wire Wire Line
	3900 2600 3900 3100
Text Label 3450 1400 2    50   ~ 0
CS0
Text Label 3450 3100 2    50   ~ 0
CS1
Text Label 3450 3200 2    50   ~ 0
LAT0
Text Label 9600 1950 3    50   ~ 0
GATE1_C
Text Label 9900 1950 3    50   ~ 0
GATE1_D
Text Label 3450 2000 2    50   ~ 0
GATE1_C
Text Label 3450 2800 2    50   ~ 0
GATE1_D
Wire Wire Line
	3100 2000 3450 2000
Wire Wire Line
	3100 1900 3450 1900
$Comp
L power:GNDA #PWR0101
U 1 1 635E87A2
P 6150 2950
F 0 "#PWR0101" H 6150 2700 50  0001 C CNN
F 1 "GNDA" H 6155 2777 50  0000 C CNN
F 2 "" H 6150 2950 50  0001 C CNN
F 3 "" H 6150 2950 50  0001 C CNN
	1    6150 2950
	1    0    0    -1  
$EndComp
$Comp
L power:GNDA #PWR0102
U 1 1 635EC076
P 7600 1550
F 0 "#PWR0102" H 7600 1300 50  0001 C CNN
F 1 "GNDA" H 7605 1377 50  0000 C CNN
F 2 "" H 7600 1550 50  0001 C CNN
F 3 "" H 7600 1550 50  0001 C CNN
	1    7600 1550
	1    0    0    -1  
$EndComp
$Comp
L power:GNDA #PWR0105
U 1 1 635F83E7
P 8500 2400
F 0 "#PWR0105" H 8500 2150 50  0001 C CNN
F 1 "GNDA" H 8505 2227 50  0000 C CNN
F 2 "" H 8500 2400 50  0001 C CNN
F 3 "" H 8500 2400 50  0001 C CNN
	1    8500 2400
	1    0    0    -1  
$EndComp
$Comp
L power:GNDA #PWR0106
U 1 1 635F9DC1
P 7600 2750
F 0 "#PWR0106" H 7600 2500 50  0001 C CNN
F 1 "GNDA" H 7605 2577 50  0000 C CNN
F 2 "" H 7600 2750 50  0001 C CNN
F 3 "" H 7600 2750 50  0001 C CNN
	1    7600 2750
	1    0    0    -1  
$EndComp
$Comp
L power:GNDA #PWR0108
U 1 1 635FE603
P 10500 3100
F 0 "#PWR0108" H 10500 2850 50  0001 C CNN
F 1 "GNDA" H 10505 2927 50  0000 C CNN
F 2 "" H 10500 3100 50  0001 C CNN
F 3 "" H 10500 3100 50  0001 C CNN
	1    10500 3100
	1    0    0    -1  
$EndComp
$Comp
L power:GNDA #PWR0116
U 1 1 6363C7A2
P 2000 7300
F 0 "#PWR0116" H 2000 7050 50  0001 C CNN
F 1 "GNDA" H 2005 7127 50  0000 C CNN
F 2 "" H 2000 7300 50  0001 C CNN
F 3 "" H 2000 7300 50  0001 C CNN
	1    2000 7300
	1    0    0    -1  
$EndComp
$Comp
L power:GND #PWR0124
U 1 1 63641A20
P 1850 3200
F 0 "#PWR0124" H 1850 2950 50  0001 C CNN
F 1 "GND" H 1855 3027 50  0001 C CNN
F 2 "" H 1850 3200 50  0001 C CNN
F 3 "" H 1850 3200 50  0001 C CNN
	1    1850 3200
	-1   0    0    -1  
$EndComp
$Comp
L Device:Net-Tie_2 NT1
U 1 1 63770B5E
P 1700 3150
F 0 "NT1" H 1700 3200 50  0000 C CNN
F 1 "Net-Tie_2" H 1700 3150 50  0001 C CNN
F 2 "Oddities:NetTie-I_Connected_SMD" H 1700 3150 50  0001 C CNN
F 3 "~" H 1700 3150 50  0001 C CNN
	1    1700 3150
	1    0    0    -1  
$EndComp
$Comp
L power:GNDA #PWR0129
U 1 1 637A6C96
P 1550 3200
F 0 "#PWR0129" H 1550 2950 50  0001 C CNN
F 1 "GNDA" H 1555 3027 50  0000 C CNN
F 2 "" H 1550 3200 50  0001 C CNN
F 3 "" H 1550 3200 50  0001 C CNN
	1    1550 3200
	1    0    0    -1  
$EndComp
Wire Wire Line
	1550 3150 1600 3150
Connection ~ 1550 3150
Wire Wire Line
	1800 3150 1850 3150
Wire Wire Line
	1850 3150 1850 3200
$Comp
L Device:LED D7
U 1 1 62A33A62
P 9900 2550
F 0 "D7" V 9939 2432 50  0000 R CNN
F 1 "LED" V 9848 2432 50  0000 R CNN
F 2 "LEDs:LED_D3.0mm_Horizontal_O6.35mm_Z10.0mm" H 9900 2550 50  0001 C CNN
F 3 "~" H 9900 2550 50  0001 C CNN
	1    9900 2550
	0    -1   -1   0   
$EndComp
$Comp
L Device:R R28
U 1 1 62A3D043
P 9900 2900
F 0 "R28" V 9700 2900 50  0000 C TNN
F 1 "1k" V 9800 2900 50  0000 C CNN
F 2 "Resistors_SMD:R_0603" V 9830 2900 50  0001 C CNN
F 3 "~" H 9900 2900 50  0001 C CNN
	1    9900 2900
	-1   0    0    -1  
$EndComp
$Comp
L power:GNDA #PWR0130
U 1 1 62A53AB3
P 9900 3100
F 0 "#PWR0130" H 9900 2850 50  0001 C CNN
F 1 "GNDA" H 9905 2927 50  0000 C CNN
F 2 "" H 9900 3100 50  0001 C CNN
F 3 "" H 9900 3100 50  0001 C CNN
	1    9900 3100
	1    0    0    -1  
$EndComp
Wire Wire Line
	9900 3050 9900 3100
$Comp
L Device:LED D5
U 1 1 62A6BD41
P 9600 2550
F 0 "D5" V 9639 2432 50  0000 R CNN
F 1 "LED" V 9548 2432 50  0000 R CNN
F 2 "LEDs:LED_D3.0mm_Horizontal_O6.35mm_Z10.0mm" H 9600 2550 50  0001 C CNN
F 3 "~" H 9600 2550 50  0001 C CNN
	1    9600 2550
	0    -1   -1   0   
$EndComp
$Comp
L Device:R R26
U 1 1 62A6BD47
P 9600 2900
F 0 "R26" V 9400 2900 50  0000 C TNN
F 1 "1k" V 9500 2900 50  0000 C CNN
F 2 "Resistors_SMD:R_0603" V 9530 2900 50  0001 C CNN
F 3 "~" H 9600 2900 50  0001 C CNN
	1    9600 2900
	-1   0    0    -1  
$EndComp
$Comp
L power:GNDA #PWR0131
U 1 1 62A6BD4D
P 9600 3100
F 0 "#PWR0131" H 9600 2850 50  0001 C CNN
F 1 "GNDA" H 9605 2927 50  0000 C CNN
F 2 "" H 9600 3100 50  0001 C CNN
F 3 "" H 9600 3100 50  0001 C CNN
	1    9600 3100
	1    0    0    -1  
$EndComp
Wire Wire Line
	9600 3050 9600 3100
Wire Wire Line
	9600 2750 9600 2700
Wire Wire Line
	9900 2750 9900 2700
Wire Wire Line
	9600 2300 9600 2400
Wire Wire Line
	9600 2300 10150 2300
Wire Wire Line
	10100 2350 9900 2350
Wire Wire Line
	9900 2350 9900 2400
$Comp
L Device:LED D3
U 1 1 62C18E9A
P 9300 2550
F 0 "D3" V 9339 2432 50  0000 R CNN
F 1 "LED" V 9248 2432 50  0000 R CNN
F 2 "LEDs:LED_D3.0mm_Horizontal_O6.35mm_Z10.0mm" H 9300 2550 50  0001 C CNN
F 3 "~" H 9300 2550 50  0001 C CNN
	1    9300 2550
	0    -1   -1   0   
$EndComp
$Comp
L Device:R R24
U 1 1 62C18EA0
P 9300 2900
F 0 "R24" V 9100 2900 50  0000 C TNN
F 1 "1k" V 9200 2900 50  0000 C CNN
F 2 "Resistors_SMD:R_0603" V 9230 2900 50  0001 C CNN
F 3 "~" H 9300 2900 50  0001 C CNN
	1    9300 2900
	-1   0    0    -1  
$EndComp
$Comp
L power:GNDA #PWR0132
U 1 1 62C18EA6
P 9300 3100
F 0 "#PWR0132" H 9300 2850 50  0001 C CNN
F 1 "GNDA" H 9305 2927 50  0000 C CNN
F 2 "" H 9300 3100 50  0001 C CNN
F 3 "" H 9300 3100 50  0001 C CNN
	1    9300 3100
	1    0    0    -1  
$EndComp
Wire Wire Line
	9300 3050 9300 3100
Wire Wire Line
	9300 2750 9300 2700
$Comp
L Device:LED D1
U 1 1 62C29CCE
P 9000 2550
F 0 "D1" V 9039 2432 50  0000 R CNN
F 1 "LED" V 8948 2432 50  0000 R CNN
F 2 "LEDs:LED_D3.0mm_Horizontal_O6.35mm_Z10.0mm" H 9000 2550 50  0001 C CNN
F 3 "~" H 9000 2550 50  0001 C CNN
	1    9000 2550
	0    -1   -1   0   
$EndComp
$Comp
L Device:R R22
U 1 1 62C29CD4
P 9000 2900
F 0 "R22" V 8800 2900 50  0000 C TNN
F 1 "1k" V 8900 2900 50  0000 C CNN
F 2 "Resistors_SMD:R_0603" V 8930 2900 50  0001 C CNN
F 3 "~" H 9000 2900 50  0001 C CNN
	1    9000 2900
	-1   0    0    -1  
$EndComp
$Comp
L power:GNDA #PWR0133
U 1 1 62C29CDA
P 9000 3100
F 0 "#PWR0133" H 9000 2850 50  0001 C CNN
F 1 "GNDA" H 9005 2927 50  0000 C CNN
F 2 "" H 9000 3100 50  0001 C CNN
F 3 "" H 9000 3100 50  0001 C CNN
	1    9000 3100
	1    0    0    -1  
$EndComp
Wire Wire Line
	9000 3050 9000 3100
Wire Wire Line
	9000 2750 9000 2700
Wire Wire Line
	9300 1800 9300 2150
Wire Wire Line
	9300 1800 10000 1800
Wire Wire Line
	9000 1300 10000 1300
Wire Wire Line
	8000 4550 7950 4550
Wire Wire Line
	7950 4550 7950 4850
Wire Wire Line
	7950 4850 8050 4850
$Comp
L Device:R_POT RV7
U 1 1 62D00046
P 8600 4850
F 0 "RV7" H 8530 4804 50  0000 R CNN
F 1 "5k" H 8530 4895 50  0000 R CNN
F 2 "Potentiometers:Potentiometer_Trimmer_Bourns_3296Z" H 8600 4850 50  0001 C CNN
F 3 "~" H 8600 4850 50  0001 C CNN
	1    8600 4850
	0    1    -1   0   
$EndComp
Wire Wire Line
	7850 4850 7950 4850
Connection ~ 7950 4850
$Comp
L Device:R_POT RV5
U 1 1 62D0004F
P 7950 4050
F 0 "RV5" V 7800 4050 50  0000 C BNN
F 1 "5k" V 7850 4050 50  0000 C CNN
F 2 "Potentiometers:Potentiometer_Trimmer_Bourns_3296Z" H 7950 4050 50  0001 C CNN
F 3 "~" H 7950 4050 50  0001 C CNN
	1    7950 4050
	0    1    1    0   
$EndComp
Wire Wire Line
	8150 4050 8100 4050
Wire Wire Line
	7800 4050 7750 4050
Wire Wire Line
	8450 4050 8500 4050
Wire Wire Line
	8500 4050 8500 4100
$Comp
L Device:C C15
U 1 1 62D0005B
P 7600 4250
F 0 "C15" H 7400 4250 50  0000 L CNN
F 1 "100nF" H 7300 4150 50  0000 L CNN
F 2 "Capacitors_SMD:C_0603" H 7638 4100 50  0001 C CNN
F 3 "~" H 7600 4250 50  0001 C CNN
	1    7600 4250
	1    0    0    -1  
$EndComp
Wire Wire Line
	7600 4400 7600 4450
Wire Wire Line
	7600 4100 7600 4050
Connection ~ 7600 4050
Wire Wire Line
	7600 4050 7550 4050
$Comp
L Device:R R16
U 1 1 62D00065
P 7700 4850
F 0 "R16" V 7500 4850 50  0000 C TNN
F 1 "9.1k 1%" V 7600 4850 50  0000 C CNN
F 2 "Resistors_SMD:R_0603" V 7630 4850 50  0001 C CNN
F 3 "~" H 7700 4850 50  0001 C CNN
	1    7700 4850
	0    -1   1    0   
$EndComp
$Comp
L Device:R R18
U 1 1 62D0006B
P 8200 4850
F 0 "R18" V 8000 4850 50  0000 C TNN
F 1 "36k 1%" V 8100 4850 50  0000 C CNN
F 2 "Resistors_SMD:R_0603" V 8130 4850 50  0001 C CNN
F 3 "~" H 8200 4850 50  0001 C CNN
	1    8200 4850
	0    -1   1    0   
$EndComp
$Comp
L Device:R R20
U 1 1 62D00071
P 8300 4050
F 0 "R20" V 8100 4050 50  0000 C TNN
F 1 "9.1k 1%" V 8200 4050 50  0000 C CNN
F 2 "Resistors_SMD:R_0603" V 8230 4050 50  0001 C CNN
F 3 "~" H 8300 4050 50  0001 C CNN
	1    8300 4050
	0    -1   1    0   
$EndComp
$Comp
L Device:R R14
U 1 1 62D00077
P 7400 4050
F 0 "R14" V 7200 4050 50  0000 C TNN
F 1 "9.1k 1%" V 7300 4050 50  0000 C CNN
F 2 "Resistors_SMD:R_0603" V 7330 4050 50  0001 C CNN
F 3 "~" H 7400 4050 50  0001 C CNN
	1    7400 4050
	0    -1   1    0   
$EndComp
Wire Wire Line
	7750 4050 7750 4250
Connection ~ 7750 4050
Wire Wire Line
	7750 4050 7600 4050
Wire Wire Line
	7750 4250 7950 4250
Connection ~ 7750 4250
Wire Wire Line
	7750 4250 7750 4350
Wire Wire Line
	7950 4250 7950 4200
Wire Wire Line
	7750 4350 8000 4350
$Comp
L Device:R R30
U 1 1 62D00085
P 10150 4200
F 0 "R30" V 9950 4200 50  0000 C TNN
F 1 "1k" V 10050 4200 50  0000 C CNN
F 2 "Resistors_SMD:R_0603" V 10080 4200 50  0001 C CNN
F 3 "~" H 10150 4200 50  0001 C CNN
	1    10150 4200
	0    -1   1    0   
$EndComp
$Comp
L Connector:AudioJack2_Switch J9
U 1 1 62D00092
P 10750 4200
F 0 "J9" H 10570 4208 50  0000 R CNN
F 1 "CV2_E" H 10570 4299 50  0000 R CNN
F 2 "ProjectFootprints:Cliff_CL1384" H 10750 4400 50  0001 C CNN
F 3 "~" H 10750 4400 50  0001 C CNN
F 4 "CL1384" H 10750 4200 50  0001 C CNN "MPN"
F 5 "Cliff" H 10750 4200 50  0001 C CNN "Manufacturer"
	1    10750 4200
	-1   0    0    1   
$EndComp
Wire Wire Line
	10500 4400 10550 4400
Wire Wire Line
	10300 4200 10350 4200
Wire Wire Line
	8000 5750 7950 5750
Wire Wire Line
	7950 5750 7950 6050
Wire Wire Line
	7950 6050 8050 6050
$Comp
L Device:R_POT RV8
U 1 1 62D000A0
P 8600 6050
F 0 "RV8" H 8530 6004 50  0000 R CNN
F 1 "5k" H 8530 6095 50  0000 R CNN
F 2 "Potentiometers:Potentiometer_Trimmer_Bourns_3296Z" H 8600 6050 50  0001 C CNN
F 3 "~" H 8600 6050 50  0001 C CNN
	1    8600 6050
	0    1    -1   0   
$EndComp
Wire Wire Line
	7850 6050 7950 6050
Connection ~ 7950 6050
Wire Wire Line
	8150 5250 8100 5250
Wire Wire Line
	7800 5250 7750 5250
Wire Wire Line
	8450 5250 8500 5250
Wire Wire Line
	8500 5250 8500 5300
$Comp
L Device:C C16
U 1 1 62D000B4
P 7600 5450
F 0 "C16" H 7400 5450 50  0000 L CNN
F 1 "100nF" H 7300 5350 50  0000 L CNN
F 2 "Capacitors_SMD:C_0603" H 7638 5300 50  0001 C CNN
F 3 "~" H 7600 5450 50  0001 C CNN
	1    7600 5450
	1    0    0    -1  
$EndComp
Wire Wire Line
	7600 5600 7600 5650
Wire Wire Line
	7600 5300 7600 5250
Connection ~ 7600 5250
Wire Wire Line
	7600 5250 7550 5250
$Comp
L Device:R R17
U 1 1 62D000BE
P 7700 6050
F 0 "R17" V 7500 6050 50  0000 C TNN
F 1 "9.1k 1%" V 7600 6050 50  0000 C CNN
F 2 "Resistors_SMD:R_0603" V 7630 6050 50  0001 C CNN
F 3 "~" H 7700 6050 50  0001 C CNN
	1    7700 6050
	0    -1   1    0   
$EndComp
$Comp
L Device:R R19
U 1 1 62D000C4
P 8200 6050
F 0 "R19" V 8000 6050 50  0000 C TNN
F 1 "36k 1%" V 8100 6050 50  0000 C CNN
F 2 "Resistors_SMD:R_0603" V 8130 6050 50  0001 C CNN
F 3 "~" H 8200 6050 50  0001 C CNN
	1    8200 6050
	0    -1   1    0   
$EndComp
$Comp
L Device:R R21
U 1 1 62D000CA
P 8300 5250
F 0 "R21" V 8100 5250 50  0000 C TNN
F 1 "9.1k 1%" V 8200 5250 50  0000 C CNN
F 2 "Resistors_SMD:R_0603" V 8230 5250 50  0001 C CNN
F 3 "~" H 8300 5250 50  0001 C CNN
	1    8300 5250
	0    -1   1    0   
$EndComp
$Comp
L Device:R R15
U 1 1 62D000D0
P 7400 5250
F 0 "R15" V 7200 5250 50  0000 C TNN
F 1 "9.1k 1%" V 7300 5250 50  0000 C CNN
F 2 "Resistors_SMD:R_0603" V 7330 5250 50  0001 C CNN
F 3 "~" H 7400 5250 50  0001 C CNN
	1    7400 5250
	0    -1   1    0   
$EndComp
Wire Wire Line
	7750 5250 7750 5450
Connection ~ 7750 5250
Wire Wire Line
	7750 5250 7600 5250
Wire Wire Line
	7750 5450 7950 5450
Connection ~ 7750 5450
Wire Wire Line
	7750 5450 7750 5550
Wire Wire Line
	7950 5450 7950 5400
Wire Wire Line
	7750 5550 8000 5550
$Comp
L Device:R R31
U 1 1 62D000DE
P 10150 4700
F 0 "R31" V 9950 4700 50  0000 C TNN
F 1 "1k" V 10050 4700 50  0000 C CNN
F 2 "Resistors_SMD:R_0603" V 10080 4700 50  0001 C CNN
F 3 "~" H 10150 4700 50  0001 C CNN
	1    10150 4700
	0    -1   1    0   
$EndComp
Wire Wire Line
	10500 4900 10550 4900
Wire Wire Line
	10300 4700 10350 4700
$Comp
L ProjectSymbols:MCP48CVBX2 U5
U 1 1 62D000EC
P 6100 5150
F 0 "U5" H 5550 5600 50  0000 C CNN
F 1 "MCP48CVB22-E/MG" H 6100 5150 50  0000 C CNN
F 2 "ProjectFootprints:QFN-16-1EP_3x3mm_Pitch0.5mm_Microchip" H 6100 5150 50  0001 C CNN
F 3 "" H 6100 5150 50  0001 C CNN
F 4 "MCP48CVB22-E/MG" H 6100 5150 50  0001 C CNN "MPN"
F 5 "MicroChip" H 6100 5150 50  0001 C CNN "Manufacturer"
	1    6100 5150
	1    0    0    -1  
$EndComp
Wire Wire Line
	7550 6050 7150 6050
Wire Wire Line
	7050 5450 6900 5450
Wire Wire Line
	6950 5250 6950 4850
Wire Wire Line
	6950 4850 6900 4850
Connection ~ 6950 5250
Wire Wire Line
	6950 5250 6900 5250
Wire Wire Line
	6950 5250 7250 5250
Wire Wire Line
	6950 4850 6950 4050
Wire Wire Line
	6950 4050 7250 4050
Connection ~ 6950 4850
Wire Wire Line
	6900 5050 7150 5050
$Comp
L Device:C C12
U 1 1 62D00100
P 6300 4500
F 0 "C12" H 6100 4500 50  0000 L CNN
F 1 "100nF" H 6000 4400 50  0000 L CNN
F 2 "Capacitors_SMD:C_0603" H 6338 4350 50  0001 C CNN
F 3 "~" H 6300 4500 50  0001 C CNN
	1    6300 4500
	0    1    1    0   
$EndComp
Wire Wire Line
	6100 4550 6100 4500
Wire Wire Line
	6100 4500 6150 4500
Wire Wire Line
	6100 5750 6100 5800
Wire Wire Line
	6100 5800 6150 5800
Wire Wire Line
	6200 5800 6200 5750
Wire Wire Line
	6150 5850 6150 5800
Connection ~ 6150 5800
Wire Wire Line
	6150 5800 6200 5800
Wire Wire Line
	6450 4500 6500 4500
Wire Wire Line
	6500 4500 6500 4550
$Comp
L Device:R R32
U 1 1 62D00116
P 10300 5200
F 0 "R32" V 10100 5200 50  0000 C TNN
F 1 "1k" V 10200 5200 50  0000 C CNN
F 2 "Resistors_SMD:R_0603" V 10230 5200 50  0001 C CNN
F 3 "~" H 10300 5200 50  0001 C CNN
	1    10300 5200
	0    -1   1    0   
$EndComp
Wire Wire Line
	10500 5400 10550 5400
Wire Wire Line
	10450 5200 10550 5200
Wire Wire Line
	5300 5350 5250 5350
Wire Wire Line
	5250 5350 5250 5450
Wire Wire Line
	5250 5450 5300 5450
$Comp
L Device:R R33
U 1 1 62D00122
P 10100 5500
F 0 "R33" V 9900 5500 50  0000 C TNN
F 1 "1k" V 10000 5500 50  0000 C CNN
F 2 "Resistors_SMD:R_0603" V 10030 5500 50  0001 C CNN
F 3 "~" H 10100 5500 50  0001 C CNN
	1    10100 5500
	-1   0    0    -1  
$EndComp
Wire Wire Line
	10500 6000 10500 5900
Wire Wire Line
	10500 5900 10550 5900
$Comp
L Connector:AudioJack2_Switch J10
U 1 1 62D0012E
P 10750 4700
F 0 "J10" H 10570 4708 50  0000 R CNN
F 1 "CV2_F" H 10570 4799 50  0000 R CNN
F 2 "ProjectFootprints:Cliff_CL1384" H 10750 4900 50  0001 C CNN
F 3 "~" H 10750 4900 50  0001 C CNN
F 4 "CL1384" H 10750 4700 50  0001 C CNN "MPN"
F 5 "Cliff" H 10750 4700 50  0001 C CNN "Manufacturer"
	1    10750 4700
	-1   0    0    1   
$EndComp
$Comp
L Connector:AudioJack2_Switch J11
U 1 1 62D00136
P 10750 5200
F 0 "J11" H 10570 5208 50  0000 R CNN
F 1 "GATE2_G" H 10570 5299 50  0000 R CNN
F 2 "ProjectFootprints:Cliff_CL1384" H 10750 5400 50  0001 C CNN
F 3 "~" H 10750 5400 50  0001 C CNN
F 4 "CL1384" H 10750 5200 50  0001 C CNN "MPN"
F 5 "Cliff" H 10750 5200 50  0001 C CNN "Manufacturer"
	1    10750 5200
	-1   0    0    1   
$EndComp
$Comp
L Connector:AudioJack2_Switch J12
U 1 1 62D0013E
P 10750 5700
F 0 "J12" H 10570 5708 50  0000 R CNN
F 1 "GATE2_H" H 10570 5799 50  0000 R CNN
F 2 "ProjectFootprints:Cliff_CL1384" H 10750 5900 50  0001 C CNN
F 3 "~" H 10750 5900 50  0001 C CNN
F 4 "CL1384" H 10750 5700 50  0001 C CNN "MPN"
F 5 "Cliff" H 10750 5700 50  0001 C CNN "Manufacturer"
	1    10750 5700
	-1   0    0    1   
$EndComp
$Comp
L Amplifier_Operational:TL072 U6
U 1 1 62D00144
P 8300 4450
F 0 "U6" H 8300 4817 50  0000 C CNN
F 1 "TL072" H 8300 4726 50  0000 C CNN
F 2 "Housings_SOIC:SOIC-8_3.9x4.9mm_Pitch1.27mm" H 8300 4450 50  0001 C CNN
F 3 "http://www.ti.com/lit/ds/symlink/tl071.pdf" H 8300 4450 50  0001 C CNN
	1    8300 4450
	1    0    0    -1  
$EndComp
$Comp
L Amplifier_Operational:TL072 U6
U 2 1 62D0014A
P 8300 5650
F 0 "U6" H 8300 6017 50  0000 C CNN
F 1 "TL072" H 8300 5926 50  0000 C CNN
F 2 "Housings_SOIC:SOIC-8_3.9x4.9mm_Pitch1.27mm" H 8300 5650 50  0001 C CNN
F 3 "http://www.ti.com/lit/ds/symlink/tl071.pdf" H 8300 5650 50  0001 C CNN
	2    8300 5650
	1    0    0    -1  
$EndComp
Text Label 6550 4050 0    50   ~ 0
VREF_2.5V
Wire Wire Line
	6550 4050 6950 4050
Connection ~ 6950 4050
$Comp
L power:+5V #PWR0135
U 1 1 62D00153
P 6100 4450
F 0 "#PWR0135" H 6100 4300 50  0001 C CNN
F 1 "+5V" H 6115 4623 50  0000 C CNN
F 2 "" H 6100 4450 50  0001 C CNN
F 3 "" H 6100 4450 50  0001 C CNN
	1    6100 4450
	1    0    0    -1  
$EndComp
Wire Wire Line
	6100 4450 6100 4500
Connection ~ 6100 4500
Wire Wire Line
	10500 4900 10500 5300
Connection ~ 10500 4900
Connection ~ 10500 5400
Wire Wire Line
	10500 5400 10500 5800
Connection ~ 10500 5900
Wire Wire Line
	10500 4400 10500 4800
Wire Wire Line
	8700 5650 8700 5050
Text Label 5100 5350 0    50   ~ 0
LAT1
Text Label 5050 4950 0    50   ~ 0
MISO
Text Label 5050 4850 0    50   ~ 0
MOSI
Text Label 5050 5050 0    50   ~ 0
SCK
Text Label 5050 5150 0    50   ~ 0
CS1
Wire Wire Line
	5050 4850 5300 4850
Wire Wire Line
	5300 4950 5050 4950
Wire Wire Line
	5300 5150 5250 5150
Wire Wire Line
	5100 5350 5250 5350
Connection ~ 5250 5350
Text Label 9600 4850 3    50   ~ 0
GATE2_G
Text Label 9900 4850 3    50   ~ 0
GATE2_H
$Comp
L power:GNDA #PWR0136
U 1 1 62D00173
P 6150 5850
F 0 "#PWR0136" H 6150 5600 50  0001 C CNN
F 1 "GNDA" H 6155 5677 50  0000 C CNN
F 2 "" H 6150 5850 50  0001 C CNN
F 3 "" H 6150 5850 50  0001 C CNN
	1    6150 5850
	1    0    0    -1  
$EndComp
$Comp
L power:GNDA #PWR0137
U 1 1 62D00179
P 7600 4450
F 0 "#PWR0137" H 7600 4200 50  0001 C CNN
F 1 "GNDA" H 7605 4277 50  0000 C CNN
F 2 "" H 7600 4450 50  0001 C CNN
F 3 "" H 7600 4450 50  0001 C CNN
	1    7600 4450
	1    0    0    -1  
$EndComp
$Comp
L power:GNDA #PWR0138
U 1 1 62D0017F
P 8500 4100
F 0 "#PWR0138" H 8500 3850 50  0001 C CNN
F 1 "GNDA" H 8505 3927 50  0000 C CNN
F 2 "" H 8500 4100 50  0001 C CNN
F 3 "" H 8500 4100 50  0001 C CNN
	1    8500 4100
	1    0    0    -1  
$EndComp
$Comp
L power:GNDA #PWR0139
U 1 1 62D00185
P 8500 5300
F 0 "#PWR0139" H 8500 5050 50  0001 C CNN
F 1 "GNDA" H 8505 5127 50  0000 C CNN
F 2 "" H 8500 5300 50  0001 C CNN
F 3 "" H 8500 5300 50  0001 C CNN
	1    8500 5300
	1    0    0    -1  
$EndComp
$Comp
L power:GNDA #PWR0140
U 1 1 62D0018B
P 7600 5650
F 0 "#PWR0140" H 7600 5400 50  0001 C CNN
F 1 "GNDA" H 7605 5477 50  0000 C CNN
F 2 "" H 7600 5650 50  0001 C CNN
F 3 "" H 7600 5650 50  0001 C CNN
	1    7600 5650
	1    0    0    -1  
$EndComp
$Comp
L power:GNDA #PWR0141
U 1 1 62D00191
P 10500 6000
F 0 "#PWR0141" H 10500 5750 50  0001 C CNN
F 1 "GNDA" H 10505 5827 50  0000 C CNN
F 2 "" H 10500 6000 50  0001 C CNN
F 3 "" H 10500 6000 50  0001 C CNN
	1    10500 6000
	1    0    0    -1  
$EndComp
$Comp
L Device:LED D8
U 1 1 62D00197
P 9900 5450
F 0 "D8" V 9939 5332 50  0000 R CNN
F 1 "LED" V 9848 5332 50  0000 R CNN
F 2 "LEDs:LED_D3.0mm_Horizontal_O6.35mm_Z10.0mm" H 9900 5450 50  0001 C CNN
F 3 "~" H 9900 5450 50  0001 C CNN
	1    9900 5450
	0    -1   -1   0   
$EndComp
$Comp
L Device:R R29
U 1 1 62D0019D
P 9900 5800
F 0 "R29" V 9700 5800 50  0000 C TNN
F 1 "1k" V 9800 5800 50  0000 C CNN
F 2 "Resistors_SMD:R_0603" V 9830 5800 50  0001 C CNN
F 3 "~" H 9900 5800 50  0001 C CNN
	1    9900 5800
	-1   0    0    -1  
$EndComp
$Comp
L power:GNDA #PWR0142
U 1 1 62D001A3
P 9900 6000
F 0 "#PWR0142" H 9900 5750 50  0001 C CNN
F 1 "GNDA" H 9905 5827 50  0000 C CNN
F 2 "" H 9900 6000 50  0001 C CNN
F 3 "" H 9900 6000 50  0001 C CNN
	1    9900 6000
	1    0    0    -1  
$EndComp
Wire Wire Line
	9900 5950 9900 6000
$Comp
L Device:LED D6
U 1 1 62D001AA
P 9600 5450
F 0 "D6" V 9639 5332 50  0000 R CNN
F 1 "LED" V 9548 5332 50  0000 R CNN
F 2 "LEDs:LED_D3.0mm_Horizontal_O6.35mm_Z10.0mm" H 9600 5450 50  0001 C CNN
F 3 "~" H 9600 5450 50  0001 C CNN
	1    9600 5450
	0    -1   -1   0   
$EndComp
$Comp
L Device:R R27
U 1 1 62D001B0
P 9600 5800
F 0 "R27" V 9400 5800 50  0000 C TNN
F 1 "1k" V 9500 5800 50  0000 C CNN
F 2 "Resistors_SMD:R_0603" V 9530 5800 50  0001 C CNN
F 3 "~" H 9600 5800 50  0001 C CNN
	1    9600 5800
	-1   0    0    -1  
$EndComp
$Comp
L power:GNDA #PWR0143
U 1 1 62D001B6
P 9600 6000
F 0 "#PWR0143" H 9600 5750 50  0001 C CNN
F 1 "GNDA" H 9605 5827 50  0000 C CNN
F 2 "" H 9600 6000 50  0001 C CNN
F 3 "" H 9600 6000 50  0001 C CNN
	1    9600 6000
	1    0    0    -1  
$EndComp
Wire Wire Line
	9600 5950 9600 6000
Wire Wire Line
	9600 5650 9600 5600
Wire Wire Line
	9900 5650 9900 5600
Wire Wire Line
	9600 5200 9600 5300
Wire Wire Line
	9600 5200 10150 5200
Wire Wire Line
	10100 5700 10100 5650
Wire Wire Line
	10100 5250 9900 5250
Wire Wire Line
	9900 5250 9900 5300
$Comp
L Device:LED D4
U 1 1 62D001C4
P 9300 5450
F 0 "D4" V 9339 5332 50  0000 R CNN
F 1 "LED" V 9248 5332 50  0000 R CNN
F 2 "LEDs:LED_D3.0mm_Horizontal_O6.35mm_Z10.0mm" H 9300 5450 50  0001 C CNN
F 3 "~" H 9300 5450 50  0001 C CNN
	1    9300 5450
	0    -1   -1   0   
$EndComp
$Comp
L Device:R R25
U 1 1 62D001CA
P 9300 5800
F 0 "R25" V 9100 5800 50  0000 C TNN
F 1 "1k" V 9200 5800 50  0000 C CNN
F 2 "Resistors_SMD:R_0603" V 9230 5800 50  0001 C CNN
F 3 "~" H 9300 5800 50  0001 C CNN
	1    9300 5800
	-1   0    0    -1  
$EndComp
$Comp
L power:GNDA #PWR0144
U 1 1 62D001D0
P 9300 6000
F 0 "#PWR0144" H 9300 5750 50  0001 C CNN
F 1 "GNDA" H 9305 5827 50  0000 C CNN
F 2 "" H 9300 6000 50  0001 C CNN
F 3 "" H 9300 6000 50  0001 C CNN
	1    9300 6000
	1    0    0    -1  
$EndComp
Wire Wire Line
	9300 5950 9300 6000
Wire Wire Line
	9300 5650 9300 5600
$Comp
L Device:LED D2
U 1 1 62D001D8
P 9000 5450
F 0 "D2" V 9039 5332 50  0000 R CNN
F 1 "LED" V 8948 5332 50  0000 R CNN
F 2 "LEDs:LED_D3.0mm_Horizontal_O6.35mm_Z10.0mm" H 9000 5450 50  0001 C CNN
F 3 "~" H 9000 5450 50  0001 C CNN
	1    9000 5450
	0    -1   -1   0   
$EndComp
$Comp
L Device:R R23
U 1 1 62D001DE
P 9000 5800
F 0 "R23" V 8800 5800 50  0000 C TNN
F 1 "1k" V 8900 5800 50  0000 C CNN
F 2 "Resistors_SMD:R_0603" V 8930 5800 50  0001 C CNN
F 3 "~" H 9000 5800 50  0001 C CNN
	1    9000 5800
	-1   0    0    -1  
$EndComp
$Comp
L power:GNDA #PWR0145
U 1 1 62D001E4
P 9000 6000
F 0 "#PWR0145" H 9000 5750 50  0001 C CNN
F 1 "GNDA" H 9005 5827 50  0000 C CNN
F 2 "" H 9000 6000 50  0001 C CNN
F 3 "" H 9000 6000 50  0001 C CNN
	1    9000 6000
	1    0    0    -1  
$EndComp
Wire Wire Line
	9000 5950 9000 6000
Wire Wire Line
	9000 5650 9000 5600
Wire Wire Line
	9000 4200 9000 4450
Wire Wire Line
	9300 4700 9300 5050
Wire Wire Line
	9300 4700 10000 4700
Wire Wire Line
	9000 4200 10000 4200
$Comp
L Amplifier_Operational:TL072 U6
U 3 1 62E11842
P 3950 6850
F 0 "U6" H 3908 6896 50  0000 L CNN
F 1 "TL072" H 3908 6805 50  0000 L CNN
F 2 "Housings_SOIC:SOIC-8_3.9x4.9mm_Pitch1.27mm" H 3950 6850 50  0001 C CNN
F 3 "http://www.ti.com/lit/ds/symlink/tl071.pdf" H 3950 6850 50  0001 C CNN
	3    3950 6850
	1    0    0    -1  
$EndComp
$Comp
L power:+12V #PWR0146
U 1 1 62E11848
P 3850 6450
F 0 "#PWR0146" H 3850 6300 50  0001 C CNN
F 1 "+12V" H 3865 6623 50  0000 C CNN
F 2 "" H 3850 6450 50  0001 C CNN
F 3 "" H 3850 6450 50  0001 C CNN
	1    3850 6450
	1    0    0    -1  
$EndComp
$Comp
L Device:C C14
U 1 1 62E1184E
P 4050 7200
F 0 "C14" H 3850 7200 50  0000 L CNN
F 1 "100nF" H 3750 7100 50  0000 L CNN
F 2 "Capacitors_SMD:C_0603" H 4088 7050 50  0001 C CNN
F 3 "~" H 4050 7200 50  0001 C CNN
	1    4050 7200
	0    1    1    0   
$EndComp
$Comp
L power:-12V #PWR0147
U 1 1 62E11854
P 3850 7250
F 0 "#PWR0147" H 3850 7350 50  0001 C CNN
F 1 "-12V" H 3865 7423 50  0000 C CNN
F 2 "" H 3850 7250 50  0001 C CNN
F 3 "" H 3850 7250 50  0001 C CNN
	1    3850 7250
	-1   0    0    1   
$EndComp
Wire Wire Line
	3850 6450 3850 6500
Wire Wire Line
	3900 6500 3850 6500
Connection ~ 3850 6500
Wire Wire Line
	3850 6500 3850 6550
Wire Wire Line
	3850 7150 3850 7200
Wire Wire Line
	3850 7200 3900 7200
Connection ~ 3850 7200
Wire Wire Line
	3850 7200 3850 7250
Wire Wire Line
	4200 6500 4250 6500
Wire Wire Line
	4250 7200 4200 7200
Wire Wire Line
	4250 6500 4250 6700
$Comp
L Device:C C13
U 1 1 62E11865
P 4050 6500
F 0 "C13" H 3850 6500 50  0000 L CNN
F 1 "100nF" H 3750 6400 50  0000 L CNN
F 2 "Capacitors_SMD:C_0603" H 4088 6350 50  0001 C CNN
F 3 "~" H 4050 6500 50  0001 C CNN
	1    4050 6500
	0    1    1    0   
$EndComp
Wire Wire Line
	4250 6700 4350 6700
Wire Wire Line
	4350 6700 4350 6750
Connection ~ 4250 6700
Wire Wire Line
	4250 6700 4250 7200
$Comp
L power:GNDA #PWR0148
U 1 1 62E1186F
P 4350 6750
F 0 "#PWR0148" H 4350 6500 50  0001 C CNN
F 1 "GNDA" H 4355 6577 50  0000 C CNN
F 2 "" H 4350 6750 50  0001 C CNN
F 3 "" H 4350 6750 50  0001 C CNN
	1    4350 6750
	1    0    0    -1  
$EndComp
$Comp
L power:GNDA #PWR0111
U 1 1 636021A2
P 3550 6750
F 0 "#PWR0111" H 3550 6500 50  0001 C CNN
F 1 "GNDA" H 3555 6577 50  0000 C CNN
F 2 "" H 3550 6750 50  0001 C CNN
F 3 "" H 3550 6750 50  0001 C CNN
	1    3550 6750
	1    0    0    -1  
$EndComp
Wire Wire Line
	3450 6700 3450 7200
Connection ~ 3450 6700
Wire Wire Line
	3550 6700 3550 6750
Wire Wire Line
	3450 6700 3550 6700
$Comp
L Device:C C10
U 1 1 62AEF33A
P 3250 6500
F 0 "C10" H 3050 6500 50  0000 L CNN
F 1 "100nF" H 2950 6400 50  0000 L CNN
F 2 "Capacitors_SMD:C_0603" H 3288 6350 50  0001 C CNN
F 3 "~" H 3250 6500 50  0001 C CNN
	1    3250 6500
	0    1    1    0   
$EndComp
Wire Wire Line
	3450 6500 3450 6700
Wire Wire Line
	3450 7200 3400 7200
Wire Wire Line
	3400 6500 3450 6500
Wire Wire Line
	3050 7200 3050 7250
Connection ~ 3050 7200
Wire Wire Line
	3050 7200 3100 7200
Wire Wire Line
	3050 7150 3050 7200
Wire Wire Line
	3050 6500 3050 6550
Connection ~ 3050 6500
Wire Wire Line
	3100 6500 3050 6500
Wire Wire Line
	3050 6450 3050 6500
$Comp
L power:-12V #PWR0115
U 1 1 62AF11B7
P 3050 7250
F 0 "#PWR0115" H 3050 7350 50  0001 C CNN
F 1 "-12V" H 3065 7423 50  0000 C CNN
F 2 "" H 3050 7250 50  0001 C CNN
F 3 "" H 3050 7250 50  0001 C CNN
	1    3050 7250
	-1   0    0    1   
$EndComp
$Comp
L Device:C C11
U 1 1 62AF0925
P 3250 7200
F 0 "C11" H 3050 7200 50  0000 L CNN
F 1 "100nF" H 2950 7100 50  0000 L CNN
F 2 "Capacitors_SMD:C_0603" H 3288 7050 50  0001 C CNN
F 3 "~" H 3250 7200 50  0001 C CNN
	1    3250 7200
	0    1    1    0   
$EndComp
$Comp
L power:+12V #PWR0114
U 1 1 62AE0E4B
P 3050 6450
F 0 "#PWR0114" H 3050 6300 50  0001 C CNN
F 1 "+12V" H 3065 6623 50  0000 C CNN
F 2 "" H 3050 6450 50  0001 C CNN
F 3 "" H 3050 6450 50  0001 C CNN
	1    3050 6450
	1    0    0    -1  
$EndComp
$Comp
L Amplifier_Operational:TL072 U3
U 3 1 62AC2006
P 3150 6850
F 0 "U3" H 3108 6896 50  0000 L CNN
F 1 "TL072" H 3108 6805 50  0000 L CNN
F 2 "Housings_SOIC:SOIC-8_3.9x4.9mm_Pitch1.27mm" H 3150 6850 50  0001 C CNN
F 3 "http://www.ti.com/lit/ds/symlink/tl071.pdf" H 3150 6850 50  0001 C CNN
	3    3150 6850
	1    0    0    -1  
$EndComp
Text Label 1600 1200 0    50   ~ 0
~RESET~
Wire Wire Line
	1600 1200 1850 1200
Connection ~ 1850 1200
Text Label 4700 5050 2    50   ~ 0
~RESET~
Wire Wire Line
	4250 5050 4700 5050
Wire Wire Line
	4700 5150 4250 5150
Wire Wire Line
	3350 5150 3750 5150
Wire Wire Line
	4250 4950 4700 4950
Wire Wire Line
	3500 4750 3500 4850
Wire Wire Line
	3500 4850 3750 4850
Wire Wire Line
	4300 4850 4300 5500
Wire Wire Line
	4250 4850 4300 4850
Wire Wire Line
	3300 4750 3300 5250
Wire Wire Line
	9600 1950 9600 2300
Connection ~ 9600 2300
Wire Wire Line
	9900 1950 9900 2350
Connection ~ 9900 2350
Wire Wire Line
	9600 5200 9600 4850
Connection ~ 9600 5200
Wire Wire Line
	9900 4850 9900 5250
Connection ~ 9900 5250
Text Label 3350 5450 0    50   ~ 0
GATE2_G
Text Label 4700 5450 2    50   ~ 0
GATE2_H
Text Label 3450 1900 2    50   ~ 0
GATE2_H
Text Label 3450 2900 2    50   ~ 0
GATE2_G
Wire Wire Line
	3100 2800 3450 2800
Wire Wire Line
	3450 2900 3100 2900
Wire Wire Line
	3100 3200 3450 3200
Wire Wire Line
	3600 2700 3100 2700
Wire Wire Line
	3950 2800 3600 2800
Wire Wire Line
	3600 2800 3600 2700
Wire Wire Line
	3700 2600 3100 2600
Wire Wire Line
	3950 2700 3700 2700
Wire Wire Line
	3700 2700 3700 2600
$Comp
L power:-12V #PWR0149
U 1 1 63DB81C6
P 2400 5500
F 0 "#PWR0149" H 2400 5600 50  0001 C CNN
F 1 "-12V" H 2415 5673 50  0000 C CNN
F 2 "" H 2400 5500 50  0001 C CNN
F 3 "" H 2400 5500 50  0001 C CNN
	1    2400 5500
	-1   0    0    1   
$EndComp
$Comp
L power:+12V #PWR0150
U 1 1 63DB81CC
P 1600 4750
F 0 "#PWR0150" H 1600 4600 50  0001 C CNN
F 1 "+12V" H 1615 4923 50  0000 C CNN
F 2 "" H 1600 4750 50  0001 C CNN
F 3 "" H 1600 4750 50  0001 C CNN
	1    1600 4750
	1    0    0    -1  
$EndComp
$Comp
L power:+5V #PWR0151
U 1 1 63DB81D2
P 1400 4750
F 0 "#PWR0151" H 1400 4600 50  0001 C CNN
F 1 "+5V" H 1415 4923 50  0000 C CNN
F 2 "" H 1400 4750 50  0001 C CNN
F 3 "" H 1400 4750 50  0001 C CNN
	1    1400 4750
	1    0    0    -1  
$EndComp
Text Label 2800 5150 2    50   ~ 0
SCK
Text Label 2800 5250 2    50   ~ 0
MISO
Wire Wire Line
	2800 5350 2350 5350
Wire Wire Line
	2800 5250 2350 5250
Text Label 2800 5350 2    50   ~ 0
CS1
Wire Wire Line
	1400 5250 1850 5250
Text Label 2800 4950 2    50   ~ 0
VREF_2.5V
$Comp
L Connector_Generic:Conn_02x07_Odd_Even J8
U 1 1 63DB81E3
P 2150 5150
F 0 "J8" H 2200 4625 50  0000 C CNN
F 1 "Conn_02x07_Odd_Even" H 2200 4716 50  0000 C CNN
F 2 "Pin_Headers:Pin_Header_Straight_2x07_Pitch2.54mm" H 2150 5150 50  0001 C CNN
F 3 "~" H 2150 5150 50  0001 C CNN
	1    2150 5150
	-1   0    0    1   
$EndComp
Wire Wire Line
	2800 5450 2350 5450
Wire Wire Line
	2800 5150 2350 5150
Wire Wire Line
	2350 4950 2800 4950
Wire Wire Line
	1600 4750 1600 4850
Wire Wire Line
	1600 4850 1850 4850
Wire Wire Line
	2400 4850 2400 5500
Wire Wire Line
	2350 4850 2400 4850
Wire Wire Line
	1400 4750 1400 5250
Text Label 2800 5450 2    50   ~ 0
GATE2_H
NoConn ~ 2350 5050
Wire Wire Line
	10550 2900 10500 2900
Connection ~ 10500 2900
Wire Wire Line
	10500 2900 10500 3000
Wire Wire Line
	10550 2400 10500 2400
Connection ~ 10500 2400
Wire Wire Line
	10500 2400 10500 2500
Wire Wire Line
	10550 1900 10500 1900
Connection ~ 10500 1900
Wire Wire Line
	10500 1900 10500 2000
Wire Wire Line
	10550 1400 10500 1400
Wire Wire Line
	10500 1400 10500 1500
Connection ~ 10500 1500
Wire Wire Line
	10550 4300 10500 4300
Wire Wire Line
	10500 4300 10500 4400
Connection ~ 10500 4400
Wire Wire Line
	10550 4800 10500 4800
Connection ~ 10500 4800
Wire Wire Line
	10500 4800 10500 4900
Wire Wire Line
	10550 5300 10500 5300
Connection ~ 10500 5300
Wire Wire Line
	10500 5300 10500 5400
Wire Wire Line
	10550 5800 10500 5800
Connection ~ 10500 5800
Wire Wire Line
	10500 5800 10500 5900
Wire Wire Line
	8150 1150 8100 1150
$Comp
L Device:R R7
U 1 1 629807D2
P 8300 1150
F 0 "R7" V 8100 1150 50  0000 C TNN
F 1 "9.1k 1%" V 8200 1150 50  0000 C CNN
F 2 "Resistors_SMD:R_0603" V 8230 1150 50  0001 C CNN
F 3 "~" H 8300 1150 50  0001 C CNN
	1    8300 1150
	0    -1   1    0   
$EndComp
Wire Wire Line
	8450 1150 8500 1150
Wire Wire Line
	8500 1150 8500 1200
$Comp
L power:GNDA #PWR0103
U 1 1 635F7DAB
P 8500 1200
F 0 "#PWR0103" H 8500 950 50  0001 C CNN
F 1 "GNDA" H 8505 1027 50  0000 C CNN
F 2 "" H 8500 1200 50  0001 C CNN
F 3 "" H 8500 1200 50  0001 C CNN
	1    8500 1200
	1    0    0    -1  
$EndComp
Wire Wire Line
	7750 1350 7750 1450
Wire Wire Line
	7750 1150 7750 1350
Connection ~ 7750 1350
Wire Wire Line
	7750 1350 7950 1350
$Comp
L Device:R_POT RV6
U 1 1 62D000A9
P 7950 5250
F 0 "RV6" V 7800 5250 50  0000 C BNN
F 1 "5k" V 7850 5250 50  0000 C CNN
F 2 "Potentiometers:Potentiometer_Trimmer_Bourns_3296Z" H 7950 5250 50  0001 C CNN
F 3 "~" H 7950 5250 50  0001 C CNN
	1    7950 5250
	0    -1   1    0   
$EndComp
$Comp
L Device:R_POT RV2
U 1 1 629A8853
P 7950 2350
F 0 "RV2" V 7800 2350 50  0000 C BNN
F 1 "5k" V 7850 2350 50  0000 C CNN
F 2 "Potentiometers:Potentiometer_Trimmer_Bourns_3296Z" H 7950 2350 50  0001 C CNN
F 3 "~" H 7950 2350 50  0001 C CNN
	1    7950 2350
	0    -1   1    0   
$EndComp
Wire Wire Line
	7150 2150 6900 2150
Wire Wire Line
	7150 2150 7150 3150
Wire Wire Line
	7050 2550 6900 2550
Wire Wire Line
	7050 1950 7050 2550
$Comp
L Device:C C17
U 1 1 62F11C2B
P 6950 2750
F 0 "C17" H 6750 2750 50  0000 L CNN
F 1 "100nF" H 6650 2650 50  0000 L CNN
F 2 "Capacitors_SMD:C_0603" H 6988 2600 50  0001 C CNN
F 3 "~" H 6950 2750 50  0001 C CNN
	1    6950 2750
	1    0    0    -1  
$EndComp
$Comp
L power:GNDA #PWR0153
U 1 1 62F13506
P 6950 2950
F 0 "#PWR0153" H 6950 2700 50  0001 C CNN
F 1 "GNDA" H 6955 2777 50  0000 C CNN
F 2 "" H 6950 2950 50  0001 C CNN
F 3 "" H 6950 2950 50  0001 C CNN
	1    6950 2950
	1    0    0    -1  
$EndComp
Wire Wire Line
	6950 2600 6950 2350
Wire Wire Line
	6950 2950 6950 2900
$Comp
L Device:C C18
U 1 1 62F9E5C6
P 6950 5650
F 0 "C18" H 6750 5650 50  0000 L CNN
F 1 "100nF" H 6650 5550 50  0000 L CNN
F 2 "Capacitors_SMD:C_0603" H 6988 5500 50  0001 C CNN
F 3 "~" H 6950 5650 50  0001 C CNN
	1    6950 5650
	1    0    0    -1  
$EndComp
Wire Wire Line
	7150 6050 7150 5050
Wire Wire Line
	7050 5450 7050 4850
Wire Wire Line
	7050 4850 7550 4850
Wire Wire Line
	6950 5500 6950 5250
$Comp
L power:GNDA #PWR0154
U 1 1 630969AE
P 6950 5850
F 0 "#PWR0154" H 6950 5600 50  0001 C CNN
F 1 "GNDA" H 6955 5677 50  0000 C CNN
F 2 "" H 6950 5850 50  0001 C CNN
F 3 "" H 6950 5850 50  0001 C CNN
	1    6950 5850
	1    0    0    -1  
$EndComp
Wire Wire Line
	6950 5800 6950 5850
Wire Wire Line
	1850 5450 1450 5450
Text Label 1450 5450 0    50   ~ 0
GATE2_G
Wire Wire Line
	1450 5350 1850 5350
Text Label 1450 5350 0    50   ~ 0
LAT1
Wire Wire Line
	1450 5150 1850 5150
Text Label 1450 5150 0    50   ~ 0
MOSI
$Comp
L power:GNDA #PWR0152
U 1 1 63DB81EB
P 1800 5500
F 0 "#PWR0152" H 1800 5250 50  0001 C CNN
F 1 "GNDA" H 1805 5327 50  0000 C CNN
F 2 "" H 1800 5500 50  0001 C CNN
F 3 "" H 1800 5500 50  0001 C CNN
	1    1800 5500
	1    0    0    -1  
$EndComp
Wire Wire Line
	1800 4950 1850 4950
Connection ~ 1800 5050
Wire Wire Line
	1800 5050 1800 5500
Wire Wire Line
	1850 5050 1800 5050
Wire Wire Line
	1800 5050 1800 4950
Wire Wire Line
	3700 4950 3750 4950
Wire Wire Line
	3750 5050 3700 5050
Wire Wire Line
	3700 5050 3700 4950
Connection ~ 3700 5050
Wire Wire Line
	3700 5050 3700 5500
$Comp
L power:GNDA #PWR0118
U 1 1 6363FE58
P 3700 5500
F 0 "#PWR0118" H 3700 5250 50  0001 C CNN
F 1 "GNDA" H 3705 5327 50  0000 C CNN
F 2 "" H 3700 5500 50  0001 C CNN
F 3 "" H 3700 5500 50  0001 C CNN
	1    3700 5500
	1    0    0    -1  
$EndComp
$Comp
L power:GNDA #PWR0109
U 1 1 63255013
P 6500 1650
F 0 "#PWR0109" H 6500 1400 50  0001 C CNN
F 1 "GNDA" H 6505 1477 50  0000 C CNN
F 2 "" H 6500 1650 50  0001 C CNN
F 3 "" H 6500 1650 50  0001 C CNN
	1    6500 1650
	1    0    0    -1  
$EndComp
$Comp
L power:GNDA #PWR0134
U 1 1 63263F8E
P 6500 4550
F 0 "#PWR0134" H 6500 4300 50  0001 C CNN
F 1 "GNDA" H 6505 4377 50  0000 C CNN
F 2 "" H 6500 4550 50  0001 C CNN
F 3 "" H 6500 4550 50  0001 C CNN
	1    6500 4550
	1    0    0    -1  
$EndComp
$Comp
L power:+5V #PWR0155
U 1 1 63275FAB
P 1550 6750
F 0 "#PWR0155" H 1550 6600 50  0001 C CNN
F 1 "+5V" H 1565 6923 50  0000 C CNN
F 2 "" H 1550 6750 50  0001 C CNN
F 3 "" H 1550 6750 50  0001 C CNN
	1    1550 6750
	1    0    0    -1  
$EndComp
Wire Wire Line
	1550 6750 1550 6800
Connection ~ 1550 6800
Wire Wire Line
	3700 1900 3700 1200
Wire Wire Line
	3100 1200 3700 1200
Wire Wire Line
	3600 2000 3600 1300
Wire Wire Line
	3100 1300 3600 1300
Wire Wire Line
	3950 2400 3100 2400
Wire Wire Line
	3700 1900 3950 1900
Wire Wire Line
	3600 2000 3950 2000
Wire Wire Line
	3950 2100 3100 2100
Wire Wire Line
	3100 2200 3950 2200
Text Label 3450 3000 2    50   ~ 0
LAT1
Wire Wire Line
	3450 3000 3100 3000
Wire Wire Line
	3100 3100 3450 3100
Wire Wire Line
	3450 1500 3100 1500
Wire Wire Line
	3100 1600 3450 1600
Wire Wire Line
	3450 1700 3100 1700
$Comp
L Mechanical:MountingHole H1
U 1 1 629E68B2
P 5850 6650
F 0 "H1" H 5950 6696 50  0000 L CNN
F 1 "MountingHole" H 5950 6605 50  0000 L CNN
F 2 "Mounting_Holes:MountingHole_3.2mm_M3_DIN965" H 5850 6650 50  0001 C CNN
F 3 "~" H 5850 6650 50  0001 C CNN
	1    5850 6650
	1    0    0    -1  
$EndComp
$Comp
L Mechanical:MountingHole H2
U 1 1 629E7D6E
P 6200 6650
F 0 "H2" H 6300 6696 50  0000 L CNN
F 1 "MountingHole" H 6300 6605 50  0000 L CNN
F 2 "Mounting_Holes:MountingHole_3.2mm_M3_DIN965" H 6200 6650 50  0001 C CNN
F 3 "~" H 6200 6650 50  0001 C CNN
	1    6200 6650
	1    0    0    -1  
$EndComp
$Comp
L Connector_Generic:Conn_01x12 J7
U 1 1 62BAF0E9
P 4150 2500
F 0 "J7" H 4068 1675 50  0000 C CNN
F 1 "Conn_01x12" H 4068 1766 50  0000 C CNN
F 2 "Socket_Strips:Socket_Strip_Straight_1x12_Pitch2.54mm" H 4150 2500 50  0001 C CNN
F 3 "~" H 4150 2500 50  0001 C CNN
	1    4150 2500
	1    0    0    1   
$EndComp
Wire Wire Line
	3700 2700 3700 2900
Wire Wire Line
	3700 2900 3950 2900
Connection ~ 3700 2700
Wire Wire Line
	3600 3000 3950 3000
Wire Wire Line
	3100 3300 3600 3300
Wire Wire Line
	3600 3300 3600 3000
Wire Wire Line
	3100 2300 3950 2300
$Comp
L Connector:TestPoint TP1
U 1 1 62AB47A8
P 10300 5750
F 0 "TP1" H 10242 5776 50  0000 R CNN
F 1 "TestPoint" H 10242 5867 50  0000 R CNN
F 2 "Wire_Pads:SolderWirePad_single_0-8mmDrill" H 10500 5750 50  0001 C CNN
F 3 "~" H 10500 5750 50  0001 C CNN
	1    10300 5750
	-1   0    0    1   
$EndComp
Wire Wire Line
	10300 5700 10300 5750
Wire Wire Line
	10100 2800 10150 2800
Wire Wire Line
	10100 5350 10100 5250
Wire Wire Line
	10100 5700 10300 5700
Connection ~ 10300 5700
Wire Wire Line
	10300 5700 10550 5700
Wire Wire Line
	10450 2800 10550 2800
Wire Wire Line
	10100 2350 10100 2800
NoConn ~ 10550 5600
NoConn ~ 10550 5100
NoConn ~ 10550 4600
NoConn ~ 10550 4100
NoConn ~ 10550 2200
NoConn ~ 10550 1700
NoConn ~ 10550 2700
Wire Wire Line
	5300 5050 5050 5050
NoConn ~ 10550 1200
$Comp
L Device:R R34
U 1 1 62D6E1D9
P 5750 1600
F 0 "R34" V 5550 1600 50  0000 C TNN
F 1 "36k 1%" V 5650 1600 50  0000 C CNN
F 2 "Resistors_SMD:R_0603" V 5680 1600 50  0001 C CNN
F 3 "~" H 5750 1600 50  0001 C CNN
	1    5750 1600
	0    -1   1    0   
$EndComp
Wire Wire Line
	8350 1950 8400 1950
Wire Wire Line
	8400 1950 8400 1750
Wire Wire Line
	8400 1750 8600 1750
Wire Wire Line
	8600 1750 8600 1800
Connection ~ 8400 1950
Wire Wire Line
	8400 1950 8450 1950
Connection ~ 9000 1550
Wire Wire Line
	9000 1550 9000 2400
Wire Wire Line
	8750 1950 9100 1950
Wire Wire Line
	9100 1400 10350 1400
Wire Wire Line
	10350 1400 10350 1300
Wire Wire Line
	9100 1400 9100 1950
Connection ~ 10350 1300
Wire Wire Line
	10350 1300 10550 1300
Wire Wire Line
	8400 2950 8600 2950
Wire Wire Line
	8600 2950 8600 3000
Wire Wire Line
	8600 2750 8700 2750
Wire Wire Line
	8700 2150 9300 2150
Connection ~ 9300 2150
Wire Wire Line
	9300 2150 9300 2400
Wire Wire Line
	8750 3150 8800 3150
Wire Wire Line
	8800 3150 8800 2250
Wire Wire Line
	8800 2250 9400 2250
Wire Wire Line
	9400 2250 9400 1900
Wire Wire Line
	9400 1900 10350 1900
Wire Wire Line
	10350 1900 10350 1800
Connection ~ 10350 1800
Wire Wire Line
	10350 1800 10550 1800
Wire Wire Line
	9300 5050 8700 5050
Connection ~ 9300 5050
Wire Wire Line
	9300 5050 9300 5300
Wire Wire Line
	8350 4850 8400 4850
Wire Wire Line
	8400 4850 8400 4650
Wire Wire Line
	8400 4650 8600 4650
Wire Wire Line
	8600 4650 8600 4700
Connection ~ 8400 4850
Wire Wire Line
	8400 4850 8450 4850
Connection ~ 9000 4450
Wire Wire Line
	9000 4450 9000 5300
Wire Wire Line
	8600 4450 9000 4450
Wire Wire Line
	8750 4850 9100 4850
Wire Wire Line
	9100 4850 9100 4300
Wire Wire Line
	9100 4300 10350 4300
Wire Wire Line
	10350 4300 10350 4200
Connection ~ 10350 4200
Wire Wire Line
	10350 4200 10550 4200
Wire Wire Line
	8350 6050 8400 6050
Wire Wire Line
	8400 6050 8400 5850
Wire Wire Line
	8400 5850 8600 5850
Wire Wire Line
	8600 5850 8600 5900
Connection ~ 8400 6050
Wire Wire Line
	8400 6050 8450 6050
Wire Wire Line
	8600 5650 8700 5650
Wire Wire Line
	8750 6050 8800 6050
Wire Wire Line
	8800 6050 8800 5150
Wire Wire Line
	8800 5150 9400 5150
Wire Wire Line
	9400 5150 9400 4800
Wire Wire Line
	9400 4800 10350 4800
Wire Wire Line
	10350 4800 10350 4700
Connection ~ 10350 4700
Wire Wire Line
	10350 4700 10550 4700
Wire Wire Line
	5250 2250 5250 1600
Wire Wire Line
	5250 1600 5600 1600
Connection ~ 5250 2250
Wire Wire Line
	5250 2250 5050 2250
Wire Wire Line
	5900 1600 6100 1600
$Comp
L Device:R R35
U 1 1 632C61F7
P 5750 4500
F 0 "R35" V 5550 4500 50  0000 C TNN
F 1 "36k 1%" V 5650 4500 50  0000 C CNN
F 2 "Resistors_SMD:R_0603" V 5680 4500 50  0001 C CNN
F 3 "~" H 5750 4500 50  0001 C CNN
	1    5750 4500
	0    -1   1    0   
$EndComp
Wire Wire Line
	5900 4500 6100 4500
Wire Wire Line
	5250 5150 5250 4500
Wire Wire Line
	5250 4500 5600 4500
Connection ~ 5250 5150
Wire Wire Line
	5250 5150 5050 5150
Wire Wire Line
	3100 1400 3450 1400
$EndSCHEMATC
