EESchema Schematic File Version 4
EELAYER 30 0
EELAYER END
$Descr A4 11693 8268
encoding utf-8
Sheet 1 1
Title "Eurorack Synth Power Supply"
Date "2022-08-31"
Rev "r2"
Comp "(c) 2022 Andreas Messer"
Comment1 ""
Comment2 ""
Comment3 ""
Comment4 ""
$EndDescr
$Comp
L Device:Thermistor_NTC TH1
U 1 1 62716BB3
P 2600 3750
F 0 "TH1" V 2310 3750 50  0000 C CNN
F 1 "Thermistor_NTC" V 2401 3750 50  0000 C CNN
F 2 "Resistors_ThroughHole:R_Radial_Power_L11.0mm_W7.0mm_P5.00mm" H 2600 3800 50  0001 C CNN
F 3 "~" H 2600 3800 50  0001 C CNN
	1    2600 3750
	1    0    0    -1  
$EndComp
$Comp
L Device:Fuse F1
U 1 1 6271D809
P 2300 4100
F 0 "F1" V 2103 4100 50  0000 C CNN
F 1 "Fuse" V 2194 4100 50  0000 C CNN
F 2 "Fuse_Holders_and_Fuses:Fuseholder5x20_horiz_open_universal_Type-III" V 2230 4100 50  0001 C CNN
F 3 "~" H 2300 4100 50  0001 C CNN
	1    2300 4100
	0    1    1    0   
$EndComp
NoConn ~ 3100 4050
$Comp
L Device:Transformer_1P_2S T1
U 1 1 62731266
P 3200 2900
F 0 "T1" H 3200 3481 50  0000 C CNN
F 1 "Transformer_1P_2S" H 3200 3390 50  0000 C CNN
F 2 "" H 3200 2900 50  0001 C CNN
F 3 "~" H 3200 2900 50  0001 C CNN
	1    3200 2900
	1    0    0    -1  
$EndComp
Wire Wire Line
	2800 2700 2650 2700
Wire Wire Line
	2650 2700 2650 2850
Wire Wire Line
	2650 2950 2650 3100
Wire Wire Line
	2650 3100 2800 3100
Wire Wire Line
	3600 2800 3700 2800
Wire Wire Line
	3700 2800 3700 2850
Wire Wire Line
	3700 2850 3900 2850
Wire Wire Line
	3900 2950 3700 2950
Wire Wire Line
	3700 2950 3700 3000
Wire Wire Line
	3700 3000 3600 3000
Wire Wire Line
	3600 2500 3800 2500
Wire Wire Line
	3800 2500 3800 2750
Wire Wire Line
	3800 2750 3900 2750
Wire Wire Line
	3600 3300 3800 3300
Wire Wire Line
	3800 3300 3800 3050
Wire Wire Line
	3800 3050 3900 3050
Wire Wire Line
	4150 2850 4200 2850
Wire Wire Line
	4200 2950 4150 2950
$Comp
L power:GND #PWR0101
U 1 1 6273B1A2
P 4200 3100
F 0 "#PWR0101" H 4200 2850 50  0001 C CNN
F 1 "GND" H 4205 2927 50  0001 C CNN
F 2 "" H 4200 3100 50  0001 C CNN
F 3 "" H 4200 3100 50  0001 C CNN
	1    4200 3100
	1    0    0    -1  
$EndComp
Wire Wire Line
	4200 2850 4200 2950
$Comp
L Device:CP C2
U 1 1 62741EC1
P 5900 2150
F 0 "C2" H 6018 2196 50  0000 L CNN
F 1 "4700µF/40V" H 6018 2105 50  0000 L CNN
F 2 "ProjectFootprints:Roederstein_EG03_21x40" H 5938 2000 50  0001 C CNN
F 3 "~" H 5900 2150 50  0001 C CNN
	1    5900 2150
	1    0    0    -1  
$EndComp
Wire Wire Line
	5900 1900 5900 2000
Wire Wire Line
	4950 2950 4950 2700
Wire Wire Line
	4950 1900 4950 2100
$Comp
L Device:D_Bridge_+A-A D1
U 1 1 6273D3EB
P 4950 2400
F 0 "D1" V 4996 2056 50  0000 R CNN
F 1 "MP3504W" V 4905 2056 50  0000 R CNN
F 2 "ProjectFootprints:MP-W" H 4950 2400 50  0001 C CNN
F 3 "~" H 4950 2400 50  0001 C CNN
	1    4950 2400
	0    -1   -1   0   
$EndComp
Wire Wire Line
	5250 2400 5300 2400
Wire Wire Line
	5250 3750 5300 3750
Connection ~ 4050 4100
Wire Wire Line
	4050 4100 4950 4100
Wire Wire Line
	3400 4100 4050 4100
Wire Wire Line
	3400 4050 3400 4100
Wire Wire Line
	4650 3750 4600 3750
Wire Wire Line
	3400 3400 3400 3450
Wire Wire Line
	4950 3400 4950 3450
Wire Wire Line
	4050 3400 4200 3400
Connection ~ 4050 3400
Wire Wire Line
	4050 3600 4050 3400
Wire Wire Line
	4950 4100 4950 4050
Wire Wire Line
	4050 3900 4050 4100
$Comp
L Device:D_Bridge_+A-A D2
U 1 1 62824324
P 4950 3750
F 0 "D2" V 4996 3406 50  0000 R CNN
F 1 "D_Bridge_+A-A" V 5400 4050 50  0000 R CNN
F 2 "Diodes_ThroughHole:Diode_Bridge_Round_D8.9mm" H 4950 3750 50  0001 C CNN
F 3 "~" H 4950 3750 50  0001 C CNN
	1    4950 3750
	0    -1   -1   0   
$EndComp
Wire Wire Line
	3400 3400 4050 3400
$Comp
L Device:CP C1
U 1 1 62773295
P 4050 3750
F 0 "C1" H 4168 3796 50  0000 L CNN
F 1 "10µF/63V" H 4168 3705 50  0000 L CNN
F 2 "Capacitors_ThroughHole:CP_Axial_L10.0mm_D6.0mm_P15.00mm_Horizontal" H 4088 3600 50  0001 C CNN
F 3 "~" H 4050 3750 50  0001 C CNN
	1    4050 3750
	1    0    0    -1  
$EndComp
Wire Wire Line
	4150 3050 4250 3050
Wire Wire Line
	4150 2750 4250 2750
$Comp
L Device:Fuse F2
U 1 1 628BC99E
P 4400 2750
F 0 "F2" V 4203 2750 50  0000 C CNN
F 1 "Fuse" V 4294 2750 50  0000 C CNN
F 2 "Fuse_Holders_and_Fuses:Fuseholder5x20_horiz_open_universal_Type-III" V 4330 2750 50  0001 C CNN
F 3 "~" H 4400 2750 50  0001 C CNN
	1    4400 2750
	0    1    1    0   
$EndComp
$Comp
L Device:Fuse F3
U 1 1 628BDB8A
P 4400 3050
F 0 "F3" V 4203 3050 50  0000 C CNN
F 1 "Fuse" V 4294 3050 50  0000 C CNN
F 2 "Fuse_Holders_and_Fuses:Fuseholder5x20_horiz_open_universal_Type-III" V 4330 3050 50  0001 C CNN
F 3 "~" H 4400 3050 50  0001 C CNN
	1    4400 3050
	0    1    1    0   
$EndComp
Wire Wire Line
	4550 2750 4600 2750
Wire Wire Line
	4200 2950 4200 3100
Connection ~ 4200 2950
Wire Wire Line
	4600 2750 4600 3750
Wire Wire Line
	5300 3750 5300 3050
Wire Wire Line
	4550 3050 5300 3050
Wire Wire Line
	3000 3450 3000 3400
Wire Wire Line
	3000 3400 2600 3400
Wire Wire Line
	2600 3600 2600 3400
Connection ~ 2600 3400
Wire Wire Line
	2600 3900 2600 4100
Connection ~ 2600 4100
Wire Wire Line
	4600 2400 4650 2400
Wire Wire Line
	1900 4100 2150 4100
Wire Wire Line
	2300 3400 2600 3400
Wire Wire Line
	2450 4100 2600 4100
Wire Wire Line
	4950 1900 5900 1900
Wire Wire Line
	4600 2750 4600 2400
Connection ~ 4600 2750
Wire Wire Line
	5300 3050 5300 2400
Connection ~ 5300 3050
$Comp
L Relay:G5Q-1A K1
U 1 1 62981E21
P 3200 3750
F 0 "K1" H 2770 3704 50  0000 R CNN
F 1 "JV24-KT" H 2770 3795 50  0000 R CNN
F 2 "ProjectFootprints:Fujitsu_JV-xx-KT" H 3550 3700 50  0001 L CNN
F 3 "https://www.omron.com/ecb/products/pdf/en-g5q.pdf" H 3200 3750 50  0001 C CNN
	1    3200 3750
	-1   0    0    -1  
$EndComp
Wire Wire Line
	2600 4100 3000 4100
Wire Wire Line
	3000 4050 3000 4100
$Comp
L Device:R R1
U 1 1 6298CCE6
P 4350 3400
F 0 "R1" V 4143 3400 50  0000 C CNN
F 1 "510" V 4234 3400 50  0000 C CNN
F 2 "Resistors_ThroughHole:R_Axial_DIN0207_L6.3mm_D2.5mm_P10.16mm_Horizontal" V 4280 3400 50  0001 C CNN
F 3 "~" H 4350 3400 50  0001 C CNN
	1    4350 3400
	0    1    1    0   
$EndComp
Wire Wire Line
	4500 3400 4950 3400
$Comp
L Device:Q_PNP_BCE Q1
U 1 1 629A1466
P 7450 2000
F 0 "Q1" V 7778 2000 50  0000 C CNN
F 1 "D45H11" V 7687 2000 50  0000 C CNN
F 2 "TO_SOT_Packages_THT:TO-220-3_Vertical" H 7650 2100 50  0001 C CNN
F 3 "~" H 7450 2000 50  0001 C CNN
	1    7450 2000
	0    1    -1   0   
$EndComp
$Comp
L Device:Q_NPN_CBE Q5
U 1 1 629A33D2
P 7950 2400
F 0 "Q5" V 8278 2400 50  0000 C CNN
F 1 "Q_NPN_CBE" V 8187 2400 50  0000 C CNN
F 2 "TO_SOT_Packages_THT:TO-92_Inline_Wide" H 8150 2500 50  0001 C CNN
F 3 "~" H 7950 2400 50  0001 C CNN
	1    7950 2400
	0    -1   -1   0   
$EndComp
Wire Wire Line
	7450 2200 7450 2300
Wire Wire Line
	7450 2300 7700 2300
Wire Wire Line
	7650 1900 7700 1900
Wire Wire Line
	8200 1900 8200 1950
Wire Wire Line
	8200 2300 8150 2300
$Comp
L Device:R R2
U 1 1 629A881C
P 7100 2650
F 0 "R2" V 7307 2650 50  0000 C CNN
F 1 "510" V 7216 2650 50  0000 C CNN
F 2 "Resistors_ThroughHole:R_Axial_DIN0207_L6.3mm_D2.5mm_P10.16mm_Horizontal" V 7030 2650 50  0001 C CNN
F 3 "~" H 7100 2650 50  0001 C CNN
	1    7100 2650
	0    -1   -1   0   
$EndComp
$Comp
L Device:R R4
U 1 1 629ACD36
P 7250 2300
F 0 "R4" V 7043 2300 50  0000 C CNN
F 1 "510" V 7134 2300 50  0000 C CNN
F 2 "Resistors_ThroughHole:R_Axial_DIN0207_L6.3mm_D2.5mm_P10.16mm_Horizontal" V 7180 2300 50  0001 C CNN
F 3 "~" H 7250 2300 50  0001 C CNN
	1    7250 2300
	0    1    1    0   
$EndComp
Wire Wire Line
	7400 2300 7450 2300
Connection ~ 7450 2300
Wire Wire Line
	7100 2300 7050 2300
Wire Wire Line
	7050 2300 7050 1900
Wire Wire Line
	7050 1900 7150 1900
Wire Wire Line
	6900 2650 6950 2650
Wire Wire Line
	6900 1900 7050 1900
Connection ~ 7050 1900
Wire Wire Line
	6900 1900 6900 2650
$Comp
L Device:R R10
U 1 1 629E28E5
P 8600 2850
F 0 "R10" H 8670 2896 50  0000 L CNN
F 1 "2.2k 1%" H 8670 2805 50  0000 L CNN
F 2 "Resistors_ThroughHole:R_Axial_DIN0207_L6.3mm_D2.5mm_P10.16mm_Horizontal" V 8530 2850 50  0001 C CNN
F 3 "~" H 8600 2850 50  0001 C CNN
	1    8600 2850
	1    0    0    -1  
$EndComp
$Comp
L Device:C C8
U 1 1 629E6ADA
P 7700 2100
F 0 "C8" V 7448 2100 50  0000 C CNN
F 1 "560pF" V 7539 2100 50  0000 C CNN
F 2 "Capacitors_ThroughHole:C_Disc_D5.0mm_W2.5mm_P5.00mm" H 7738 1950 50  0001 C CNN
F 3 "~" H 7700 2100 50  0001 C CNN
	1    7700 2100
	-1   0    0    1   
$EndComp
$Comp
L Device:R R9
U 1 1 629EA462
P 8600 2100
F 0 "R9" H 8670 2146 50  0000 L CNN
F 1 "9.1k" H 8670 2055 50  0000 L CNN
F 2 "Resistors_ThroughHole:R_Axial_DIN0207_L6.3mm_D2.5mm_P10.16mm_Horizontal" V 8530 2100 50  0001 C CNN
F 3 "~" H 8600 2100 50  0001 C CNN
	1    8600 2100
	1    0    0    -1  
$EndComp
$Comp
L Device:R_POT RV1
U 1 1 629EAE55
P 8600 2500
F 0 "RV1" H 8531 2546 50  0000 R CNN
F 1 "500" H 8531 2455 50  0000 R CNN
F 2 "Potentiometers:Potentiometer_Trimmer_ACP_CA6v_Horizontal" H 8600 2500 50  0001 C CNN
F 3 "~" H 8600 2500 50  0001 C CNN
	1    8600 2500
	-1   0    0    1   
$EndComp
Wire Wire Line
	8600 2700 8600 2650
Wire Wire Line
	8600 2350 8600 2300
Wire Wire Line
	8450 2500 8400 2500
Wire Wire Line
	8400 2500 8400 2300
Wire Wire Line
	8400 2300 8600 2300
Connection ~ 8600 2300
Wire Wire Line
	8600 2300 8600 2250
Wire Wire Line
	8600 1900 8600 1950
$Comp
L Device:CP C10
U 1 1 62A13C72
P 9400 2500
F 0 "C10" H 9518 2546 50  0000 L CNN
F 1 "10µF" H 9518 2455 50  0000 L CNN
F 2 "Capacitors_ThroughHole:CP_Radial_D5.0mm_P2.00mm" H 9438 2350 50  0001 C CNN
F 3 "~" H 9400 2500 50  0001 C CNN
	1    9400 2500
	1    0    0    -1  
$EndComp
Wire Wire Line
	9400 1900 9400 2350
$Comp
L power:GND #PWR0103
U 1 1 62A1B015
P 8600 3050
F 0 "#PWR0103" H 8600 2800 50  0001 C CNN
F 1 "GND" H 8605 2877 50  0001 C CNN
F 2 "" H 8600 3050 50  0001 C CNN
F 3 "" H 8600 3050 50  0001 C CNN
	1    8600 3050
	1    0    0    -1  
$EndComp
Wire Wire Line
	8600 3000 8600 3050
$Comp
L power:GND #PWR0104
U 1 1 62A318B0
P 9400 3050
F 0 "#PWR0104" H 9400 2800 50  0001 C CNN
F 1 "GND" H 9405 2877 50  0001 C CNN
F 2 "" H 9400 3050 50  0001 C CNN
F 3 "" H 9400 3050 50  0001 C CNN
	1    9400 3050
	1    0    0    -1  
$EndComp
Wire Wire Line
	9400 2650 9400 3050
$Comp
L Diode:1N4001 D3
U 1 1 62A35C25
P 7450 1550
F 0 "D3" H 7450 1767 50  0000 C CNN
F 1 "1N4001" H 7450 1676 50  0000 C CNN
F 2 "Diodes_ThroughHole:D_DO-41_SOD81_P10.16mm_Horizontal" H 7450 1375 50  0001 C CNN
F 3 "http://www.vishay.com/docs/88503/1n4001.pdf" H 7450 1550 50  0001 C CNN
	1    7450 1550
	1    0    0    -1  
$EndComp
Wire Wire Line
	7800 1550 7800 1900
Wire Wire Line
	7600 1550 7800 1550
Connection ~ 7800 1900
Wire Wire Line
	7800 1900 8200 1900
Wire Wire Line
	7150 1900 7150 1550
Wire Wire Line
	7150 1550 7300 1550
Connection ~ 7150 1900
Wire Wire Line
	7150 1900 7250 1900
$Comp
L Device:R R14
U 1 1 62A6AB9E
P 10100 2150
F 0 "R14" H 10170 2196 50  0000 L CNN
F 1 "9.1k" H 10170 2105 50  0000 L CNN
F 2 "Resistors_ThroughHole:R_Axial_DIN0207_L6.3mm_D2.5mm_P10.16mm_Horizontal" V 10030 2150 50  0001 C CNN
F 3 "~" H 10100 2150 50  0001 C CNN
	1    10100 2150
	-1   0    0    -1  
$EndComp
$Comp
L Device:LED D6
U 1 1 62A6B521
P 10100 2800
F 0 "D6" V 10139 2682 50  0000 R CNN
F 1 "LED" V 10048 2682 50  0000 R CNN
F 2 "LEDs:LED_D5.0mm" H 10100 2800 50  0001 C CNN
F 3 "~" H 10100 2800 50  0001 C CNN
	1    10100 2800
	0    -1   -1   0   
$EndComp
$Comp
L power:GND #PWR0105
U 1 1 62A6C1A3
P 10100 3050
F 0 "#PWR0105" H 10100 2800 50  0001 C CNN
F 1 "GND" H 10105 2877 50  0001 C CNN
F 2 "" H 10100 3050 50  0001 C CNN
F 3 "" H 10100 3050 50  0001 C CNN
	1    10100 3050
	1    0    0    -1  
$EndComp
Wire Wire Line
	10100 2650 10100 2300
Wire Wire Line
	10100 1900 10100 2000
Wire Wire Line
	10100 3050 10100 2950
$Comp
L Device:R R7
U 1 1 62AAEF5D
P 8050 5200
F 0 "R7" V 8257 5200 50  0000 C CNN
F 1 "510" V 8166 5200 50  0000 C CNN
F 2 "Resistors_ThroughHole:R_Axial_DIN0207_L6.3mm_D2.5mm_P10.16mm_Horizontal" V 7980 5200 50  0001 C CNN
F 3 "~" H 8050 5200 50  0001 C CNN
	1    8050 5200
	0    -1   -1   0   
$EndComp
$Comp
L Device:CP C7
U 1 1 62AAF88A
P 7400 4450
F 0 "C7" H 7300 4500 50  0000 R CNN
F 1 "100µF" H 7300 4400 50  0000 R CNN
F 2 "Capacitors_ThroughHole:CP_Radial_D6.3mm_P2.50mm" H 7438 4300 50  0001 C CNN
F 3 "~" H 7400 4450 50  0001 C CNN
	1    7400 4450
	1    0    0    -1  
$EndComp
$Comp
L Device:Q_NPN_CBE Q9
U 1 1 62840CEF
P 8600 4100
F 0 "Q9" V 8928 4100 50  0000 C CNN
F 1 "Q_NPN_CBE" V 8837 4100 50  0000 C CNN
F 2 "TO_SOT_Packages_THT:TO-92_Inline_Wide" H 8800 4200 50  0001 C CNN
F 3 "~" H 8600 4100 50  0001 C CNN
	1    8600 4100
	-1   0    0    -1  
$EndComp
$Comp
L Device:Q_PNP_CBE Q7
U 1 1 62841822
P 8400 4550
F 0 "Q7" V 8635 4550 50  0000 C CNN
F 1 "Q_PNP_CBE" V 8726 4550 50  0000 C CNN
F 2 "TO_SOT_Packages_THT:TO-92_Inline_Wide" H 8600 4650 50  0001 C CNN
F 3 "~" H 8400 4550 50  0001 C CNN
	1    8400 4550
	1    0    0    1   
$EndComp
$Comp
L Device:Q_PNP_CBE Q4
U 1 1 62847B5D
P 7800 4550
F 0 "Q4" V 8035 4550 50  0000 C CNN
F 1 "Q_PNP_CBE" V 8126 4550 50  0000 C CNN
F 2 "TO_SOT_Packages_THT:TO-92_Inline_Wide" H 8000 4650 50  0001 C CNN
F 3 "~" H 7800 4550 50  0001 C CNN
	1    7800 4550
	-1   0    0    1   
$EndComp
Wire Wire Line
	8500 4350 8500 4300
Wire Wire Line
	8500 3900 8500 3850
Connection ~ 8500 3850
$Comp
L Device:Q_NPN_CBE Q3
U 1 1 6288518D
P 7800 4100
F 0 "Q3" V 8128 4100 50  0000 C CNN
F 1 "Q_NPN_CBE" V 8037 4100 50  0000 C CNN
F 2 "TO_SOT_Packages_THT:TO-92_Inline_Wide" H 8000 4200 50  0001 C CNN
F 3 "~" H 7800 4100 50  0001 C CNN
	1    7800 4100
	-1   0    0    -1  
$EndComp
$Comp
L Device:R R13
U 1 1 6289EAA9
P 9000 4300
F 0 "R13" H 9070 4346 50  0000 L CNN
F 1 "2.2k 1%" H 9070 4255 50  0000 L CNN
F 2 "Resistors_ThroughHole:R_Axial_DIN0207_L6.3mm_D2.5mm_P10.16mm_Horizontal" V 8930 4300 50  0001 C CNN
F 3 "~" H 9000 4300 50  0001 C CNN
	1    9000 4300
	1    0    0    -1  
$EndComp
$Comp
L Device:R_POT RV2
U 1 1 6289F0B2
P 9000 3450
F 0 "RV2" H 8931 3496 50  0000 R CNN
F 1 "500" H 8931 3405 50  0000 R CNN
F 2 "Potentiometers:Potentiometer_Trimmer_ACP_CA6v_Horizontal" H 9000 3450 50  0001 C CNN
F 3 "~" H 9000 3450 50  0001 C CNN
	1    9000 3450
	-1   0    0    -1  
$EndComp
$Comp
L Device:C C9
U 1 1 628A402D
P 8150 4350
F 0 "C9" V 7898 4350 50  0000 C CNN
F 1 "10nF" V 7989 4350 50  0000 C CNN
F 2 "Capacitors_ThroughHole:C_Disc_D5.0mm_W2.5mm_P5.00mm" H 8188 4200 50  0001 C CNN
F 3 "~" H 8150 4350 50  0001 C CNN
	1    8150 4350
	1    0    0    -1  
$EndComp
Connection ~ 8750 5950
$Comp
L Device:R R6
U 1 1 628528DC
P 7700 5000
F 0 "R6" V 7493 5000 50  0000 C CNN
F 1 "9.1k" V 7584 5000 50  0000 C CNN
F 2 "Resistors_ThroughHole:R_Axial_DIN0207_L6.3mm_D2.5mm_P10.16mm_Horizontal" V 7630 5000 50  0001 C CNN
F 3 "~" H 7700 5000 50  0001 C CNN
	1    7700 5000
	1    0    0    -1  
$EndComp
Wire Wire Line
	8750 5550 8700 5550
Wire Wire Line
	8750 5950 8750 5900
Wire Wire Line
	8000 5550 8250 5550
Connection ~ 8000 5550
Wire Wire Line
	8000 5650 8000 5550
$Comp
L Device:R R8
U 1 1 62A9143C
P 7800 5550
F 0 "R8" V 7593 5550 50  0000 C CNN
F 1 "510" V 7684 5550 50  0000 C CNN
F 2 "Resistors_ThroughHole:R_Axial_DIN0207_L6.3mm_D2.5mm_P10.16mm_Horizontal" V 7730 5550 50  0001 C CNN
F 3 "~" H 7800 5550 50  0001 C CNN
	1    7800 5550
	0    1    1    0   
$EndComp
$Comp
L Device:Q_PNP_CBE Q8
U 1 1 62A90C1D
P 8500 5450
F 0 "Q8" V 8400 5200 50  0000 C CNN
F 1 "Q_PNP_CBE" V 8500 5200 50  0000 C CNN
F 2 "TO_SOT_Packages_THT:TO-92_Inline_Wide" H 8700 5550 50  0001 C CNN
F 3 "~" H 8500 5450 50  0001 C CNN
	1    8500 5450
	0    -1   1    0   
$EndComp
$Comp
L Device:Q_NPN_BCE Q6
U 1 1 62A8CC88
P 8000 5850
F 0 "Q6" V 7850 5600 50  0000 C CNN
F 1 "D44H11" V 7950 5600 50  0000 C CNN
F 2 "TO_SOT_Packages_THT:TO-220-3_Vertical" H 8200 5950 50  0001 C CNN
F 3 "~" H 8000 5850 50  0001 C CNN
	1    8000 5850
	0    1    1    0   
$EndComp
Connection ~ 8500 5200
Wire Wire Line
	9000 3600 9000 3650
$Comp
L Device:R R12
U 1 1 6290D5C0
P 9000 2700
F 0 "R12" H 9070 2746 50  0000 L CNN
F 1 "2.2k 1%" H 9070 2655 50  0000 L CNN
F 2 "Resistors_ThroughHole:R_Axial_DIN0207_L6.3mm_D2.5mm_P10.16mm_Horizontal" V 8930 2700 50  0001 C CNN
F 3 "~" H 9000 2700 50  0001 C CNN
	1    9000 2700
	1    0    0    -1  
$EndComp
Connection ~ 9000 1900
Wire Wire Line
	9000 1900 9400 1900
Wire Wire Line
	8600 1900 9000 1900
Connection ~ 8600 1900
Wire Wire Line
	9000 1900 9000 2550
$Comp
L power:GND #PWR0106
U 1 1 6294FFA3
P 6950 3900
F 0 "#PWR0106" H 6950 3650 50  0001 C CNN
F 1 "GND" H 6955 3727 50  0001 C CNN
F 2 "" H 6950 3900 50  0001 C CNN
F 3 "" H 6950 3900 50  0001 C CNN
	1    6950 3900
	1    0    0    -1  
$EndComp
$Comp
L Device:CP C11
U 1 1 6295A9C9
P 9400 4800
F 0 "C11" H 9518 4846 50  0000 L CNN
F 1 "10µF" H 9518 4755 50  0000 L CNN
F 2 "Capacitors_ThroughHole:CP_Radial_D5.0mm_P2.00mm" H 9438 4650 50  0001 C CNN
F 3 "~" H 9400 4800 50  0001 C CNN
	1    9400 4800
	1    0    0    -1  
$EndComp
Wire Wire Line
	9400 5950 9400 4950
Connection ~ 9000 5950
Wire Wire Line
	8800 4100 8850 4100
Wire Wire Line
	8850 4100 8850 3850
Connection ~ 8850 3850
Wire Wire Line
	8850 3850 8500 3850
Wire Wire Line
	5700 2400 5700 2450
$Comp
L power:GND #PWR0107
U 1 1 62747209
P 5700 2450
F 0 "#PWR0107" H 5700 2200 50  0001 C CNN
F 1 "GND" H 5705 2277 50  0001 C CNN
F 2 "" H 5700 2450 50  0001 C CNN
F 3 "" H 5700 2450 50  0001 C CNN
	1    5700 2450
	1    0    0    -1  
$EndComp
Wire Wire Line
	5900 2400 5900 2300
Connection ~ 5900 2400
Wire Wire Line
	5900 2400 5700 2400
Wire Wire Line
	5900 2550 5900 2400
$Comp
L Device:CP C3
U 1 1 62744D0D
P 5900 2700
F 0 "C3" H 6018 2746 50  0000 L CNN
F 1 "4700µF/40V" H 6018 2655 50  0000 L CNN
F 2 "ProjectFootprints:Roederstein_EG03_21x40" H 5938 2550 50  0001 C CNN
F 3 "~" H 5900 2700 50  0001 C CNN
	1    5900 2700
	1    0    0    -1  
$EndComp
Wire Wire Line
	4950 2950 5900 2950
$Comp
L Device:R R15
U 1 1 62A4A87E
P 10100 5300
F 0 "R15" H 10170 5346 50  0000 L CNN
F 1 "9.1k" H 10170 5255 50  0000 L CNN
F 2 "Resistors_ThroughHole:R_Axial_DIN0207_L6.3mm_D2.5mm_P2.54mm_Vertical" V 10030 5300 50  0001 C CNN
F 3 "~" H 10100 5300 50  0001 C CNN
	1    10100 5300
	-1   0    0    -1  
$EndComp
$Comp
L Device:LED D7
U 1 1 62A4A884
P 10100 4450
F 0 "D7" V 10139 4332 50  0000 R CNN
F 1 "LED" V 10048 4332 50  0000 R CNN
F 2 "LEDs:LED_D5.0mm" H 10100 4450 50  0001 C CNN
F 3 "~" H 10100 4450 50  0001 C CNN
	1    10100 4450
	0    -1   -1   0   
$EndComp
Wire Wire Line
	10100 3850 10100 4300
$Comp
L Device:Q_NPN_CBE Q2
U 1 1 62A84B0F
P 7050 3450
F 0 "Q2" V 7378 3450 50  0000 C CNN
F 1 "n.p." V 7287 3450 50  0000 C CNN
F 2 "TO_SOT_Packages_THT:TO-92_Inline_Wide" H 7250 3550 50  0001 C CNN
F 3 "~" H 7050 3450 50  0001 C CNN
	1    7050 3450
	-1   0    0    -1  
$EndComp
Connection ~ 8400 2500
$Comp
L Diode:1N4148 D4
U 1 1 62B66F4F
P 7300 3650
F 0 "D4" V 7254 3730 50  0000 L CNN
F 1 "n.p." V 7345 3730 50  0000 L CNN
F 2 "Diodes_ThroughHole:D_DO-35_SOD27_P2.54mm_Vertical_AnodeUp" H 7300 3475 50  0001 C CNN
F 3 "https://assets.nexperia.com/documents/data-sheet/1N4148_1N4448.pdf" H 7300 3650 50  0001 C CNN
	1    7300 3650
	0    1    1    0   
$EndComp
Connection ~ 7700 3850
$Comp
L power:GND #PWR0108
U 1 1 629E7079
P 7850 3050
F 0 "#PWR0108" H 7850 2800 50  0001 C CNN
F 1 "GND" H 7855 2877 50  0001 C CNN
F 2 "" H 7850 3050 50  0001 C CNN
F 3 "" H 7850 3050 50  0001 C CNN
	1    7850 3050
	1    0    0    -1  
$EndComp
Wire Wire Line
	7850 3000 7850 3050
Wire Wire Line
	8400 2900 7950 2900
$Comp
L Reference_Voltage:TL431LP U1
U 1 1 629DF696
P 7850 2900
F 0 "U1" V 7896 2830 50  0000 R CNN
F 1 "TL431LP" V 7805 2830 50  0000 R CNN
F 2 "TO_SOT_Packages_THT:TO-92_Inline_Wide" H 7850 2750 50  0001 C CIN
F 3 "http://www.ti.com/lit/ds/symlink/tl431.pdf" H 7850 2900 50  0001 C CIN
	1    7850 2900
	0    1    -1   0   
$EndComp
$Comp
L Diode:1N4001 D5
U 1 1 62E7500C
P 8000 6250
F 0 "D5" H 8000 6467 50  0000 C CNN
F 1 "1N4001" H 8000 6376 50  0000 C CNN
F 2 "Diodes_ThroughHole:D_DO-41_SOD81_P10.16mm_Horizontal" H 8000 6075 50  0001 C CNN
F 3 "http://www.vishay.com/docs/88503/1n4001.pdf" H 8000 6250 50  0001 C CNN
	1    8000 6250
	-1   0    0    1   
$EndComp
Wire Wire Line
	7700 5950 7700 6250
Connection ~ 7700 5950
$Comp
L Connector_Generic:Conn_01x05 J1
U 1 1 62E8BF65
P 2100 3150
F 0 "J1" V 2064 2862 50  0000 R CNN
F 1 "Conn_01x05" V 1973 2862 50  0000 R CNN
F 2 "ProjectFootprints:Wago_236-405" H 2100 3150 50  0001 C CNN
F 3 "~" H 2100 3150 50  0001 C CNN
F 4 "236-405" H 2100 3150 50  0001 C CNN "MPN"
F 5 "WAGO" H 2100 3150 50  0001 C CNN "Manufacturer"
	1    2100 3150
	0    1    -1   0   
$EndComp
Wire Wire Line
	1900 3350 1900 4100
Wire Wire Line
	2000 3350 2000 3600
Wire Wire Line
	2000 3600 2200 3600
Wire Wire Line
	2200 3600 2200 3350
Wire Wire Line
	2300 3400 2300 3350
Wire Wire Line
	2300 2950 2300 3100
Wire Wire Line
	2300 2950 2650 2950
Wire Wire Line
	2200 2850 2200 3100
Wire Wire Line
	2200 2850 2650 2850
$Comp
L power:Earth #PWR0109
U 1 1 62F28E81
P 2100 3400
F 0 "#PWR0109" H 2100 3150 50  0001 C CNN
F 1 "Earth" H 2100 3250 50  0001 C CNN
F 2 "" H 2100 3400 50  0001 C CNN
F 3 "~" H 2100 3400 50  0001 C CNN
	1    2100 3400
	1    0    0    -1  
$EndComp
Wire Wire Line
	2100 3350 2100 3400
$Comp
L power:+12V #PWR0110
U 1 1 62F54551
P 10450 1900
F 0 "#PWR0110" H 10450 1750 50  0001 C CNN
F 1 "+12V" V 10465 2028 50  0000 L CNN
F 2 "" H 10450 1900 50  0001 C CNN
F 3 "" H 10450 1900 50  0001 C CNN
	1    10450 1900
	0    1    1    0   
$EndComp
Wire Wire Line
	10100 1900 10250 1900
Connection ~ 10100 1900
Wire Wire Line
	10250 1900 10250 2000
Wire Wire Line
	10250 2000 10300 2000
Connection ~ 10250 1900
Wire Wire Line
	10250 1900 10450 1900
Wire Wire Line
	10250 2000 10250 2100
Wire Wire Line
	10250 2100 10300 2100
Connection ~ 10250 2000
Wire Wire Line
	10250 2100 10250 2200
Wire Wire Line
	10250 2200 10300 2200
Connection ~ 10250 2100
Wire Wire Line
	10250 2200 10250 2300
Wire Wire Line
	10250 2300 10300 2300
Connection ~ 10250 2200
$Comp
L power:-12V #PWR0111
U 1 1 62F8DD1F
P 10450 5950
F 0 "#PWR0111" H 10450 6050 50  0001 C CNN
F 1 "-12V" V 10465 6078 50  0000 L CNN
F 2 "" H 10450 5950 50  0001 C CNN
F 3 "" H 10450 5950 50  0001 C CNN
	1    10450 5950
	0    1    1    0   
$EndComp
Wire Wire Line
	10250 5750 10300 5750
Wire Wire Line
	10250 5750 10250 5850
Connection ~ 10250 5950
Wire Wire Line
	10250 5950 10450 5950
Wire Wire Line
	10300 5850 10250 5850
Connection ~ 10250 5850
Wire Wire Line
	10250 5850 10250 5950
Wire Wire Line
	10250 5750 10250 5650
Wire Wire Line
	10250 5650 10300 5650
Connection ~ 10250 5750
Wire Wire Line
	10250 5650 10250 5550
Wire Wire Line
	10250 5550 10300 5550
Connection ~ 10250 5650
Wire Wire Line
	10100 3850 10250 3850
Wire Wire Line
	10250 3850 10300 3850
Wire Wire Line
	10250 3850 10250 3750
Wire Wire Line
	10250 3750 10300 3750
Connection ~ 10250 3850
Wire Wire Line
	10250 3750 10250 3650
Wire Wire Line
	10250 3650 10300 3650
Connection ~ 10250 3750
Wire Wire Line
	10250 3650 10250 3550
Wire Wire Line
	10250 3550 10300 3550
Connection ~ 10250 3650
Wire Wire Line
	8200 5200 8500 5200
Wire Wire Line
	8500 5200 8500 5250
$Comp
L Device:R R3
U 1 1 62AB01DF
P 7400 5550
F 0 "R3" V 7607 5550 50  0000 C CNN
F 1 "510" V 7516 5550 50  0000 C CNN
F 2 "Resistors_ThroughHole:R_Axial_DIN0207_L6.3mm_D2.5mm_P10.16mm_Horizontal" V 7330 5550 50  0001 C CNN
F 3 "~" H 7400 5550 50  0001 C CNN
	1    7400 5550
	-1   0    0    1   
$EndComp
Wire Wire Line
	10100 5450 10100 5950
Wire Wire Line
	7400 5400 7400 5200
Wire Wire Line
	7700 4850 7700 4800
Connection ~ 7700 4800
Wire Wire Line
	7700 4800 7700 4750
Wire Wire Line
	8050 4550 8000 4550
Wire Wire Line
	7700 4300 7700 4350
Wire Wire Line
	7700 3900 7700 3850
Wire Wire Line
	8000 4100 8150 4100
Wire Wire Line
	8150 4100 8150 3450
Wire Wire Line
	7700 5200 7700 5150
Connection ~ 7700 5200
Wire Wire Line
	7700 5200 7900 5200
Wire Wire Line
	7400 4600 7400 5200
Connection ~ 7400 5200
Wire Wire Line
	7400 5200 7700 5200
Connection ~ 7400 3850
Wire Wire Line
	8850 3850 9400 3850
Wire Wire Line
	7400 3850 7400 4300
Wire Wire Line
	8500 4750 8500 4800
Wire Wire Line
	8500 4800 8150 4800
Wire Wire Line
	8150 4800 8150 4500
Connection ~ 8500 4800
Wire Wire Line
	8500 4800 8500 5200
Wire Wire Line
	8150 4200 8150 4100
Connection ~ 8150 4100
Wire Wire Line
	8050 4800 8050 4550
Wire Wire Line
	7700 4800 8050 4800
Wire Wire Line
	8200 4550 8050 4550
Connection ~ 8050 4550
Wire Wire Line
	9000 4450 9000 5950
Wire Wire Line
	9400 3850 9400 4650
Wire Wire Line
	10100 4600 10100 5150
Wire Wire Line
	9000 3300 9000 2850
Wire Wire Line
	10100 5950 10250 5950
Wire Wire Line
	9000 5950 9400 5950
Wire Wire Line
	6600 2950 6600 5950
Connection ~ 6600 2950
Wire Wire Line
	7700 6250 7850 6250
Wire Wire Line
	8150 6250 8350 6250
$Comp
L Device:R R11
U 1 1 6381FD84
P 8800 3650
F 0 "R11" V 8650 3500 50  0000 L CNN
F 1 "9.1k" V 8700 3500 50  0000 L CNN
F 2 "Resistors_ThroughHole:R_Axial_DIN0207_L6.3mm_D2.5mm_P10.16mm_Horizontal" V 8730 3650 50  0001 C CNN
F 3 "~" H 8800 3650 50  0001 C CNN
	1    8800 3650
	0    1    1    0   
$EndComp
Wire Wire Line
	8650 3650 8600 3650
Wire Wire Line
	8600 3650 8600 3450
Wire Wire Line
	8950 3650 9000 3650
Connection ~ 9000 3650
Wire Wire Line
	9000 3650 9000 4150
$Comp
L Device:C C12
U 1 1 628650C8
P 9800 2500
F 0 "C12" V 9548 2500 50  0000 C CNN
F 1 "100nF" V 9639 2500 50  0000 C CNN
F 2 "Capacitors_ThroughHole:C_Rect_L7.0mm_W2.5mm_P5.00mm" H 9838 2350 50  0001 C CNN
F 3 "~" H 9800 2500 50  0001 C CNN
	1    9800 2500
	-1   0    0    1   
$EndComp
Wire Wire Line
	9400 1900 9800 1900
Connection ~ 9400 1900
Wire Wire Line
	9800 2350 9800 1900
Connection ~ 9800 1900
Wire Wire Line
	9800 1900 10100 1900
$Comp
L power:GND #PWR0113
U 1 1 628C8F6D
P 9800 3050
F 0 "#PWR0113" H 9800 2800 50  0001 C CNN
F 1 "GND" H 9805 2877 50  0001 C CNN
F 2 "" H 9800 3050 50  0001 C CNN
F 3 "" H 9800 3050 50  0001 C CNN
	1    9800 3050
	1    0    0    -1  
$EndComp
Wire Wire Line
	9800 3050 9800 2650
$Comp
L Device:C C13
U 1 1 628D7608
P 9800 4800
F 0 "C13" V 9548 4800 50  0000 C CNN
F 1 "100nF" V 9639 4800 50  0000 C CNN
F 2 "Capacitors_ThroughHole:C_Rect_L7.0mm_W2.5mm_P5.00mm" H 9838 4650 50  0001 C CNN
F 3 "~" H 9800 4800 50  0001 C CNN
	1    9800 4800
	-1   0    0    1   
$EndComp
Wire Wire Line
	9400 3850 9800 3850
Connection ~ 9400 3850
Wire Wire Line
	9800 4650 9800 3850
Connection ~ 9800 3850
Wire Wire Line
	9800 3850 10100 3850
Wire Wire Line
	9800 4950 9800 5950
Connection ~ 9800 5950
Wire Wire Line
	9800 5950 10100 5950
Wire Wire Line
	9400 5950 9800 5950
Connection ~ 9400 5950
$Comp
L Device:C C4
U 1 1 6297D59F
P 6600 2150
F 0 "C4" V 6348 2150 50  0000 C CNN
F 1 "100nF" V 6439 2150 50  0000 C CNN
F 2 "Capacitors_ThroughHole:C_Rect_L7.0mm_W2.5mm_P5.00mm" H 6638 2000 50  0001 C CNN
F 3 "~" H 6600 2150 50  0001 C CNN
	1    6600 2150
	-1   0    0    1   
$EndComp
Wire Wire Line
	6600 1900 6600 2000
Connection ~ 6600 1900
Connection ~ 5900 1900
Wire Wire Line
	5900 2400 6600 2400
Wire Wire Line
	6600 2400 6600 2300
$Comp
L Device:C C5
U 1 1 629A96E5
P 6600 2700
F 0 "C5" V 6348 2700 50  0000 C CNN
F 1 "100nF" V 6439 2700 50  0000 C CNN
F 2 "Capacitors_ThroughHole:C_Rect_L7.0mm_W2.5mm_P5.00mm" H 6638 2550 50  0001 C CNN
F 3 "~" H 6600 2700 50  0001 C CNN
	1    6600 2700
	-1   0    0    1   
$EndComp
Wire Wire Line
	6600 2400 6600 2550
Connection ~ 6600 2400
Wire Wire Line
	5900 2950 5900 2850
Connection ~ 5900 2950
Wire Wire Line
	5900 2950 6600 2950
Wire Wire Line
	6600 2850 6600 2950
Wire Wire Line
	6600 1900 6900 1900
Wire Wire Line
	5900 1900 6600 1900
Wire Wire Line
	8200 5950 8250 5950
Wire Wire Line
	8350 6250 8350 5950
Connection ~ 8350 5950
Wire Wire Line
	8350 5950 8750 5950
$Comp
L Mechanical:Heatsink_Pad HS1
U 1 1 6286519B
P 4650 4500
F 0 "HS1" H 4791 4539 50  0000 L CNN
F 1 "Heatsink_Pad" H 4791 4448 50  0000 L CNN
F 2 "ProjectFootprints:Heatsink" H 4662 4450 50  0001 C CNN
F 3 "~" H 4662 4450 50  0001 C CNN
	1    4650 4500
	1    0    0    -1  
$EndComp
$Comp
L power:Earth #PWR01
U 1 1 628699CC
P 4650 4650
F 0 "#PWR01" H 4650 4400 50  0001 C CNN
F 1 "Earth" H 4650 4500 50  0001 C CNN
F 2 "" H 4650 4650 50  0001 C CNN
F 3 "~" H 4650 4650 50  0001 C CNN
	1    4650 4650
	1    0    0    -1  
$EndComp
Wire Wire Line
	4650 4600 4650 4650
$Comp
L Connector_Generic:Conn_01x04 J2
U 1 1 62873ABB
P 3950 2850
F 0 "J2" H 4030 2842 50  0000 L CNN
F 1 "Conn_01x04" H 4030 2751 50  0000 L CNN
F 2 "ProjectFootprints:Wago_236-404" H 3950 2850 50  0001 C CNN
F 3 "~" H 3950 2850 50  0001 C CNN
F 4 "236-404" H 3950 2850 50  0001 C CNN "MPN"
F 5 "Wago" H 3950 2850 50  0001 C CNN "Manufacturer"
	1    3950 2850
	-1   0    0    -1  
$EndComp
$Comp
L Mechanical:MountingHole_Pad H1
U 1 1 628A3B30
P 4650 4950
F 0 "H1" H 4750 4999 50  0000 L CNN
F 1 "MountingHole_Pad" H 4750 4908 50  0000 L CNN
F 2 "Mounting_Holes:MountingHole_3.2mm_M3_Pad_Via" H 4650 4950 50  0001 C CNN
F 3 "~" H 4650 4950 50  0001 C CNN
	1    4650 4950
	1    0    0    -1  
$EndComp
$Comp
L power:Earth #PWR02
U 1 1 628A43C6
P 4650 5100
F 0 "#PWR02" H 4650 4850 50  0001 C CNN
F 1 "Earth" H 4650 4950 50  0001 C CNN
F 2 "" H 4650 5100 50  0001 C CNN
F 3 "~" H 4650 5100 50  0001 C CNN
	1    4650 5100
	1    0    0    -1  
$EndComp
Wire Wire Line
	4650 5050 4650 5100
$Comp
L Connector_Generic:Conn_01x06 J3
U 1 1 628BFD00
P 10500 2200
F 0 "J3" H 10580 2192 50  0000 L CNN
F 1 "Conn_01x06" H 10580 2101 50  0000 L CNN
F 2 "ProjectFootprints:Wago_236-406" H 10500 2200 50  0001 C CNN
F 3 "~" H 10500 2200 50  0001 C CNN
	1    10500 2200
	1    0    0    -1  
$EndComp
$Comp
L Connector_Generic:Conn_01x06 J4
U 1 1 628C4C75
P 10500 3550
F 0 "J4" H 10580 3542 50  0000 L CNN
F 1 "Conn_01x06" H 10580 3451 50  0000 L CNN
F 2 "ProjectFootprints:Wago_236-406" H 10500 3550 50  0001 C CNN
F 3 "~" H 10500 3550 50  0001 C CNN
	1    10500 3550
	1    0    0    -1  
$EndComp
$Comp
L Connector_Generic:Conn_01x06 J5
U 1 1 628C7A49
P 10500 5550
F 0 "J5" H 10580 5542 50  0000 L CNN
F 1 "Conn_01x06" H 10580 5451 50  0000 L CNN
F 2 "ProjectFootprints:Wago_236-406" H 10500 5550 50  0001 C CNN
F 3 "~" H 10500 5550 50  0001 C CNN
	1    10500 5550
	1    0    0    -1  
$EndComp
Wire Wire Line
	10250 5550 10250 5450
Wire Wire Line
	10250 5450 10300 5450
Connection ~ 10250 5550
Wire Wire Line
	10250 5450 10250 5350
Wire Wire Line
	10250 5350 10300 5350
Connection ~ 10250 5450
Wire Wire Line
	10250 3550 10250 3450
Wire Wire Line
	10250 3450 10300 3450
Connection ~ 10250 3550
Wire Wire Line
	10250 3450 10250 3350
Wire Wire Line
	10250 3350 10300 3350
Connection ~ 10250 3450
Wire Wire Line
	10300 2400 10250 2400
Wire Wire Line
	10250 2400 10250 2300
Connection ~ 10250 2300
Wire Wire Line
	10300 2500 10250 2500
Wire Wire Line
	10250 2500 10250 2400
Connection ~ 10250 2400
Text Label 2000 3600 0    10   ~ 0
LINE_N
Text Label 1900 4100 0    10   ~ 0
LINE_L
Text Label 2300 3400 0    10   ~ 0
LINE_TRANSFORMER
Text Label 2600 4100 0    10   ~ 0
LINE_FUSED
$Comp
L Mechanical:MountingHole_Pad H2
U 1 1 62876972
P 4650 5400
F 0 "H2" H 4750 5449 50  0000 L CNN
F 1 "MountingHole_Pad" H 4750 5358 50  0000 L CNN
F 2 "Mounting_Holes:MountingHole_3.2mm_M3_Pad_Via" H 4650 5400 50  0001 C CNN
F 3 "~" H 4650 5400 50  0001 C CNN
	1    4650 5400
	1    0    0    -1  
$EndComp
$Comp
L power:Earth #PWR0114
U 1 1 62876FF4
P 4650 5550
F 0 "#PWR0114" H 4650 5300 50  0001 C CNN
F 1 "Earth" H 4650 5400 50  0001 C CNN
F 2 "" H 4650 5550 50  0001 C CNN
F 3 "~" H 4650 5550 50  0001 C CNN
	1    4650 5550
	1    0    0    -1  
$EndComp
Wire Wire Line
	4650 5500 4650 5550
$Comp
L Mechanical:MountingHole H3
U 1 1 62887F48
P 5600 4500
F 0 "H3" H 5700 4546 50  0000 L CNN
F 1 "MountingHole" H 5700 4455 50  0000 L CNN
F 2 "Mounting_Holes:MountingHole_3.2mm_M3" H 5600 4500 50  0001 C CNN
F 3 "~" H 5600 4500 50  0001 C CNN
	1    5600 4500
	1    0    0    -1  
$EndComp
$Comp
L Mechanical:MountingHole H4
U 1 1 6288AA3A
P 5600 4750
F 0 "H4" H 5700 4796 50  0000 L CNN
F 1 "MountingHole" H 5700 4705 50  0000 L CNN
F 2 "Mounting_Holes:MountingHole_3.2mm_M3" H 5600 4750 50  0001 C CNN
F 3 "~" H 5600 4750 50  0001 C CNN
	1    5600 4750
	1    0    0    -1  
$EndComp
$Comp
L Mechanical:MountingHole H5
U 1 1 6288AEA8
P 5600 5000
F 0 "H5" H 5700 5046 50  0000 L CNN
F 1 "MountingHole" H 5700 4955 50  0000 L CNN
F 2 "Mounting_Holes:MountingHole_3.2mm_M3" H 5600 5000 50  0001 C CNN
F 3 "~" H 5600 5000 50  0001 C CNN
	1    5600 5000
	1    0    0    -1  
$EndComp
Wire Wire Line
	7700 1950 7700 1900
Connection ~ 7700 1900
Wire Wire Line
	7700 1900 7800 1900
Wire Wire Line
	7700 2250 7700 2300
Connection ~ 7700 2300
Wire Wire Line
	7700 2300 7750 2300
$Comp
L Device:R R?
U 1 1 6323D6AB
P 8200 2100
F 0 "R?" V 8407 2100 50  0000 C CNN
F 1 "47R" V 8316 2100 50  0000 C CNN
F 2 "Resistors_ThroughHole:R_Axial_DIN0207_L6.3mm_D2.5mm_P10.16mm_Horizontal" V 8130 2100 50  0001 C CNN
F 3 "~" H 8200 2100 50  0001 C CNN
	1    8200 2100
	1    0    0    -1  
$EndComp
Wire Wire Line
	8200 2250 8200 2300
Wire Wire Line
	7950 2650 7950 2600
$Comp
L Device:C C?
U 1 1 632AB779
P 8150 2650
F 0 "C?" V 7898 2650 50  0000 C CNN
F 1 "10nF" V 7989 2650 50  0000 C CNN
F 2 "Capacitors_ThroughHole:C_Disc_D5.0mm_W2.5mm_P5.00mm" H 8188 2500 50  0001 C CNN
F 3 "~" H 8150 2650 50  0001 C CNN
	1    8150 2650
	0    1    1    0   
$EndComp
Wire Wire Line
	7950 2650 8000 2650
Wire Wire Line
	8400 2500 8400 2650
Connection ~ 7950 2650
Wire Wire Line
	8300 2650 8400 2650
Connection ~ 8400 2650
Wire Wire Line
	8400 2650 8400 2900
Wire Wire Line
	7850 2650 7850 2800
Connection ~ 7850 2650
Wire Wire Line
	7850 2650 7950 2650
Wire Wire Line
	8200 1900 8600 1900
Connection ~ 8200 1900
$Comp
L Device:C C?
U 1 1 633F9C37
P 8250 5750
F 0 "C?" H 8250 5350 50  0000 C CNN
F 1 "560pF" H 8250 5450 50  0000 C CNN
F 2 "Capacitors_ThroughHole:C_Disc_D5.0mm_W2.5mm_P5.00mm" H 8288 5600 50  0001 C CNN
F 3 "~" H 8250 5750 50  0001 C CNN
	1    8250 5750
	-1   0    0    1   
$EndComp
Wire Wire Line
	8750 5950 9000 5950
Wire Wire Line
	8250 5600 8250 5550
Connection ~ 8250 5550
Wire Wire Line
	8250 5550 8300 5550
Wire Wire Line
	8250 5900 8250 5950
Connection ~ 8250 5950
Wire Wire Line
	8250 5950 8350 5950
$Comp
L Device:R R?
U 1 1 634C5017
P 8750 5750
F 0 "R?" V 8957 5750 50  0000 C CNN
F 1 "47R" V 8866 5750 50  0000 C CNN
F 2 "Resistors_ThroughHole:R_Axial_DIN0207_L6.3mm_D2.5mm_P10.16mm_Horizontal" V 8680 5750 50  0001 C CNN
F 3 "~" H 8750 5750 50  0001 C CNN
	1    8750 5750
	-1   0    0    1   
$EndComp
Wire Wire Line
	8750 5600 8750 5550
Wire Wire Line
	7400 5700 7400 5950
Connection ~ 7400 5950
Wire Wire Line
	7400 5950 7600 5950
Wire Wire Line
	7950 5550 8000 5550
Wire Wire Line
	7650 5550 7600 5550
Wire Wire Line
	7600 5550 7600 5950
Connection ~ 7600 5950
Wire Wire Line
	7600 5950 7700 5950
Wire Wire Line
	7700 5950 7800 5950
Connection ~ 10100 5950
Connection ~ 8150 3450
Connection ~ 8600 3450
Wire Wire Line
	8150 3450 8600 3450
Wire Wire Line
	8600 3450 8850 3450
Wire Wire Line
	7250 3450 7300 3450
$Comp
L Device:R R?
U 1 1 6365E41F
P 7900 3450
F 0 "R?" V 8100 3450 50  0000 L CNN
F 1 "100k n.p." V 8000 3300 50  0000 L CNN
F 2 "Resistors_ThroughHole:R_Axial_DIN0207_L6.3mm_D2.5mm_P10.16mm_Horizontal" V 7830 3450 50  0001 C CNN
F 3 "~" H 7900 3450 50  0001 C CNN
	1    7900 3450
	0    -1   -1   0   
$EndComp
Wire Wire Line
	8050 3450 8150 3450
$Comp
L Device:C C?
U 1 1 6365F40C
P 7600 3650
F 0 "C?" V 7348 3650 50  0000 C CNN
F 1 "10nF n.p." V 7439 3650 50  0000 C CNN
F 2 "Capacitors_ThroughHole:C_Disc_D5.0mm_W2.5mm_P5.00mm" H 7638 3500 50  0001 C CNN
F 3 "~" H 7600 3650 50  0001 C CNN
	1    7600 3650
	-1   0    0    1   
$EndComp
Wire Wire Line
	7400 3850 7600 3850
Wire Wire Line
	7600 3800 7600 3850
Connection ~ 7600 3850
Wire Wire Line
	7600 3850 7700 3850
Wire Wire Line
	7600 3500 7600 3450
Connection ~ 7600 3450
Wire Wire Line
	7600 3450 7750 3450
Wire Wire Line
	7300 3850 7300 3800
Wire Wire Line
	7300 3850 7400 3850
Wire Wire Line
	7300 3500 7300 3450
Connection ~ 7300 3450
Wire Wire Line
	7300 3450 7600 3450
Wire Wire Line
	6950 3650 6950 3850
Wire Wire Line
	6950 3850 7300 3850
Connection ~ 7300 3850
Wire Wire Line
	6950 3850 6950 3900
Connection ~ 6950 3850
Wire Wire Line
	6950 3250 6950 3200
Wire Wire Line
	6950 3200 7700 3200
$Comp
L power:GND #PWR0102
U 1 1 629C7CE2
P 7300 3050
F 0 "#PWR0102" H 7300 2800 50  0001 C CNN
F 1 "GND" H 7305 2877 50  0001 C CNN
F 2 "" H 7300 3050 50  0001 C CNN
F 3 "" H 7300 3050 50  0001 C CNN
	1    7300 3050
	1    0    0    -1  
$EndComp
Wire Wire Line
	7250 2650 7300 2650
Connection ~ 7300 2650
Wire Wire Line
	7300 3050 7300 3000
Wire Wire Line
	7300 2650 7300 2700
$Comp
L Device:CP C6
U 1 1 629B606F
P 7300 2850
F 0 "C6" H 7200 2900 50  0000 R CNN
F 1 "100µF" H 7200 2800 50  0000 R CNN
F 2 "Capacitors_ThroughHole:CP_Radial_D6.3mm_P2.50mm" H 7338 2700 50  0001 C CNN
F 3 "~" H 7300 2850 50  0001 C CNN
	1    7300 2850
	1    0    0    -1  
$EndComp
Wire Wire Line
	7650 2650 7700 2650
Wire Wire Line
	7300 2650 7350 2650
$Comp
L Device:R R5
U 1 1 629B9C86
P 7500 2650
F 0 "R5" V 7707 2650 50  0000 C CNN
F 1 "510" V 7616 2650 50  0000 C CNN
F 2 "Resistors_ThroughHole:R_Axial_DIN0207_L6.3mm_D2.5mm_P10.16mm_Horizontal" V 7430 2650 50  0001 C CNN
F 3 "~" H 7500 2650 50  0001 C CNN
	1    7500 2650
	0    -1   -1   0   
$EndComp
Wire Wire Line
	7700 3200 7700 2650
Connection ~ 7700 2650
Wire Wire Line
	7700 2650 7850 2650
Connection ~ 6900 1900
Wire Wire Line
	6600 5950 7400 5950
Wire Wire Line
	7700 3850 8500 3850
Connection ~ 10100 3850
$EndSCHEMATC
