EESchema Schematic File Version 4
EELAYER 30 0
EELAYER END
$Descr A4 11693 8268
encoding utf-8
Sheet 1 1
Title "Eurorack Power Distribution Board"
Date "2022-05-28"
Rev "r1"
Comp "(c) 2022 Andreas Messer"
Comment1 ""
Comment2 ""
Comment3 ""
Comment4 ""
$EndDescr
$Comp
L Jumper:SolderJumper_2_Bridged JP3
U 1 1 628EB1A0
P 2450 4350
F 0 "JP3" H 2450 4550 50  0000 C CNN
F 1 "SolderJumper_2_Bridged" H 2450 4464 50  0001 C CNN
F 2 "Pin_Headers:Pin_Header_Straight_1x02_Pitch2.54mm" H 2450 4350 50  0001 C CNN
F 3 "~" H 2450 4350 50  0001 C CNN
	1    2450 4350
	1    0    0    -1  
$EndComp
$Comp
L Jumper:SolderJumper_2_Bridged JP4
U 1 1 628EC2C3
P 2450 4450
F 0 "JP4" H 2450 4650 50  0000 C CNN
F 1 "SolderJumper_2_Bridged" H 2450 4564 50  0001 C CNN
F 2 "Pin_Headers:Pin_Header_Straight_1x02_Pitch2.54mm" H 2450 4450 50  0001 C CNN
F 3 "~" H 2450 4450 50  0001 C CNN
	1    2450 4450
	1    0    0    -1  
$EndComp
Wire Wire Line
	2450 4950 2450 4850
Connection ~ 2450 4850
Wire Wire Line
	2450 4850 2450 4750
$Comp
L Jumper:SolderJumper_2_Bridged JP5
U 1 1 62903C44
P 3350 4350
F 0 "JP5" H 3350 4550 50  0000 C CNN
F 1 "SolderJumper_2_Bridged" H 3350 4464 50  0001 C CNN
F 2 "Pin_Headers:Pin_Header_Straight_1x02_Pitch2.54mm" H 3350 4350 50  0001 C CNN
F 3 "~" H 3350 4350 50  0001 C CNN
	1    3350 4350
	1    0    0    -1  
$EndComp
$Comp
L Jumper:SolderJumper_2_Bridged JP6
U 1 1 62903C4A
P 3350 4450
F 0 "JP6" H 3350 4650 50  0000 C CNN
F 1 "SolderJumper_2_Bridged" H 3350 4564 50  0001 C CNN
F 2 "Pin_Headers:Pin_Header_Straight_1x02_Pitch2.54mm" H 3350 4450 50  0001 C CNN
F 3 "~" H 3350 4450 50  0001 C CNN
	1    3350 4450
	1    0    0    -1  
$EndComp
Wire Wire Line
	3350 4950 3350 4850
Connection ~ 3350 4850
Wire Wire Line
	3350 4850 3350 4750
Connection ~ 3350 4750
Connection ~ 3350 4950
$Comp
L Jumper:SolderJumper_2_Bridged JP7
U 1 1 62912AB2
P 4250 4350
F 0 "JP7" H 4250 4550 50  0000 C CNN
F 1 "SolderJumper_2_Bridged" H 4250 4464 50  0001 C CNN
F 2 "Pin_Headers:Pin_Header_Straight_1x02_Pitch2.54mm" H 4250 4350 50  0001 C CNN
F 3 "~" H 4250 4350 50  0001 C CNN
	1    4250 4350
	1    0    0    -1  
$EndComp
$Comp
L Jumper:SolderJumper_2_Bridged JP8
U 1 1 62912AB8
P 4250 4450
F 0 "JP8" H 4250 4650 50  0000 C CNN
F 1 "SolderJumper_2_Bridged" H 4250 4564 50  0001 C CNN
F 2 "Pin_Headers:Pin_Header_Straight_1x02_Pitch2.54mm" H 4250 4450 50  0001 C CNN
F 3 "~" H 4250 4450 50  0001 C CNN
	1    4250 4450
	1    0    0    -1  
$EndComp
Wire Wire Line
	4250 4950 4250 4850
Connection ~ 4250 4850
Wire Wire Line
	4250 4850 4250 4750
Connection ~ 4250 4750
Connection ~ 4250 4950
$Comp
L Jumper:SolderJumper_2_Bridged JP9
U 1 1 62912AE6
P 5150 4350
F 0 "JP9" H 5150 4550 50  0000 C CNN
F 1 "SolderJumper_2_Bridged" H 5150 4464 50  0001 C CNN
F 2 "Pin_Headers:Pin_Header_Straight_1x02_Pitch2.54mm" H 5150 4350 50  0001 C CNN
F 3 "~" H 5150 4350 50  0001 C CNN
	1    5150 4350
	1    0    0    -1  
$EndComp
$Comp
L Jumper:SolderJumper_2_Bridged JP10
U 1 1 62912AEC
P 5150 4450
F 0 "JP10" H 5150 4650 50  0000 C CNN
F 1 "SolderJumper_2_Bridged" H 5150 4564 50  0001 C CNN
F 2 "Pin_Headers:Pin_Header_Straight_1x02_Pitch2.54mm" H 5150 4450 50  0001 C CNN
F 3 "~" H 5150 4450 50  0001 C CNN
	1    5150 4450
	1    0    0    -1  
$EndComp
Wire Wire Line
	5150 4950 5150 4850
Connection ~ 5150 4850
Wire Wire Line
	5150 4850 5150 4750
Connection ~ 5150 4750
Connection ~ 5150 4950
$Comp
L Jumper:SolderJumper_2_Bridged JP19
U 1 1 6291FB3C
P 9650 4350
F 0 "JP19" H 9650 4550 50  0000 C CNN
F 1 "SolderJumper_2_Bridged" H 9650 4464 50  0001 C CNN
F 2 "Pin_Headers:Pin_Header_Straight_1x02_Pitch2.54mm" H 9650 4350 50  0001 C CNN
F 3 "~" H 9650 4350 50  0001 C CNN
	1    9650 4350
	1    0    0    -1  
$EndComp
$Comp
L Jumper:SolderJumper_2_Bridged JP20
U 1 1 6291FB42
P 9650 4450
F 0 "JP20" H 9650 4650 50  0000 C CNN
F 1 "SolderJumper_2_Bridged" H 9650 4564 50  0001 C CNN
F 2 "Pin_Headers:Pin_Header_Straight_1x02_Pitch2.54mm" H 9650 4450 50  0001 C CNN
F 3 "~" H 9650 4450 50  0001 C CNN
	1    9650 4450
	1    0    0    -1  
$EndComp
Wire Wire Line
	9650 4950 9650 4850
Connection ~ 9650 4850
Wire Wire Line
	9650 4850 9650 4750
Connection ~ 9650 4750
Connection ~ 9650 4950
$Comp
L Jumper:SolderJumper_2_Bridged JP11
U 1 1 62930712
P 6050 4350
F 0 "JP11" H 6050 4550 50  0000 C CNN
F 1 "SolderJumper_2_Bridged" H 6050 4464 50  0001 C CNN
F 2 "Pin_Headers:Pin_Header_Straight_1x02_Pitch2.54mm" H 6050 4350 50  0001 C CNN
F 3 "~" H 6050 4350 50  0001 C CNN
	1    6050 4350
	1    0    0    -1  
$EndComp
$Comp
L Jumper:SolderJumper_2_Bridged JP12
U 1 1 62930718
P 6050 4450
F 0 "JP12" H 6050 4650 50  0000 C CNN
F 1 "SolderJumper_2_Bridged" H 6050 4564 50  0001 C CNN
F 2 "Pin_Headers:Pin_Header_Straight_1x02_Pitch2.54mm" H 6050 4450 50  0001 C CNN
F 3 "~" H 6050 4450 50  0001 C CNN
	1    6050 4450
	1    0    0    -1  
$EndComp
Wire Wire Line
	6050 4950 6050 4850
Connection ~ 6050 4850
Wire Wire Line
	6050 4850 6050 4750
Connection ~ 6050 4750
Connection ~ 6050 4950
$Comp
L Jumper:SolderJumper_2_Bridged JP13
U 1 1 62930746
P 6950 4350
F 0 "JP13" H 6950 4550 50  0000 C CNN
F 1 "SolderJumper_2_Bridged" H 6950 4464 50  0001 C CNN
F 2 "Pin_Headers:Pin_Header_Straight_1x02_Pitch2.54mm" H 6950 4350 50  0001 C CNN
F 3 "~" H 6950 4350 50  0001 C CNN
	1    6950 4350
	1    0    0    -1  
$EndComp
$Comp
L Jumper:SolderJumper_2_Bridged JP14
U 1 1 6293074C
P 6950 4450
F 0 "JP14" H 6950 4650 50  0000 C CNN
F 1 "SolderJumper_2_Bridged" H 6950 4564 50  0001 C CNN
F 2 "Pin_Headers:Pin_Header_Straight_1x02_Pitch2.54mm" H 6950 4450 50  0001 C CNN
F 3 "~" H 6950 4450 50  0001 C CNN
	1    6950 4450
	1    0    0    -1  
$EndComp
Wire Wire Line
	6950 4950 6950 4850
Connection ~ 6950 4850
Wire Wire Line
	6950 4850 6950 4750
Connection ~ 6950 4750
Connection ~ 6950 4950
$Comp
L Jumper:SolderJumper_2_Bridged JP15
U 1 1 62930782
P 7850 4350
F 0 "JP15" H 7850 4550 50  0000 C CNN
F 1 "SolderJumper_2_Bridged" H 7850 4464 50  0001 C CNN
F 2 "Pin_Headers:Pin_Header_Straight_1x02_Pitch2.54mm" H 7850 4350 50  0001 C CNN
F 3 "~" H 7850 4350 50  0001 C CNN
	1    7850 4350
	1    0    0    -1  
$EndComp
$Comp
L Jumper:SolderJumper_2_Bridged JP16
U 1 1 62930788
P 7850 4450
F 0 "JP16" H 7850 4650 50  0000 C CNN
F 1 "SolderJumper_2_Bridged" H 7850 4564 50  0001 C CNN
F 2 "Pin_Headers:Pin_Header_Straight_1x02_Pitch2.54mm" H 7850 4450 50  0001 C CNN
F 3 "~" H 7850 4450 50  0001 C CNN
	1    7850 4450
	1    0    0    -1  
$EndComp
Wire Wire Line
	7850 4950 7850 4850
Connection ~ 7850 4850
Wire Wire Line
	7850 4850 7850 4750
Connection ~ 7850 4750
Connection ~ 7850 4950
$Comp
L Jumper:SolderJumper_2_Bridged JP17
U 1 1 629307B6
P 8750 4350
F 0 "JP17" H 8750 4550 50  0000 C CNN
F 1 "SolderJumper_2_Bridged" H 8750 4464 50  0001 C CNN
F 2 "Pin_Headers:Pin_Header_Straight_1x02_Pitch2.54mm" H 8750 4350 50  0001 C CNN
F 3 "~" H 8750 4350 50  0001 C CNN
	1    8750 4350
	1    0    0    -1  
$EndComp
$Comp
L Jumper:SolderJumper_2_Bridged JP18
U 1 1 629307BC
P 8750 4450
F 0 "JP18" H 8750 4650 50  0000 C CNN
F 1 "SolderJumper_2_Bridged" H 8750 4564 50  0001 C CNN
F 2 "Pin_Headers:Pin_Header_Straight_1x02_Pitch2.54mm" H 8750 4450 50  0001 C CNN
F 3 "~" H 8750 4450 50  0001 C CNN
	1    8750 4450
	1    0    0    -1  
$EndComp
Wire Wire Line
	8750 4950 8750 4850
Connection ~ 8750 4850
Wire Wire Line
	8750 4850 8750 4750
Connection ~ 8750 4750
Connection ~ 8750 4950
$Comp
L power:GND #PWR0101
U 1 1 629DDE06
P 1150 4900
F 0 "#PWR0101" H 1150 4650 50  0001 C CNN
F 1 "GND" H 1155 4727 50  0001 C CNN
F 2 "" H 1150 4900 50  0001 C CNN
F 3 "" H 1150 4900 50  0001 C CNN
	1    1150 4900
	1    0    0    -1  
$EndComp
$Comp
L power:-12V #PWR0102
U 1 1 629DEF06
P 950 5100
F 0 "#PWR0102" H 950 5200 50  0001 C CNN
F 1 "-12V" H 965 5273 50  0000 C CNN
F 2 "" H 950 5100 50  0001 C CNN
F 3 "" H 950 5100 50  0001 C CNN
	1    950  5100
	-1   0    0    1   
$EndComp
$Comp
L power:+12V #PWR0103
U 1 1 629DFDD1
P 950 4500
F 0 "#PWR0103" H 950 4350 50  0001 C CNN
F 1 "+12V" H 965 4673 50  0000 C CNN
F 2 "" H 950 4500 50  0001 C CNN
F 3 "" H 950 4500 50  0001 C CNN
	1    950  4500
	1    0    0    -1  
$EndComp
$Comp
L power:+5V #PWR0104
U 1 1 629E07C6
P 1150 4500
F 0 "#PWR0104" H 1150 4350 50  0001 C CNN
F 1 "+5V" H 1165 4673 50  0000 C CNN
F 2 "" H 1150 4500 50  0001 C CNN
F 3 "" H 1150 4500 50  0001 C CNN
	1    1150 4500
	1    0    0    -1  
$EndComp
Wire Wire Line
	1250 4650 950  4650
Wire Wire Line
	950  4650 950  4500
Wire Wire Line
	950  5100 950  5050
Wire Wire Line
	950  5050 1250 5050
Wire Wire Line
	1250 4550 1150 4550
Wire Wire Line
	1150 4550 1150 4500
Wire Wire Line
	1250 4850 1150 4850
$Comp
L Connector_Generic:Conn_02x01 J15
U 1 1 62B0E296
P 10550 4550
F 0 "J15" H 10950 4550 50  0000 C CNN
F 1 "Conn_02x01" H 10600 4676 50  0001 C CNN
F 2 "Oddities:NetTie-I_Connected" H 10550 4550 50  0001 C CNN
F 3 "~" H 10550 4550 50  0001 C CNN
	1    10550 4550
	1    0    0    -1  
$EndComp
Wire Wire Line
	10350 4550 10850 4550
$Comp
L Connector_Generic:Conn_02x01 J16
U 1 1 62BA84D1
P 10550 4650
F 0 "J16" H 10950 4650 50  0000 C CNN
F 1 "Conn_02x01" H 10600 4776 50  0001 C CNN
F 2 "Oddities:NetTie-I_Connected" H 10550 4650 50  0001 C CNN
F 3 "~" H 10550 4650 50  0001 C CNN
	1    10550 4650
	1    0    0    -1  
$EndComp
Wire Wire Line
	10350 4650 10850 4650
$Comp
L Connector_Generic:Conn_02x01 J18
U 1 1 62BBB9DD
P 10550 5050
F 0 "J18" H 10950 5050 50  0000 C CNN
F 1 "Conn_02x01" H 10600 5176 50  0001 C CNN
F 2 "Oddities:NetTie-I_Connected" H 10550 5050 50  0001 C CNN
F 3 "~" H 10550 5050 50  0001 C CNN
	1    10550 5050
	1    0    0    -1  
$EndComp
Wire Wire Line
	10350 5050 10850 5050
$Comp
L Connector_Generic:Conn_02x01 J17
U 1 1 62BCF47E
P 10550 4850
F 0 "J17" H 10950 4850 50  0000 C CNN
F 1 "Conn_02x01" H 10600 4976 50  0001 C CNN
F 2 "Oddities:NetTie-I_Connected" H 10550 4850 50  0001 C CNN
F 3 "~" H 10550 4850 50  0001 C CNN
	1    10550 4850
	1    0    0    -1  
$EndComp
Wire Wire Line
	10350 4850 10850 4850
Connection ~ 10350 4550
Connection ~ 10350 4650
Connection ~ 10350 4850
Connection ~ 10350 5050
$Comp
L Connector_Generic:Conn_02x01 J1
U 1 1 62C36758
P 1450 4550
F 0 "J1" H 1500 4750 50  0000 C CNN
F 1 "Conn_02x01" H 1500 4676 50  0001 C CNN
F 2 "Oddities:NetTie-I_Connected" H 1450 4550 50  0001 C CNN
F 3 "~" H 1450 4550 50  0001 C CNN
	1    1450 4550
	1    0    0    -1  
$EndComp
$Comp
L Connector_Generic:Conn_02x01 J2
U 1 1 62C3675F
P 1450 4650
F 0 "J2" H 1500 4850 50  0000 C CNN
F 1 "Conn_02x01" H 1500 4776 50  0001 C CNN
F 2 "Oddities:NetTie-I_Connected" H 1450 4650 50  0001 C CNN
F 3 "~" H 1450 4650 50  0001 C CNN
	1    1450 4650
	1    0    0    -1  
$EndComp
$Comp
L Connector_Generic:Conn_02x01 J4
U 1 1 62C36766
P 1450 5050
F 0 "J4" H 1500 5150 50  0000 C CNN
F 1 "Conn_02x01" H 1500 5176 50  0001 C CNN
F 2 "Oddities:NetTie-I_Connected" H 1450 5050 50  0001 C CNN
F 3 "~" H 1450 5050 50  0001 C CNN
	1    1450 5050
	1    0    0    -1  
$EndComp
Wire Wire Line
	1250 5050 1750 5050
$Comp
L Connector_Generic:Conn_02x01 J3
U 1 1 62C3676D
P 1450 4850
F 0 "J3" H 1500 4950 50  0000 C CNN
F 1 "Conn_02x01" H 1500 4976 50  0001 C CNN
F 2 "Oddities:NetTie-I_Connected" H 1450 4850 50  0001 C CNN
F 3 "~" H 1450 4850 50  0001 C CNN
	1    1450 4850
	1    0    0    -1  
$EndComp
Connection ~ 1250 4550
Connection ~ 1250 4650
Connection ~ 1250 4850
Connection ~ 1250 5050
Wire Wire Line
	1150 4850 1150 4900
Connection ~ 1750 4550
Connection ~ 1750 4650
Connection ~ 1750 4850
Connection ~ 1750 5050
Wire Wire Line
	1250 4650 1750 4650
Wire Wire Line
	1250 4850 1750 4850
Wire Wire Line
	1250 4550 1750 4550
$Comp
L Connector_Generic:Conn_02x08_Odd_Even J5
U 1 1 628E8393
P 2050 4750
F 0 "J5" H 2100 4217 50  0000 C CNN
F 1 "Conn_02x08_Odd_Even" H 2100 5176 50  0001 C CNN
F 2 "Pin_Headers:Pin_Header_Straight_2x08_Pitch2.54mm" H 2050 4750 50  0001 C CNN
F 3 "~" H 2050 4750 50  0001 C CNN
	1    2050 4750
	-1   0    0    1   
$EndComp
Wire Wire Line
	1750 4450 2250 4450
Wire Wire Line
	1750 4950 2250 4950
Wire Wire Line
	1750 4850 2250 4850
Wire Wire Line
	1750 4750 2250 4750
Wire Wire Line
	1750 4350 2250 4350
Wire Wire Line
	2450 4850 2650 4850
Wire Wire Line
	2450 4950 2650 4950
Wire Wire Line
	2600 4350 2650 4350
Wire Wire Line
	2600 4450 2650 4450
Wire Wire Line
	2450 4750 2650 4750
Wire Wire Line
	3350 4850 3550 4850
Wire Wire Line
	3350 4950 3550 4950
Wire Wire Line
	3500 4350 3550 4350
Wire Wire Line
	3500 4450 3550 4450
Wire Wire Line
	3350 4750 3550 4750
Wire Wire Line
	4250 4850 4450 4850
Wire Wire Line
	4250 4950 4450 4950
Wire Wire Line
	4400 4350 4450 4350
Wire Wire Line
	4400 4450 4450 4450
Wire Wire Line
	4250 4750 4450 4750
Wire Wire Line
	5150 4850 5350 4850
Wire Wire Line
	5150 4950 5350 4950
Wire Wire Line
	5300 4350 5350 4350
Wire Wire Line
	5300 4450 5350 4450
Wire Wire Line
	5150 4750 5350 4750
Wire Wire Line
	6050 4850 6250 4850
Wire Wire Line
	6050 4950 6250 4950
Wire Wire Line
	6200 4350 6250 4350
Wire Wire Line
	6200 4450 6250 4450
Wire Wire Line
	6050 4750 6250 4750
Wire Wire Line
	6950 4850 7150 4850
Wire Wire Line
	6950 4950 7150 4950
Wire Wire Line
	7100 4350 7150 4350
Wire Wire Line
	7100 4450 7150 4450
Wire Wire Line
	6950 4750 7150 4750
Wire Wire Line
	7850 4850 8050 4850
Wire Wire Line
	7850 4950 8050 4950
Wire Wire Line
	8000 4350 8050 4350
Wire Wire Line
	8000 4450 8050 4450
Wire Wire Line
	7850 4750 8050 4750
Wire Wire Line
	8750 4850 8950 4850
Wire Wire Line
	8750 4950 8950 4950
Wire Wire Line
	8900 4350 8950 4350
Wire Wire Line
	8900 4450 8950 4450
Wire Wire Line
	8750 4750 8950 4750
Wire Wire Line
	9650 4850 9850 4850
Wire Wire Line
	9650 4950 9850 4950
Wire Wire Line
	1750 5050 2250 5050
Wire Wire Line
	9800 4350 9850 4350
Wire Wire Line
	9800 4450 9850 4450
Wire Wire Line
	1750 4550 2250 4550
Wire Wire Line
	9650 4750 9850 4750
Wire Wire Line
	2250 4650 2650 4650
$Comp
L Connector_Generic:Conn_02x08_Odd_Even J6
U 1 1 62D8E988
P 2950 4750
F 0 "J6" H 3000 4217 50  0000 C CNN
F 1 "Conn_02x08_Odd_Even" H 3000 5176 50  0001 C CNN
F 2 "Pin_Headers:Pin_Header_Straight_2x08_Pitch2.54mm" H 2950 4750 50  0001 C CNN
F 3 "~" H 2950 4750 50  0001 C CNN
	1    2950 4750
	-1   0    0    1   
$EndComp
Wire Wire Line
	3150 4650 3550 4650
Wire Wire Line
	3150 4450 3200 4450
Wire Wire Line
	3150 4350 3200 4350
Wire Wire Line
	3150 4950 3350 4950
Wire Wire Line
	3150 4850 3350 4850
Wire Wire Line
	3150 4750 3350 4750
$Comp
L Connector_Generic:Conn_02x08_Odd_Even J7
U 1 1 62D8F9BB
P 3850 4750
F 0 "J7" H 3900 4217 50  0000 C CNN
F 1 "Conn_02x08_Odd_Even" H 3900 5176 50  0001 C CNN
F 2 "Pin_Headers:Pin_Header_Straight_2x08_Pitch2.54mm" H 3850 4750 50  0001 C CNN
F 3 "~" H 3850 4750 50  0001 C CNN
	1    3850 4750
	-1   0    0    1   
$EndComp
Wire Wire Line
	4050 4650 4450 4650
Wire Wire Line
	4050 4450 4100 4450
Wire Wire Line
	4050 4350 4100 4350
Wire Wire Line
	4050 4950 4250 4950
Wire Wire Line
	4050 4850 4250 4850
Wire Wire Line
	4050 4750 4250 4750
$Comp
L Connector_Generic:Conn_02x08_Odd_Even J8
U 1 1 62D90582
P 4750 4750
F 0 "J8" H 4800 4217 50  0000 C CNN
F 1 "Conn_02x08_Odd_Even" H 4800 5176 50  0001 C CNN
F 2 "Pin_Headers:Pin_Header_Straight_2x08_Pitch2.54mm" H 4750 4750 50  0001 C CNN
F 3 "~" H 4750 4750 50  0001 C CNN
	1    4750 4750
	-1   0    0    1   
$EndComp
Wire Wire Line
	4950 4650 5350 4650
Wire Wire Line
	4950 4450 5000 4450
Wire Wire Line
	4950 4350 5000 4350
Wire Wire Line
	4950 4950 5150 4950
Wire Wire Line
	4950 4850 5150 4850
Wire Wire Line
	4950 4750 5150 4750
$Comp
L Connector_Generic:Conn_02x08_Odd_Even J9
U 1 1 62D9117D
P 5650 4750
F 0 "J9" H 5700 4217 50  0000 C CNN
F 1 "Conn_02x08_Odd_Even" H 5700 5176 50  0001 C CNN
F 2 "Pin_Headers:Pin_Header_Straight_2x08_Pitch2.54mm" H 5650 4750 50  0001 C CNN
F 3 "~" H 5650 4750 50  0001 C CNN
	1    5650 4750
	-1   0    0    1   
$EndComp
Wire Wire Line
	5850 4650 6250 4650
Wire Wire Line
	5850 4450 5900 4450
Wire Wire Line
	5850 4350 5900 4350
Wire Wire Line
	5850 4950 6050 4950
Wire Wire Line
	5850 4850 6050 4850
Wire Wire Line
	5850 4750 6050 4750
$Comp
L Connector_Generic:Conn_02x08_Odd_Even J10
U 1 1 62D925C3
P 6550 4750
F 0 "J10" H 6600 4217 50  0000 C CNN
F 1 "Conn_02x08_Odd_Even" H 6600 5176 50  0001 C CNN
F 2 "Pin_Headers:Pin_Header_Straight_2x08_Pitch2.54mm" H 6550 4750 50  0001 C CNN
F 3 "~" H 6550 4750 50  0001 C CNN
	1    6550 4750
	-1   0    0    1   
$EndComp
Wire Wire Line
	6750 4650 7150 4650
Wire Wire Line
	6750 4450 6800 4450
Wire Wire Line
	6750 4350 6800 4350
Wire Wire Line
	6750 4950 6950 4950
Wire Wire Line
	6750 4850 6950 4850
Wire Wire Line
	6750 4750 6950 4750
$Comp
L Connector_Generic:Conn_02x08_Odd_Even J11
U 1 1 62D932B0
P 7450 4750
F 0 "J11" H 7500 4217 50  0000 C CNN
F 1 "Conn_02x08_Odd_Even" H 7500 5176 50  0001 C CNN
F 2 "Pin_Headers:Pin_Header_Straight_2x08_Pitch2.54mm" H 7450 4750 50  0001 C CNN
F 3 "~" H 7450 4750 50  0001 C CNN
	1    7450 4750
	-1   0    0    1   
$EndComp
Wire Wire Line
	7650 4650 8050 4650
Wire Wire Line
	7650 4450 7700 4450
Wire Wire Line
	7650 4350 7700 4350
Wire Wire Line
	7650 4950 7850 4950
Wire Wire Line
	7650 4850 7850 4850
Wire Wire Line
	7650 4750 7850 4750
$Comp
L Connector_Generic:Conn_02x08_Odd_Even J12
U 1 1 62D93D62
P 8350 4750
F 0 "J12" H 8400 4217 50  0000 C CNN
F 1 "Conn_02x08_Odd_Even" H 8400 5176 50  0001 C CNN
F 2 "Pin_Headers:Pin_Header_Straight_2x08_Pitch2.54mm" H 8350 4750 50  0001 C CNN
F 3 "~" H 8350 4750 50  0001 C CNN
	1    8350 4750
	-1   0    0    1   
$EndComp
Wire Wire Line
	8550 4650 8950 4650
Wire Wire Line
	8550 4450 8600 4450
Wire Wire Line
	8550 4350 8600 4350
Wire Wire Line
	8550 4950 8750 4950
Wire Wire Line
	8550 4850 8750 4850
Wire Wire Line
	8550 4750 8750 4750
$Comp
L Connector_Generic:Conn_02x08_Odd_Even J13
U 1 1 62D947C4
P 9250 4750
F 0 "J13" H 9300 4217 50  0000 C CNN
F 1 "Conn_02x08_Odd_Even" H 9300 5176 50  0001 C CNN
F 2 "Pin_Headers:Pin_Header_Straight_2x08_Pitch2.54mm" H 9250 4750 50  0001 C CNN
F 3 "~" H 9250 4750 50  0001 C CNN
	1    9250 4750
	-1   0    0    1   
$EndComp
Wire Wire Line
	9450 4650 9850 4650
Wire Wire Line
	9450 4450 9500 4450
Wire Wire Line
	9450 4350 9500 4350
Wire Wire Line
	9450 4950 9650 4950
Wire Wire Line
	9450 4850 9650 4850
Wire Wire Line
	9450 4750 9650 4750
$Comp
L Connector_Generic:Conn_02x08_Odd_Even J14
U 1 1 62D952FC
P 10150 4750
F 0 "J14" H 10200 4217 50  0000 C CNN
F 1 "Conn_02x08_Odd_Even" H 10200 5176 50  0001 C CNN
F 2 "Pin_Headers:Pin_Header_Straight_2x08_Pitch2.54mm" H 10150 4750 50  0001 C CNN
F 3 "~" H 10150 4750 50  0001 C CNN
	1    10150 4750
	-1   0    0    1   
$EndComp
Wire Wire Line
	1750 4650 2250 4650
Connection ~ 2250 4650
Wire Wire Line
	2250 4550 2650 4550
Connection ~ 2250 4550
Wire Wire Line
	2450 4750 2250 4750
Connection ~ 2450 4750
Connection ~ 2250 4750
Wire Wire Line
	2250 4850 2450 4850
Connection ~ 2250 4850
Wire Wire Line
	2450 4950 2250 4950
Connection ~ 2450 4950
Connection ~ 2250 4950
Wire Wire Line
	2250 5050 2650 5050
Connection ~ 2250 5050
Wire Wire Line
	3150 4550 2650 4550
Connection ~ 2650 4550
Wire Wire Line
	2650 4650 3150 4650
Connection ~ 2650 4650
Connection ~ 3150 4650
Wire Wire Line
	3150 4750 2650 4750
Connection ~ 3150 4750
Connection ~ 2650 4750
Wire Wire Line
	2650 4850 3150 4850
Connection ~ 2650 4850
Connection ~ 3150 4850
Wire Wire Line
	3150 4950 2650 4950
Connection ~ 3150 4950
Connection ~ 2650 4950
Wire Wire Line
	2650 5050 3150 5050
Connection ~ 2650 5050
Wire Wire Line
	3150 5050 3550 5050
Connection ~ 3150 5050
Wire Wire Line
	3150 4550 3550 4550
Connection ~ 3150 4550
Wire Wire Line
	3550 4550 4050 4550
Connection ~ 3550 4550
Wire Wire Line
	4050 4650 3550 4650
Connection ~ 4050 4650
Connection ~ 3550 4650
Wire Wire Line
	3550 4750 4050 4750
Connection ~ 3550 4750
Connection ~ 4050 4750
Wire Wire Line
	4050 4850 3550 4850
Connection ~ 4050 4850
Connection ~ 3550 4850
Wire Wire Line
	3550 4950 4050 4950
Connection ~ 3550 4950
Connection ~ 4050 4950
Wire Wire Line
	4050 5050 3550 5050
Connection ~ 3550 5050
Wire Wire Line
	4050 4550 4450 4550
Connection ~ 4050 4550
Wire Wire Line
	4450 5050 4050 5050
Connection ~ 4050 5050
Wire Wire Line
	4450 4550 4950 4550
Connection ~ 4450 4550
Wire Wire Line
	4950 4650 4450 4650
Connection ~ 4950 4650
Connection ~ 4450 4650
Wire Wire Line
	4450 4750 4950 4750
Connection ~ 4450 4750
Connection ~ 4950 4750
Wire Wire Line
	4950 4850 4450 4850
Connection ~ 4950 4850
Connection ~ 4450 4850
Wire Wire Line
	4450 4950 4950 4950
Connection ~ 4450 4950
Connection ~ 4950 4950
Wire Wire Line
	4950 5050 4450 5050
Connection ~ 4450 5050
Wire Wire Line
	4950 5050 5350 5050
Connection ~ 4950 5050
Wire Wire Line
	4950 4550 5350 4550
Connection ~ 4950 4550
Wire Wire Line
	5350 4550 5850 4550
Connection ~ 5350 4550
Wire Wire Line
	5850 4650 5350 4650
Connection ~ 5850 4650
Connection ~ 5350 4650
Wire Wire Line
	5350 4750 5850 4750
Connection ~ 5350 4750
Connection ~ 5850 4750
Wire Wire Line
	5850 4850 5350 4850
Connection ~ 5850 4850
Connection ~ 5350 4850
Wire Wire Line
	5350 4950 5850 4950
Connection ~ 5350 4950
Connection ~ 5850 4950
Wire Wire Line
	5850 5050 5350 5050
Connection ~ 5350 5050
Wire Wire Line
	5850 5050 6250 5050
Connection ~ 5850 5050
Wire Wire Line
	5850 4550 6250 4550
Connection ~ 5850 4550
Wire Wire Line
	5350 4350 5850 4350
Connection ~ 5350 4350
Connection ~ 5850 4350
Wire Wire Line
	5850 4450 5350 4450
Connection ~ 5850 4450
Connection ~ 5350 4450
Wire Wire Line
	4050 4350 3550 4350
Connection ~ 4050 4350
Connection ~ 3550 4350
Wire Wire Line
	3550 4450 4050 4450
Connection ~ 3550 4450
Connection ~ 4050 4450
Wire Wire Line
	2300 4350 2250 4350
Connection ~ 2250 4350
Wire Wire Line
	2300 4450 2250 4450
Connection ~ 2250 4450
Wire Wire Line
	2650 4350 3150 4350
Connection ~ 2650 4350
Connection ~ 3150 4350
Wire Wire Line
	3150 4450 2650 4450
Connection ~ 3150 4450
Connection ~ 2650 4450
Wire Wire Line
	4450 4350 4950 4350
Connection ~ 4450 4350
Connection ~ 4950 4350
Wire Wire Line
	4950 4450 4450 4450
Connection ~ 4950 4450
Connection ~ 4450 4450
Wire Wire Line
	6250 4350 6750 4350
Connection ~ 6250 4350
Connection ~ 6750 4350
Wire Wire Line
	6750 4450 6250 4450
Connection ~ 6750 4450
Connection ~ 6250 4450
Wire Wire Line
	6250 4550 6750 4550
Connection ~ 6250 4550
Wire Wire Line
	6250 4650 6750 4650
Connection ~ 6250 4650
Connection ~ 6750 4650
Wire Wire Line
	6250 4750 6750 4750
Connection ~ 6250 4750
Connection ~ 6750 4750
Wire Wire Line
	6750 4850 6250 4850
Connection ~ 6750 4850
Connection ~ 6250 4850
Wire Wire Line
	6250 4950 6750 4950
Connection ~ 6250 4950
Connection ~ 6750 4950
Wire Wire Line
	6750 5050 6250 5050
Connection ~ 6250 5050
Wire Wire Line
	6750 5050 7150 5050
Connection ~ 6750 5050
Wire Wire Line
	6750 4550 7150 4550
Connection ~ 6750 4550
Wire Wire Line
	7150 4350 7650 4350
Connection ~ 7150 4350
Connection ~ 7650 4350
Wire Wire Line
	7650 4450 7150 4450
Connection ~ 7650 4450
Connection ~ 7150 4450
Wire Wire Line
	7150 4550 7650 4550
Connection ~ 7150 4550
Wire Wire Line
	7650 4650 7150 4650
Connection ~ 7650 4650
Connection ~ 7150 4650
Wire Wire Line
	7150 4750 7650 4750
Connection ~ 7150 4750
Connection ~ 7650 4750
Wire Wire Line
	7650 4850 7150 4850
Connection ~ 7650 4850
Connection ~ 7150 4850
Wire Wire Line
	7150 4950 7650 4950
Connection ~ 7150 4950
Connection ~ 7650 4950
Wire Wire Line
	7650 5050 7150 5050
Connection ~ 7150 5050
Wire Wire Line
	7650 4550 8050 4550
Connection ~ 7650 4550
Wire Wire Line
	7650 5050 8050 5050
Connection ~ 7650 5050
Wire Wire Line
	8050 4350 8550 4350
Connection ~ 8050 4350
Connection ~ 8550 4350
Wire Wire Line
	8550 4450 8050 4450
Connection ~ 8550 4450
Connection ~ 8050 4450
Wire Wire Line
	8050 4550 8550 4550
Connection ~ 8050 4550
Wire Wire Line
	8550 4650 8050 4650
Connection ~ 8550 4650
Connection ~ 8050 4650
Wire Wire Line
	8050 4750 8550 4750
Connection ~ 8050 4750
Connection ~ 8550 4750
Wire Wire Line
	8550 4850 8050 4850
Connection ~ 8550 4850
Connection ~ 8050 4850
Wire Wire Line
	8050 4950 8550 4950
Connection ~ 8050 4950
Connection ~ 8550 4950
Wire Wire Line
	8550 5050 8050 5050
Connection ~ 8050 5050
Wire Wire Line
	8550 4550 8950 4550
Connection ~ 8550 4550
Wire Wire Line
	8950 5050 8550 5050
Connection ~ 8550 5050
Wire Wire Line
	8950 4350 9450 4350
Connection ~ 8950 4350
Connection ~ 9450 4350
Wire Wire Line
	9450 4450 8950 4450
Connection ~ 9450 4450
Connection ~ 8950 4450
Wire Wire Line
	8950 4550 9450 4550
Connection ~ 8950 4550
Wire Wire Line
	9450 4650 8950 4650
Connection ~ 9450 4650
Connection ~ 8950 4650
Wire Wire Line
	8950 4750 9450 4750
Connection ~ 8950 4750
Connection ~ 9450 4750
Wire Wire Line
	9450 4850 8950 4850
Connection ~ 9450 4850
Connection ~ 8950 4850
Wire Wire Line
	8950 4950 9450 4950
Connection ~ 8950 4950
Connection ~ 9450 4950
Wire Wire Line
	9450 5050 8950 5050
Connection ~ 8950 5050
Wire Wire Line
	9850 4550 9450 4550
Connection ~ 9450 4550
Wire Wire Line
	9450 5050 9850 5050
Connection ~ 9450 5050
Wire Wire Line
	9850 4350 10350 4350
Connection ~ 9850 4350
Wire Wire Line
	10350 4450 9850 4450
Connection ~ 9850 4450
Wire Wire Line
	9850 4550 10350 4550
Connection ~ 9850 4550
Wire Wire Line
	10350 4650 9850 4650
Connection ~ 9850 4650
Wire Wire Line
	9850 4750 10350 4750
Connection ~ 9850 4750
Wire Wire Line
	10350 4850 9850 4850
Connection ~ 9850 4850
Wire Wire Line
	10350 4950 9850 4950
Connection ~ 9850 4950
Wire Wire Line
	10350 5050 9850 5050
Connection ~ 9850 5050
$Comp
L ProjectSymbols:AP3211 U1
U 1 1 6290406C
P 3950 6050
F 0 "U1" H 3700 6400 50  0000 C CNN
F 1 "AP3211" H 3950 6050 50  0000 C CNN
F 2 "TO_SOT_Packages_SMD:SOT-23-6" H 3950 6050 50  0001 C CNN
F 3 "" H 3950 6050 50  0001 C CNN
	1    3950 6050
	1    0    0    -1  
$EndComp
$Comp
L Device:C C6
U 1 1 6290660F
P 4150 5600
F 0 "C6" V 3898 5600 50  0000 C CNN
F 1 "10nF" V 3989 5600 50  0000 C CNN
F 2 "Capacitors_SMD:C_0603" H 4188 5450 50  0001 C CNN
F 3 "~" H 4150 5600 50  0001 C CNN
	1    4150 5600
	0    1    1    0   
$EndComp
Wire Wire Line
	3950 5650 3950 5600
Wire Wire Line
	3950 5600 4000 5600
Wire Wire Line
	4300 5600 4400 5600
Wire Wire Line
	4400 5600 4400 5850
Wire Wire Line
	4400 5850 4350 5850
$Comp
L Device:D_Schottky D1
U 1 1 62935246
P 4500 6050
F 0 "D1" V 4454 6130 50  0000 L CNN
F 1 "SL32-3G" V 4545 6130 50  0000 L CNN
F 2 "Diodes_SMD:D_SMA" H 4500 6050 50  0001 C CNN
F 3 "~" H 4500 6050 50  0001 C CNN
F 4 "SL32-3G" H 4500 6050 50  0001 C CNN "MPN"
	1    4500 6050
	0    1    1    0   
$EndComp
Wire Wire Line
	4500 5850 4400 5850
Connection ~ 4400 5850
$Comp
L power:GND #PWR0105
U 1 1 62980129
P 4500 6300
F 0 "#PWR0105" H 4500 6050 50  0001 C CNN
F 1 "GND" H 4505 6127 50  0001 C CNN
F 2 "" H 4500 6300 50  0001 C CNN
F 3 "" H 4500 6300 50  0001 C CNN
	1    4500 6300
	1    0    0    -1  
$EndComp
Wire Wire Line
	4500 5850 4500 5900
$Comp
L pspice:INDUCTOR L2
U 1 1 629B006B
P 4800 5850
F 0 "L2" H 4800 6065 50  0000 C CNN
F 1 "10µH" H 4800 5974 50  0000 C CNN
F 2 "Inductors:Inductor_Bourns-SRU8043" H 4800 5850 50  0001 C CNN
F 3 "~" H 4800 5850 50  0001 C CNN
	1    4800 5850
	1    0    0    -1  
$EndComp
$Comp
L Device:R R2
U 1 1 629B0FC4
P 5100 6050
F 0 "R2" H 5170 6096 50  0000 L CNN
F 1 "47k 1%" H 5170 6005 50  0000 L CNN
F 2 "Resistors_SMD:R_0603" V 5030 6050 50  0001 C CNN
F 3 "~" H 5100 6050 50  0001 C CNN
	1    5100 6050
	1    0    0    -1  
$EndComp
$Comp
L Device:R R3
U 1 1 629B12EA
P 5100 6450
F 0 "R3" H 5170 6496 50  0000 L CNN
F 1 "9.1k 1%" H 5170 6405 50  0000 L CNN
F 2 "Resistors_SMD:R_0603" V 5030 6450 50  0001 C CNN
F 3 "~" H 5100 6450 50  0001 C CNN
	1    5100 6450
	1    0    0    -1  
$EndComp
Wire Wire Line
	4350 6250 5100 6250
Wire Wire Line
	5100 6250 5100 6200
Wire Wire Line
	5100 6250 5100 6300
Connection ~ 5100 6250
Wire Wire Line
	5050 5850 5100 5850
Wire Wire Line
	5100 5850 5100 5900
Wire Wire Line
	4500 5850 4550 5850
Connection ~ 4500 5850
Wire Wire Line
	3550 5850 3500 5850
Wire Wire Line
	3500 5850 3500 5950
Wire Wire Line
	3500 5950 3550 5950
Wire Wire Line
	3950 6500 3950 6450
Wire Wire Line
	5100 6650 5100 6600
$Comp
L Device:C C7
U 1 1 62ABA105
P 5600 6050
F 0 "C7" H 5485 6004 50  0000 R CNN
F 1 "10µF" H 5485 6095 50  0000 R CNN
F 2 "Capacitors_SMD:C_0805" H 5638 5900 50  0001 C CNN
F 3 "~" H 5600 6050 50  0001 C CNN
	1    5600 6050
	-1   0    0    1   
$EndComp
Wire Wire Line
	5100 5850 5600 5850
Wire Wire Line
	5600 5850 5600 5900
Connection ~ 5100 5850
$Comp
L power:GND #PWR0106
U 1 1 62AD4C41
P 5600 6250
F 0 "#PWR0106" H 5600 6000 50  0001 C CNN
F 1 "GND" H 5605 6077 50  0001 C CNN
F 2 "" H 5600 6250 50  0001 C CNN
F 3 "" H 5600 6250 50  0001 C CNN
	1    5600 6250
	1    0    0    -1  
$EndComp
Wire Wire Line
	5600 6200 5600 6250
$Comp
L power:+5V #PWR0107
U 1 1 62AEFFA9
P 6500 5850
F 0 "#PWR0107" H 6500 5700 50  0001 C CNN
F 1 "+5V" V 6500 6050 50  0000 C CNN
F 2 "" H 6500 5850 50  0001 C CNN
F 3 "" H 6500 5850 50  0001 C CNN
	1    6500 5850
	0    1    1    0   
$EndComp
Wire Wire Line
	5600 5850 5700 5850
Connection ~ 5600 5850
$Comp
L Device:C C4
U 1 1 62B0C1B0
P 2900 6050
F 0 "C4" H 2785 6004 50  0000 R CNN
F 1 "10µF" H 2785 6095 50  0000 R CNN
F 2 "Capacitors_SMD:C_0805" H 2938 5900 50  0001 C CNN
F 3 "~" H 2900 6050 50  0001 C CNN
	1    2900 6050
	-1   0    0    1   
$EndComp
Wire Wire Line
	3500 5850 3300 5850
Wire Wire Line
	3300 5850 3300 5900
Connection ~ 3500 5850
$Comp
L power:GND #PWR0108
U 1 1 62B2713B
P 3300 6250
F 0 "#PWR0108" H 3300 6000 50  0001 C CNN
F 1 "GND" H 3305 6077 50  0001 C CNN
F 2 "" H 3300 6250 50  0001 C CNN
F 3 "" H 3300 6250 50  0001 C CNN
	1    3300 6250
	1    0    0    -1  
$EndComp
Wire Wire Line
	3300 6200 3300 6250
Wire Wire Line
	4500 6200 4500 6300
$Comp
L power:GND #PWR0109
U 1 1 62B5CC6F
P 3950 6500
F 0 "#PWR0109" H 3950 6250 50  0001 C CNN
F 1 "GND" H 3955 6327 50  0001 C CNN
F 2 "" H 3950 6500 50  0001 C CNN
F 3 "" H 3950 6500 50  0001 C CNN
	1    3950 6500
	1    0    0    -1  
$EndComp
$Comp
L power:GND #PWR0110
U 1 1 62B771DD
P 5100 6650
F 0 "#PWR0110" H 5100 6400 50  0001 C CNN
F 1 "GND" H 5105 6477 50  0001 C CNN
F 2 "" H 5100 6650 50  0001 C CNN
F 3 "" H 5100 6650 50  0001 C CNN
	1    5100 6650
	1    0    0    -1  
$EndComp
Connection ~ 3300 5850
$Comp
L power:+12V #PWR0111
U 1 1 62B95045
P 1250 5850
F 0 "#PWR0111" H 1250 5700 50  0001 C CNN
F 1 "+12V" V 1250 6100 50  0000 C CNN
F 2 "" H 1250 5850 50  0001 C CNN
F 3 "" H 1250 5850 50  0001 C CNN
	1    1250 5850
	0    -1   -1   0   
$EndComp
Wire Wire Line
	1250 5850 1300 5850
$Comp
L pspice:INDUCTOR L1
U 1 1 62C3AE48
P 1700 5850
F 0 "L1" H 1700 6065 50  0000 C CNN
F 1 "3.3µH" H 1700 5974 50  0000 C CNN
F 2 "Inductors:Inductor_Wurth_MAPI-3015" H 1700 5850 50  0001 C CNN
F 3 "~" H 1700 5850 50  0001 C CNN
F 4 "DJNR3015-3R3" H 1700 5850 50  0001 C CNN "MPN"
	1    1700 5850
	1    0    0    -1  
$EndComp
Wire Wire Line
	1300 5900 1300 5850
Wire Wire Line
	1300 5850 1400 5850
$Comp
L power:GND #PWR0112
U 1 1 62C56679
P 1300 6250
F 0 "#PWR0112" H 1300 6000 50  0001 C CNN
F 1 "GND" H 1305 6077 50  0001 C CNN
F 2 "" H 1300 6250 50  0001 C CNN
F 3 "" H 1300 6250 50  0001 C CNN
	1    1300 6250
	1    0    0    -1  
$EndComp
Wire Wire Line
	1300 6200 1300 6250
$Comp
L Device:R R1
U 1 1 6292450E
P 1700 5500
F 0 "R1" H 1770 5546 50  0000 L CNN
F 1 "2.2k" H 1770 5455 50  0000 L CNN
F 2 "Resistors_SMD:R_0603" V 1630 5500 50  0001 C CNN
F 3 "~" H 1700 5500 50  0001 C CNN
	1    1700 5500
	0    -1   -1   0   
$EndComp
$Comp
L Device:C C3
U 1 1 6296AD07
P 2500 6050
F 0 "C3" H 2385 6004 50  0000 R CNN
F 1 "10µF" H 2385 6095 50  0000 R CNN
F 2 "Capacitors_SMD:C_0805" H 2538 5900 50  0001 C CNN
F 3 "~" H 2500 6050 50  0001 C CNN
	1    2500 6050
	-1   0    0    1   
$EndComp
$Comp
L Device:Ferrite_Bead FB1
U 1 1 6296BB54
P 2700 5850
F 0 "FB1" V 2426 5850 50  0000 C CNN
F 1 "100 Ohm@100MHz, 2A" V 2517 5850 50  0000 C CNN
F 2 "Resistors_SMD:R_0603" V 2630 5850 50  0001 C CNN
F 3 "~" H 2700 5850 50  0001 C CNN
F 4 "Z0603C101BPWZT" H 2700 5850 50  0001 C CNN "MPN"
	1    2700 5850
	0    1    1    0   
$EndComp
Wire Wire Line
	2550 5850 2500 5850
Wire Wire Line
	2500 5850 2500 5900
$Comp
L power:GND #PWR0113
U 1 1 62989CFC
P 2500 6250
F 0 "#PWR0113" H 2500 6000 50  0001 C CNN
F 1 "GND" H 2505 6077 50  0001 C CNN
F 2 "" H 2500 6250 50  0001 C CNN
F 3 "" H 2500 6250 50  0001 C CNN
	1    2500 6250
	1    0    0    -1  
$EndComp
Wire Wire Line
	2500 6200 2500 6250
Wire Wire Line
	2100 5850 2000 5850
Wire Wire Line
	1850 5500 2000 5500
Wire Wire Line
	2000 5500 2000 5850
Connection ~ 2000 5850
Wire Wire Line
	2000 5850 1950 5850
Wire Wire Line
	1550 5500 1400 5500
Wire Wire Line
	1400 5500 1400 5850
Connection ~ 1400 5850
Wire Wire Line
	1400 5850 1450 5850
Connection ~ 1300 5850
$Comp
L Device:C C2
U 1 1 62B42E61
P 2100 6050
F 0 "C2" V 1848 6050 50  0000 C CNN
F 1 "10nF" V 1939 6050 50  0000 C CNN
F 2 "Capacitors_SMD:C_0603" H 2138 5900 50  0001 C CNN
F 3 "~" H 2100 6050 50  0001 C CNN
	1    2100 6050
	-1   0    0    1   
$EndComp
$Comp
L Device:C C5
U 1 1 62B6A738
P 3300 6050
F 0 "C5" V 3048 6050 50  0000 C CNN
F 1 "10nF" V 3139 6050 50  0000 C CNN
F 2 "Capacitors_SMD:C_0603" H 3338 5900 50  0001 C CNN
F 3 "~" H 3300 6050 50  0001 C CNN
	1    3300 6050
	-1   0    0    1   
$EndComp
Wire Wire Line
	2850 5850 2900 5850
Wire Wire Line
	2900 5850 2900 5900
Connection ~ 2900 5850
Wire Wire Line
	2900 5850 3300 5850
$Comp
L power:GND #PWR0114
U 1 1 62BCD839
P 2900 6250
F 0 "#PWR0114" H 2900 6000 50  0001 C CNN
F 1 "GND" H 2905 6077 50  0001 C CNN
F 2 "" H 2900 6250 50  0001 C CNN
F 3 "" H 2900 6250 50  0001 C CNN
	1    2900 6250
	1    0    0    -1  
$EndComp
Wire Wire Line
	2900 6200 2900 6250
Wire Wire Line
	2500 5850 2100 5850
Wire Wire Line
	2100 5850 2100 5900
Connection ~ 2500 5850
$Comp
L power:GND #PWR0115
U 1 1 62C08AFD
P 2100 6250
F 0 "#PWR0115" H 2100 6000 50  0001 C CNN
F 1 "GND" H 2105 6077 50  0001 C CNN
F 2 "" H 2100 6250 50  0001 C CNN
F 3 "" H 2100 6250 50  0001 C CNN
	1    2100 6250
	1    0    0    -1  
$EndComp
Wire Wire Line
	2100 6200 2100 6250
Connection ~ 2100 5850
$Comp
L pspice:INDUCTOR L3
U 1 1 62D0E91A
P 6000 5850
F 0 "L3" H 6000 6065 50  0000 C CNN
F 1 "1µH" H 6000 5974 50  0000 C CNN
F 2 "Inductors:Inductor_Wurth_MAPI-3015" H 6000 5850 50  0001 C CNN
F 3 "~" H 6000 5850 50  0001 C CNN
F 4 "DJNR3015-1R0" H 6000 5850 50  0001 C CNN "MPN"
	1    6000 5850
	1    0    0    -1  
$EndComp
Wire Wire Line
	6250 5850 6300 5850
$Comp
L Device:R R4
U 1 1 62D3ADB5
P 6000 5500
F 0 "R4" H 6070 5546 50  0000 L CNN
F 1 "2.2k" H 6070 5455 50  0000 L CNN
F 2 "Resistors_SMD:R_0603" V 5930 5500 50  0001 C CNN
F 3 "~" H 6000 5500 50  0001 C CNN
	1    6000 5500
	0    -1   -1   0   
$EndComp
Wire Wire Line
	5700 5850 5700 5500
Wire Wire Line
	5700 5500 5850 5500
Connection ~ 5700 5850
Wire Wire Line
	5700 5850 5750 5850
Wire Wire Line
	6300 5500 6300 5850
Wire Wire Line
	6150 5500 6300 5500
Connection ~ 6300 5850
Wire Wire Line
	6300 5850 6400 5850
$Comp
L Device:CP C8
U 1 1 62D7E635
P 6400 6050
F 0 "C8" H 6518 6096 50  0000 L CNN
F 1 "4.7µF" H 6518 6005 50  0000 L CNN
F 2 "Capacitors_ThroughHole:CP_Radial_D4.0mm_P1.50mm" H 6438 5900 50  0001 C CNN
F 3 "~" H 6400 6050 50  0001 C CNN
	1    6400 6050
	1    0    0    -1  
$EndComp
Wire Wire Line
	6400 5850 6400 5900
Connection ~ 6400 5850
Wire Wire Line
	6400 5850 6500 5850
$Comp
L power:GND #PWR0116
U 1 1 62DA0791
P 6400 6250
F 0 "#PWR0116" H 6400 6000 50  0001 C CNN
F 1 "GND" H 6405 6077 50  0001 C CNN
F 2 "" H 6400 6250 50  0001 C CNN
F 3 "" H 6400 6250 50  0001 C CNN
	1    6400 6250
	1    0    0    -1  
$EndComp
Wire Wire Line
	6400 6200 6400 6250
$Comp
L Device:LED D2
U 1 1 62E6A0B0
P 7450 6050
F 0 "D2" V 7489 5932 50  0000 R CNN
F 1 "LED" V 7398 5932 50  0000 R CNN
F 2 "LEDs:LED_D5.0mm" H 7450 6050 50  0001 C CNN
F 3 "~" H 7450 6050 50  0001 C CNN
	1    7450 6050
	0    -1   -1   0   
$EndComp
$Comp
L Device:R R5
U 1 1 62E6C0A7
P 7450 5700
F 0 "R5" H 7520 5746 50  0000 L CNN
F 1 "9.1k" H 7520 5655 50  0000 L CNN
F 2 "Resistors_ThroughHole:R_Axial_DIN0207_L6.3mm_D2.5mm_P10.16mm_Horizontal" V 7380 5700 50  0001 C CNN
F 3 "~" H 7450 5700 50  0001 C CNN
	1    7450 5700
	1    0    0    -1  
$EndComp
$Comp
L power:GND #PWR0117
U 1 1 62E6D405
P 7450 6250
F 0 "#PWR0117" H 7450 6000 50  0001 C CNN
F 1 "GND" H 7455 6077 50  0001 C CNN
F 2 "" H 7450 6250 50  0001 C CNN
F 3 "" H 7450 6250 50  0001 C CNN
	1    7450 6250
	1    0    0    -1  
$EndComp
Wire Wire Line
	7450 6250 7450 6200
Wire Wire Line
	7450 5900 7450 5850
$Comp
L power:+12V #PWR0118
U 1 1 62EB0B05
P 7450 5500
F 0 "#PWR0118" H 7450 5350 50  0001 C CNN
F 1 "+12V" V 7450 5750 50  0000 C CNN
F 2 "" H 7450 5500 50  0001 C CNN
F 3 "" H 7450 5500 50  0001 C CNN
	1    7450 5500
	1    0    0    -1  
$EndComp
Wire Wire Line
	7450 5500 7450 5550
$Comp
L Device:LED D3
U 1 1 62EDCD3C
P 7850 6050
F 0 "D3" V 7889 5932 50  0000 R CNN
F 1 "LED" V 7798 5932 50  0000 R CNN
F 2 "LEDs:LED_D5.0mm" H 7850 6050 50  0001 C CNN
F 3 "~" H 7850 6050 50  0001 C CNN
	1    7850 6050
	0    -1   -1   0   
$EndComp
$Comp
L Device:R R6
U 1 1 62EDCD42
P 7850 5700
F 0 "R6" H 7920 5746 50  0000 L CNN
F 1 "2.2k" H 7920 5655 50  0000 L CNN
F 2 "Resistors_ThroughHole:R_Axial_DIN0207_L6.3mm_D2.5mm_P10.16mm_Horizontal" V 7780 5700 50  0001 C CNN
F 3 "~" H 7850 5700 50  0001 C CNN
	1    7850 5700
	1    0    0    -1  
$EndComp
$Comp
L power:GND #PWR0119
U 1 1 62EDCD48
P 7850 6250
F 0 "#PWR0119" H 7850 6000 50  0001 C CNN
F 1 "GND" H 7855 6077 50  0001 C CNN
F 2 "" H 7850 6250 50  0001 C CNN
F 3 "" H 7850 6250 50  0001 C CNN
	1    7850 6250
	1    0    0    -1  
$EndComp
Wire Wire Line
	7850 6250 7850 6200
Wire Wire Line
	7850 5900 7850 5850
Wire Wire Line
	7850 5500 7850 5550
$Comp
L Device:LED D4
U 1 1 62EFEAB8
P 8250 5700
F 0 "D4" V 8289 5582 50  0000 R CNN
F 1 "LED" V 8198 5582 50  0000 R CNN
F 2 "LEDs:LED_D5.0mm" H 8250 5700 50  0001 C CNN
F 3 "~" H 8250 5700 50  0001 C CNN
	1    8250 5700
	0    -1   -1   0   
$EndComp
$Comp
L Device:R R7
U 1 1 62EFEABE
P 8250 6050
F 0 "R7" H 8320 6096 50  0000 L CNN
F 1 "9.1k" H 8320 6005 50  0000 L CNN
F 2 "Resistors_ThroughHole:R_Axial_DIN0207_L6.3mm_D2.5mm_P10.16mm_Horizontal" V 8180 6050 50  0001 C CNN
F 3 "~" H 8250 6050 50  0001 C CNN
	1    8250 6050
	1    0    0    -1  
$EndComp
$Comp
L power:GND #PWR0120
U 1 1 62EFEAC4
P 8350 5450
F 0 "#PWR0120" H 8350 5200 50  0001 C CNN
F 1 "GND" H 8355 5277 50  0001 C CNN
F 2 "" H 8350 5450 50  0001 C CNN
F 3 "" H 8350 5450 50  0001 C CNN
	1    8350 5450
	1    0    0    -1  
$EndComp
Wire Wire Line
	8250 6250 8250 6200
Wire Wire Line
	8250 5900 8250 5850
$Comp
L power:-12V #PWR0121
U 1 1 62F27D5B
P 8250 6250
F 0 "#PWR0121" H 8250 6350 50  0001 C CNN
F 1 "-12V" H 8265 6423 50  0000 C CNN
F 2 "" H 8250 6250 50  0001 C CNN
F 3 "" H 8250 6250 50  0001 C CNN
	1    8250 6250
	-1   0    0    1   
$EndComp
Wire Wire Line
	8250 5400 8350 5400
Wire Wire Line
	8350 5400 8350 5450
Wire Wire Line
	8250 5400 8250 5550
$Comp
L power:+5V #PWR0122
U 1 1 62F582FB
P 7850 5500
F 0 "#PWR0122" H 7850 5350 50  0001 C CNN
F 1 "+5V" V 7850 5700 50  0000 C CNN
F 2 "" H 7850 5500 50  0001 C CNN
F 3 "" H 7850 5500 50  0001 C CNN
	1    7850 5500
	1    0    0    -1  
$EndComp
$Comp
L Device:CP C1
U 1 1 62F6DA27
P 1300 6050
F 0 "C1" H 1418 6096 50  0000 L CNN
F 1 "4.7µF" H 1418 6005 50  0000 L CNN
F 2 "Capacitors_ThroughHole:CP_Radial_D4.0mm_P1.50mm" H 1338 5900 50  0001 C CNN
F 3 "~" H 1300 6050 50  0001 C CNN
	1    1300 6050
	1    0    0    -1  
$EndComp
$Comp
L Mechanical:MountingHole_Pad H1
U 1 1 62A3CA95
P 9000 5500
F 0 "H1" H 9100 5503 50  0000 L CNN
F 1 "M3" H 9100 5458 50  0001 L CNN
F 2 "Mounting_Holes:MountingHole_3.2mm_M3_Pad_Via" H 9000 5500 50  0001 C CNN
F 3 "~" H 9000 5500 50  0001 C CNN
	1    9000 5500
	1    0    0    -1  
$EndComp
$Comp
L power:Earth #PWR0123
U 1 1 62A3DE9A
P 9000 5650
F 0 "#PWR0123" H 9000 5400 50  0001 C CNN
F 1 "Earth" H 9000 5500 50  0001 C CNN
F 2 "" H 9000 5650 50  0001 C CNN
F 3 "~" H 9000 5650 50  0001 C CNN
	1    9000 5650
	1    0    0    -1  
$EndComp
Wire Wire Line
	9000 5600 9000 5650
$Comp
L Mechanical:MountingHole_Pad H2
U 1 1 62A8CE55
P 9000 5950
F 0 "H2" H 9100 5953 50  0000 L CNN
F 1 "M3" H 9100 5908 50  0001 L CNN
F 2 "Mounting_Holes:MountingHole_3.2mm_M3_Pad_Via" H 9000 5950 50  0001 C CNN
F 3 "~" H 9000 5950 50  0001 C CNN
	1    9000 5950
	1    0    0    -1  
$EndComp
$Comp
L power:Earth #PWR0124
U 1 1 62A8CE5B
P 9000 6100
F 0 "#PWR0124" H 9000 5850 50  0001 C CNN
F 1 "Earth" H 9000 5950 50  0001 C CNN
F 2 "" H 9000 6100 50  0001 C CNN
F 3 "~" H 9000 6100 50  0001 C CNN
	1    9000 6100
	1    0    0    -1  
$EndComp
Wire Wire Line
	9000 6050 9000 6100
$Comp
L Mechanical:MountingHole_Pad H3
U 1 1 62AB1F0B
P 9350 5500
F 0 "H3" H 9450 5503 50  0000 L CNN
F 1 "M3" H 9450 5458 50  0001 L CNN
F 2 "Mounting_Holes:MountingHole_3.2mm_M3_Pad_Via" H 9350 5500 50  0001 C CNN
F 3 "~" H 9350 5500 50  0001 C CNN
	1    9350 5500
	1    0    0    -1  
$EndComp
$Comp
L power:Earth #PWR0125
U 1 1 62AB1F11
P 9350 5650
F 0 "#PWR0125" H 9350 5400 50  0001 C CNN
F 1 "Earth" H 9350 5500 50  0001 C CNN
F 2 "" H 9350 5650 50  0001 C CNN
F 3 "~" H 9350 5650 50  0001 C CNN
	1    9350 5650
	1    0    0    -1  
$EndComp
Wire Wire Line
	9350 5600 9350 5650
$Comp
L Mechanical:MountingHole_Pad H4
U 1 1 62AB1F18
P 9350 5950
F 0 "H4" H 9450 5953 50  0000 L CNN
F 1 "M3" H 9450 5908 50  0001 L CNN
F 2 "Mounting_Holes:MountingHole_3.2mm_M3_Pad_Via" H 9350 5950 50  0001 C CNN
F 3 "~" H 9350 5950 50  0001 C CNN
	1    9350 5950
	1    0    0    -1  
$EndComp
$Comp
L power:Earth #PWR0126
U 1 1 62AB1F1E
P 9350 6100
F 0 "#PWR0126" H 9350 5850 50  0001 C CNN
F 1 "Earth" H 9350 5950 50  0001 C CNN
F 2 "" H 9350 6100 50  0001 C CNN
F 3 "~" H 9350 6100 50  0001 C CNN
	1    9350 6100
	1    0    0    -1  
$EndComp
Wire Wire Line
	9350 6050 9350 6100
$Comp
L Mechanical:MountingHole_Pad H5
U 1 1 62AD455D
P 9700 5500
F 0 "H5" H 9800 5503 50  0000 L CNN
F 1 "M3" H 9800 5458 50  0001 L CNN
F 2 "Mounting_Holes:MountingHole_3.2mm_M3_Pad_Via" H 9700 5500 50  0001 C CNN
F 3 "~" H 9700 5500 50  0001 C CNN
	1    9700 5500
	1    0    0    -1  
$EndComp
$Comp
L power:Earth #PWR0127
U 1 1 62AD4563
P 9700 5650
F 0 "#PWR0127" H 9700 5400 50  0001 C CNN
F 1 "Earth" H 9700 5500 50  0001 C CNN
F 2 "" H 9700 5650 50  0001 C CNN
F 3 "~" H 9700 5650 50  0001 C CNN
	1    9700 5650
	1    0    0    -1  
$EndComp
Wire Wire Line
	9700 5600 9700 5650
$Comp
L Mechanical:MountingHole_Pad H6
U 1 1 62AD456A
P 9700 5950
F 0 "H6" H 9800 5953 50  0000 L CNN
F 1 "M3" H 9800 5908 50  0001 L CNN
F 2 "Mounting_Holes:MountingHole_3.2mm_M3_Pad_Via" H 9700 5950 50  0001 C CNN
F 3 "~" H 9700 5950 50  0001 C CNN
	1    9700 5950
	1    0    0    -1  
$EndComp
$Comp
L power:Earth #PWR0128
U 1 1 62AD4570
P 9700 6100
F 0 "#PWR0128" H 9700 5850 50  0001 C CNN
F 1 "Earth" H 9700 5950 50  0001 C CNN
F 2 "" H 9700 6100 50  0001 C CNN
F 3 "~" H 9700 6100 50  0001 C CNN
	1    9700 6100
	1    0    0    -1  
$EndComp
Wire Wire Line
	9700 6050 9700 6100
$Comp
L Mechanical:MountingHole_Pad H7
U 1 1 62AF7638
P 10050 5500
F 0 "H7" H 10150 5503 50  0000 L CNN
F 1 "M3" H 10150 5458 50  0001 L CNN
F 2 "Mounting_Holes:MountingHole_3.2mm_M3_Pad_Via" H 10050 5500 50  0001 C CNN
F 3 "~" H 10050 5500 50  0001 C CNN
	1    10050 5500
	1    0    0    -1  
$EndComp
$Comp
L power:Earth #PWR0129
U 1 1 62AF763E
P 10050 5650
F 0 "#PWR0129" H 10050 5400 50  0001 C CNN
F 1 "Earth" H 10050 5500 50  0001 C CNN
F 2 "" H 10050 5650 50  0001 C CNN
F 3 "~" H 10050 5650 50  0001 C CNN
	1    10050 5650
	1    0    0    -1  
$EndComp
Wire Wire Line
	10050 5600 10050 5650
Wire Wire Line
	4100 4350 4400 4350
Connection ~ 4100 4350
Connection ~ 4400 4350
Wire Wire Line
	4400 4450 4100 4450
Connection ~ 4400 4450
Connection ~ 4100 4450
Wire Wire Line
	2300 4350 2600 4350
Connection ~ 2300 4350
Connection ~ 2600 4350
Wire Wire Line
	2600 4450 2300 4450
Connection ~ 2600 4450
Connection ~ 2300 4450
Wire Wire Line
	3200 4350 3500 4350
Connection ~ 3200 4350
Connection ~ 3500 4350
Wire Wire Line
	3500 4450 3200 4450
Connection ~ 3500 4450
Connection ~ 3200 4450
Wire Wire Line
	5000 4350 5300 4350
Connection ~ 5000 4350
Connection ~ 5300 4350
Wire Wire Line
	5300 4450 5000 4450
Connection ~ 5300 4450
Connection ~ 5000 4450
Wire Wire Line
	5900 4350 6200 4350
Connection ~ 5900 4350
Connection ~ 6200 4350
Wire Wire Line
	6200 4450 5900 4450
Connection ~ 6200 4450
Connection ~ 5900 4450
Wire Wire Line
	6800 4350 7100 4350
Connection ~ 6800 4350
Connection ~ 7100 4350
Wire Wire Line
	7100 4450 6800 4450
Connection ~ 7100 4450
Connection ~ 6800 4450
Wire Wire Line
	7700 4350 8000 4350
Connection ~ 7700 4350
Connection ~ 8000 4350
Wire Wire Line
	8000 4450 7700 4450
Connection ~ 8000 4450
Connection ~ 7700 4450
Wire Wire Line
	8600 4350 8900 4350
Connection ~ 8600 4350
Connection ~ 8900 4350
Wire Wire Line
	8900 4450 8600 4450
Connection ~ 8900 4450
Connection ~ 8600 4450
Wire Wire Line
	9500 4350 9800 4350
Connection ~ 9500 4350
Connection ~ 9800 4350
Wire Wire Line
	9800 4450 9500 4450
Connection ~ 9800 4450
Connection ~ 9500 4450
$EndSCHEMATC
