(module Wago_236-404 (layer F.Cu) (tedit 628623D7)
  (fp_text reference REF** (at 7.5 2.5) (layer F.SilkS)
    (effects (font (size 1 1) (thickness 0.15)))
  )
  (fp_text value CONN8_236-404_WAG (at 7.5 2.5) (layer F.SilkS)
    (effects (font (size 1 1) (thickness 0.15)))
  )
  (fp_circle (center -4.4126 0) (end -4.0316 0) (layer B.SilkS) (width 0.12))
  (fp_circle (center -4.4126 0) (end -4.0316 0) (layer F.SilkS) (width 0.12))
  (fp_circle (center 0 -1.905) (end 0.381 -1.905) (layer F.Fab) (width 0.1))
  (fp_line (start 18.9046 -5.254) (end -3.9046 -5.254) (layer F.CrtYd) (width 0.05))
  (fp_line (start 18.9046 9.2494) (end 18.9046 -5.254) (layer F.CrtYd) (width 0.05))
  (fp_line (start -3.9046 9.2494) (end 18.9046 9.2494) (layer F.CrtYd) (width 0.05))
  (fp_line (start -3.9046 -5.254) (end -3.9046 9.2494) (layer F.CrtYd) (width 0.05))
  (fp_line (start -3.6506 -5) (end -3.6506 8.9954) (layer F.Fab) (width 0.1))
  (fp_line (start 18.6506 -5) (end -3.6506 -5) (layer F.Fab) (width 0.1))
  (fp_line (start 18.6506 8.9954) (end 18.6506 -5) (layer F.Fab) (width 0.1))
  (fp_line (start -3.6506 8.9954) (end 18.6506 8.9954) (layer F.Fab) (width 0.1))
  (fp_line (start -3.7776 -5.127) (end -3.7776 9.1224) (layer F.SilkS) (width 0.12))
  (fp_line (start 18.7776 -5.127) (end -3.7776 -5.127) (layer F.SilkS) (width 0.12))
  (fp_line (start 18.7776 9.1224) (end 18.7776 -5.127) (layer F.SilkS) (width 0.12))
  (fp_line (start -3.7776 9.1224) (end 18.7776 9.1224) (layer F.SilkS) (width 0.12))
  (fp_line (start 0 0) (end 0 -7.54) (layer Cmts.User) (width 0.1))
  (fp_line (start 18.9046 -5.254) (end -3.9046 -5.254) (layer F.CrtYd) (width 0.05))
  (fp_line (start 18.9046 9.2494) (end 18.9046 -5.254) (layer F.CrtYd) (width 0.05))
  (fp_line (start -3.9046 9.2494) (end 18.9046 9.2494) (layer F.CrtYd) (width 0.05))
  (fp_line (start -3.9046 -5.254) (end -3.9046 9.2494) (layer F.CrtYd) (width 0.05))
  (fp_text user "Copyright 2021 Accelerated Designs. All rights reserved." (at 0 0) (layer Cmts.User)
    (effects (font (size 0.127 0.127) (thickness 0.002)))
  )
  (fp_text user * (at 0 0) (layer F.SilkS)
    (effects (font (size 1 1) (thickness 0.15)))
  )
  (fp_text user * (at 0 0) (layer F.Fab)
    (effects (font (size 1 1) (thickness 0.15)))
  )
  (pad 1 thru_hole circle (at 0 0) (size 2.2 2.2) (drill 1.2) (layers *.Cu *.Mask))
  (pad 1 thru_hole circle (at 0 5) (size 2.2 2.2) (drill 1.2) (layers *.Cu *.Mask))
  (pad 2 thru_hole circle (at 5 0) (size 2.2 2.2) (drill 1.2) (layers *.Cu *.Mask))
  (pad 2 thru_hole circle (at 5 5) (size 2.2 2.2) (drill 1.2) (layers *.Cu *.Mask))
  (pad 3 thru_hole circle (at 10 0) (size 2.2 2.2) (drill 1.2) (layers *.Cu *.Mask))
  (pad 3 thru_hole circle (at 10 5) (size 2.2 2.2) (drill 1.2) (layers *.Cu *.Mask))
  (pad 4 thru_hole circle (at 15.000001 0) (size 2.2 2.2) (drill 1.2) (layers *.Cu *.Mask))
  (pad 4 thru_hole circle (at 15.000001 5) (size 2.2 2.2) (drill 1.2) (layers *.Cu *.Mask))
)
