(module Heatsink_Custom_39x41mm (layer F.Cu) (tedit 622E067D)
  (fp_text reference REF** (at 0 -8) (layer F.SilkS)
    (effects (font (size 1 1) (thickness 0.15)))
  )
  (fp_text value Heatsink_Custom_39x41mm (at 0 -9) (layer F.Fab)
    (effects (font (size 1 1) (thickness 0.15)))
  )
  (fp_circle (center 0 0) (end 3.5 0) (layer B.CrtYd) (width 0.12))
  (fp_circle (center 0 0) (end 3 0) (layer B.Fab) (width 0.12))
  (fp_line (start -20.5 13) (end -20.5 -30) (layer F.CrtYd) (width 0.12))
  (fp_line (start 20.5 13) (end -20.5 13) (layer F.CrtYd) (width 0.12))
  (fp_line (start 20.5 -30) (end 20.5 13) (layer F.CrtYd) (width 0.12))
  (fp_line (start -20.5 -30) (end 20.5 -30) (layer F.CrtYd) (width 0.12))
  (fp_line (start -19.5 12) (end -19.5 -29) (layer F.Fab) (width 0.12))
  (fp_line (start 19.5 12) (end -19.5 12) (layer F.Fab) (width 0.12))
  (fp_line (start 19.5 -29) (end 19.5 12) (layer F.Fab) (width 0.12))
  (fp_line (start -19.5 -29) (end 19.5 -29) (layer F.Fab) (width 0.12))
  (pad "" np_thru_hole circle (at 0 0) (size 3.4 3.4) (drill 3.4) (layers *.Cu *.Mask)
    (clearance 1.8))
)
