(module Heatsink_Custom_39x41mm_Dual (layer F.Cu) (tedit 62376C3C)
  (fp_text reference REF** (at 0 -11) (layer F.SilkS)
    (effects (font (size 1 1) (thickness 0.15)))
  )
  (fp_text value Heatsink_Custom_39x41mm_Dual (at 0 -12) (layer F.Fab)
    (effects (font (size 1 1) (thickness 0.15)))
  )
  (fp_circle (center 10.5 0) (end 14 0) (layer B.CrtYd) (width 0.12))
  (fp_circle (center 10.5 0) (end 13.5 0) (layer B.Fab) (width 0.12))
  (fp_circle (center -10.5 0) (end -7 0) (layer B.CrtYd) (width 0.12))
  (fp_circle (center -10.5 0) (end -7.5 0) (layer B.Fab) (width 0.12))
  (fp_line (start -20.5 10) (end -20.5 -33) (layer F.CrtYd) (width 0.12))
  (fp_line (start 20.5 10) (end -20.5 10) (layer F.CrtYd) (width 0.12))
  (fp_line (start 20.5 -33) (end 20.5 10) (layer F.CrtYd) (width 0.12))
  (fp_line (start -20.5 -33) (end 20.5 -33) (layer F.CrtYd) (width 0.12))
  (fp_line (start -19.5 9) (end -19.5 -32) (layer F.Fab) (width 0.12))
  (fp_line (start 19.5 9) (end -19.5 9) (layer F.Fab) (width 0.12))
  (fp_line (start 19.5 -32) (end 19.5 9) (layer F.Fab) (width 0.12))
  (fp_line (start -19.5 -32) (end 19.5 -32) (layer F.Fab) (width 0.12))
  (pad "" thru_hole circle (at -10.5 0) (size 3.4 3.4) (drill 3.4) (layers *.Cu *.Mask)
    (clearance 1.8))
  (pad "" thru_hole circle (at 10.5 0) (size 3.4 3.4) (drill 3.4) (layers *.Cu *.Mask)
    (clearance 1.8))
)
