EESchema Schematic File Version 4
EELAYER 30 0
EELAYER END
$Descr A4 11693 8268
encoding utf-8
Sheet 1 1
Title "Modular Amp"
Date "2022-03-30"
Rev "r2"
Comp "(c)  2022 Andreas Messer"
Comment1 ""
Comment2 ""
Comment3 ""
Comment4 ""
$EndDescr
$Comp
L Amplifier_Operational:TL082 U101
U 1 1 622CDD6D
P 7650 3300
F 0 "U101" H 7750 3550 50  0000 C CNN
F 1 "TL082" H 7750 3450 50  0000 C CNN
F 2 "Housings_DIP:DIP-8_W7.62mm_LongPads" H 7650 3300 50  0001 C CNN
F 3 "http://www.ti.com/lit/ds/symlink/tl081.pdf" H 7650 3300 50  0001 C CNN
	1    7650 3300
	1    0    0    -1  
$EndComp
Connection ~ 8500 3300
Wire Wire Line
	7350 3400 7300 3400
$Comp
L Connector:Screw_Terminal_01x03 J107
U 1 1 622E783D
P 9900 5500
F 0 "J107" H 9980 5542 50  0000 L CNN
F 1 "Screw_Terminal_01x03" H 9980 5451 50  0000 L CNN
F 2 "Connectors_Phoenix:PhoenixContact_MC-G_03x3.81mm_Angled" H 9900 5500 50  0001 C CNN
F 3 "~" H 9900 5500 50  0001 C CNN
	1    9900 5500
	1    0    0    1   
$EndComp
$Comp
L Device:CP C108
U 1 1 6230449C
P 8300 3800
F 0 "C108" V 8450 4000 50  0000 C BNN
F 1 "3300µF" V 8350 4000 50  0000 C CNN
F 2 "Capacitors_ThroughHole:CP_Radial_D12.5mm_P5.00mm" H 8338 3650 50  0001 C CNN
F 3 "~" H 8300 3800 50  0001 C CNN
	1    8300 3800
	0    -1   -1   0   
$EndComp
$Comp
L power:-12V #PWR0119
U 1 1 623058D5
P 8500 3850
F 0 "#PWR0119" H 8500 3950 50  0001 C CNN
F 1 "-12V" H 8515 4023 50  0000 C CNN
F 2 "" H 8500 3850 50  0001 C CNN
F 3 "" H 8500 3850 50  0001 C CNN
	1    8500 3850
	-1   0    0    1   
$EndComp
Wire Wire Line
	8500 3750 8500 3800
Wire Wire Line
	8450 3800 8500 3800
Connection ~ 8500 3800
Wire Wire Line
	8500 3800 8500 3850
$Comp
L power:GND #PWR0115
U 1 1 6230A156
P 8100 3850
F 0 "#PWR0115" H 8100 3600 50  0001 C CNN
F 1 "GND" H 8105 3677 50  0001 C CNN
F 2 "" H 8100 3850 50  0001 C CNN
F 3 "" H 8100 3850 50  0001 C CNN
	1    8100 3850
	1    0    0    -1  
$EndComp
Wire Wire Line
	8150 3800 8100 3800
Wire Wire Line
	8100 3800 8100 3850
$Comp
L Device:CP C107
U 1 1 6231509C
P 8300 2800
F 0 "C107" V 8045 2800 50  0000 C CNN
F 1 "3300µF" V 8136 2800 50  0000 C CNN
F 2 "Capacitors_ThroughHole:CP_Radial_D12.5mm_P5.00mm" H 8338 2650 50  0001 C CNN
F 3 "~" H 8300 2800 50  0001 C CNN
	1    8300 2800
	0    1    1    0   
$EndComp
$Comp
L power:GND #PWR0114
U 1 1 62315DA1
P 8100 2850
F 0 "#PWR0114" H 8100 2600 50  0001 C CNN
F 1 "GND" H 8105 2677 50  0001 C CNN
F 2 "" H 8100 2850 50  0001 C CNN
F 3 "" H 8100 2850 50  0001 C CNN
	1    8100 2850
	1    0    0    -1  
$EndComp
Wire Wire Line
	8150 2800 8100 2800
Wire Wire Line
	8100 2800 8100 2850
$Comp
L power:+12V #PWR0118
U 1 1 62317F35
P 8500 2750
F 0 "#PWR0118" H 8500 2600 50  0001 C CNN
F 1 "+12V" H 8515 2923 50  0000 C CNN
F 2 "" H 8500 2750 50  0001 C CNN
F 3 "" H 8500 2750 50  0001 C CNN
	1    8500 2750
	1    0    0    -1  
$EndComp
Wire Wire Line
	8500 2850 8500 2800
Wire Wire Line
	8500 2800 8450 2800
Connection ~ 8500 2800
Wire Wire Line
	8500 2800 8500 2750
$Comp
L Device:R R111
U 1 1 6232143A
P 8100 2500
F 0 "R111" V 8250 2500 50  0000 C CNN
F 1 "68k" V 8150 2500 50  0000 C TNN
F 2 "Resistors_ThroughHole:R_Axial_DIN0207_L6.3mm_D2.5mm_P10.16mm_Horizontal" V 8030 2500 50  0001 C CNN
F 3 "~" H 8100 2500 50  0001 C CNN
	1    8100 2500
	0    1    -1   0   
$EndComp
$Comp
L Transistor_BJT:BC547 Q101
U 1 1 6231C66D
P 7250 2800
F 0 "Q101" V 7050 2850 50  0000 L CNN
F 1 "BC547" V 7150 2800 50  0000 L CNN
F 2 "TO_SOT_Packages_THT:TO-92_Molded_Narrow_Oval" H 7450 2725 50  0001 L CIN
F 3 "https://www.onsemi.com/pub/Collateral/BC550-D.pdf" H 7250 2800 50  0001 L CNN
	1    7250 2800
	0    -1   1    0   
$EndComp
$Comp
L Relay:FINDER-41.52 K101
U 1 1 62415246
P 10050 3800
F 0 "K101" V 9350 3800 50  0000 C BNN
F 1 "FINDER-41.52" V 9400 3800 50  0000 C CNN
F 2 "Relays_ThroughHole:Relay_DPDT_Finder_40.52" H 11400 3770 50  0001 C CNN
F 3 "http://gfinder.findernet.com/assets/Series/357/S41EN.pdf" H 10050 3800 50  0001 C CNN
	1    10050 3800
	0    -1   1    0   
$EndComp
$Comp
L Connector:Screw_Terminal_01x03 J108
U 1 1 62429745
P 9900 5000
F 0 "J108" H 9980 5042 50  0000 L CNN
F 1 "Screw_Terminal_01x03" H 9980 4951 50  0000 L CNN
F 2 "Connectors_Phoenix:PhoenixContact_MC-G_03x3.81mm_Angled" H 9900 5000 50  0001 C CNN
F 3 "~" H 9900 5000 50  0001 C CNN
	1    9900 5000
	1    0    0    1   
$EndComp
$Comp
L Device:R R116
U 1 1 62453DC6
P 9250 3100
F 0 "R116" H 9300 3050 50  0000 L CNN
F 1 "8.2k" H 9300 3100 50  0000 L BNN
F 2 "Resistors_ThroughHole:R_Axial_DIN0207_L6.3mm_D2.5mm_P10.16mm_Horizontal" V 9180 3100 50  0001 C CNN
F 3 "~" H 9250 3100 50  0001 C CNN
	1    9250 3100
	-1   0    0    1   
$EndComp
$Comp
L Device:D D103
U 1 1 62493EAB
P 9700 3200
F 0 "D103" V 9700 3150 50  0000 R CNN
F 1 "1N4148" V 9750 3150 50  0000 R TNN
F 2 "Diodes_ThroughHole:D_DO-35_SOD27_P7.62mm_Horizontal" H 9700 3200 50  0001 C CNN
F 3 "~" H 9700 3200 50  0001 C CNN
	1    9700 3200
	0    1    1    0   
$EndComp
$Comp
L power:-12V #PWR0126
U 1 1 62497709
P 9700 3450
F 0 "#PWR0126" H 9700 3550 50  0001 C CNN
F 1 "-12V" H 9850 3500 50  0000 C CNN
F 2 "" H 9700 3450 50  0001 C CNN
F 3 "" H 9700 3450 50  0001 C CNN
	1    9700 3450
	-1   0    0    1   
$EndComp
$Comp
L power:+12V #PWR0123
U 1 1 624EFA1C
P 9550 2100
F 0 "#PWR0123" H 9550 1950 50  0001 C CNN
F 1 "+12V" H 9565 2273 50  0000 C CNN
F 2 "" H 9550 2100 50  0001 C CNN
F 3 "" H 9550 2100 50  0001 C CNN
	1    9550 2100
	1    0    0    -1  
$EndComp
$Comp
L power:GND #PWR0108
U 1 1 62583276
P 6850 3600
F 0 "#PWR0108" H 6850 3350 50  0001 C CNN
F 1 "GND" H 6855 3427 50  0001 C CNN
F 2 "" H 6850 3600 50  0001 C CNN
F 3 "" H 6850 3600 50  0001 C CNN
	1    6850 3600
	1    0    0    -1  
$EndComp
$Comp
L Device:R R103
U 1 1 625A5B5C
P 6650 3200
F 0 "R103" V 6857 3200 50  0000 C CNN
F 1 "8.2k" V 6766 3200 50  0000 C CNN
F 2 "Resistors_ThroughHole:R_Axial_DIN0207_L6.3mm_D2.5mm_P10.16mm_Horizontal" V 6580 3200 50  0001 C CNN
F 3 "~" H 6650 3200 50  0001 C CNN
	1    6650 3200
	0    -1   -1   0   
$EndComp
Wire Wire Line
	6800 3200 6850 3200
$Comp
L Device:C C103
U 1 1 625A616A
P 6850 3400
F 0 "C103" H 6750 3450 50  0000 R TNN
F 1 "180pF" H 6750 3350 50  0000 R CNN
F 2 "Capacitors_ThroughHole:C_Disc_D4.7mm_W2.5mm_P5.00mm" H 6888 3250 50  0001 C CNN
F 3 "~" H 6850 3400 50  0001 C CNN
	1    6850 3400
	1    0    0    -1  
$EndComp
Wire Wire Line
	6850 3250 6850 3200
Wire Wire Line
	6850 3600 6850 3550
$Comp
L Device:R R109
U 1 1 62321E1C
P 7500 2700
F 0 "R109" H 7500 2550 50  0000 R CNN
F 1 "68k" H 7450 2600 50  0000 R BNN
F 2 "Resistors_ThroughHole:R_Axial_DIN0207_L6.3mm_D2.5mm_P10.16mm_Horizontal" V 7430 2700 50  0001 C CNN
F 3 "~" H 7500 2700 50  0001 C CNN
	1    7500 2700
	1    0    0    1   
$EndComp
$Comp
L Device:R R113
U 1 1 622D05D8
P 8300 3300
F 0 "R113" V 8100 3150 50  0000 C CNN
F 1 "150" V 8200 3150 50  0000 C CNN
F 2 "Resistors_ThroughHole:R_Axial_DIN0207_L6.3mm_D2.5mm_P10.16mm_Horizontal" V 8230 3300 50  0001 C CNN
F 3 "~" H 8300 3300 50  0001 C CNN
	1    8300 3300
	0    1    1    0   
$EndComp
$Comp
L Transistor_BJT:BD234 Q106
U 1 1 622D6E7B
P 8400 3550
F 0 "Q106" H 8592 3504 50  0000 L CNN
F 1 "2SB772" H 8592 3595 50  0000 L CNN
F 2 "TO_SOT_Packages_THT:TO-126_Horizontal_Reversed" H 8600 3475 50  0001 L CIN
F 3 "http://www.electronica-pt.com/datasheets/bd/BD234.pdf" H 8400 3550 50  0001 L CNN
	1    8400 3550
	1    0    0    1   
$EndComp
$Comp
L Transistor_BJT:BD237 Q105
U 1 1 622DE451
P 8400 3050
F 0 "Q105" H 8592 3096 50  0000 L CNN
F 1 "2SD882" H 8592 3005 50  0000 L CNN
F 2 "TO_SOT_Packages_THT:TO-126_Horizontal_Reversed" H 8600 2975 50  0001 L CIN
F 3 "https://media.digikey.com/pdf/Data%20Sheets/Micro%20Commercial%20PDFs/BD233,235,237.pdf" H 8400 3050 50  0001 L CNN
	1    8400 3050
	1    0    0    -1  
$EndComp
$Comp
L Device:R R105
U 1 1 622EA7C2
P 7500 3750
F 0 "R105" V 7650 3750 50  0000 C CNN
F 1 "8.2k" V 7550 3750 50  0000 C TNN
F 2 "Resistors_ThroughHole:R_Axial_DIN0207_L6.3mm_D2.5mm_P10.16mm_Horizontal" V 7430 3750 50  0001 C CNN
F 3 "~" H 7500 3750 50  0001 C CNN
	1    7500 3750
	0    -1   -1   0   
$EndComp
$Comp
L Device:R R106
U 1 1 622E4001
P 7500 4100
F 0 "R106" V 7350 4100 50  0000 C CNN
F 1 "39k" V 7450 4100 50  0000 C BNN
F 2 "Resistors_ThroughHole:R_Axial_DIN0207_L6.3mm_D2.5mm_P10.16mm_Horizontal" V 7430 4100 50  0001 C CNN
F 3 "~" H 7500 4100 50  0001 C CNN
	1    7500 4100
	0    1    1    0   
$EndComp
Connection ~ 6850 3200
$Comp
L power:GND #PWR0122
U 1 1 6257A9C4
P 9950 6200
F 0 "#PWR0122" H 9950 5950 50  0001 C CNN
F 1 "GND" H 9955 6027 50  0001 C CNN
F 2 "" H 9950 6200 50  0001 C CNN
F 3 "" H 9950 6200 50  0001 C CNN
	1    9950 6200
	-1   0    0    -1  
$EndComp
Wire Wire Line
	10000 6150 9950 6150
Wire Wire Line
	9950 6150 9950 6200
$Comp
L Transistor_BJT:BC557 Q110
U 1 1 62454C81
P 9800 2750
F 0 "Q110" H 9991 2704 50  0000 L CNN
F 1 "BC557" H 9991 2795 50  0000 L CNN
F 2 "TO_SOT_Packages_THT:TO-92_Molded_Narrow_Oval" H 10000 2675 50  0001 L CIN
F 3 "https://www.onsemi.com/pub/Collateral/BC556BTA-D.pdf" H 9800 2750 50  0001 L CNN
	1    9800 2750
	1    0    0    1   
$EndComp
$Comp
L Device:R R117
U 1 1 62A464A4
P 9800 5950
F 0 "R117" V 9650 5950 50  0000 C CNN
F 1 "150" V 9750 5950 50  0000 C BNN
F 2 "Resistors_ThroughHole:R_Axial_DIN0207_L6.3mm_D2.5mm_P10.16mm_Horizontal" V 9730 5950 50  0001 C CNN
F 3 "~" H 9800 5950 50  0001 C CNN
	1    9800 5950
	0    -1   1    0   
$EndComp
Wire Wire Line
	8450 3300 8500 3300
Wire Wire Line
	8500 3300 8500 3350
Wire Wire Line
	8900 3300 8500 3300
Wire Wire Line
	8900 2500 8900 3300
Wire Wire Line
	8500 3250 8500 3300
Connection ~ 8500 5550
Wire Wire Line
	7350 5650 7300 5650
$Comp
L Device:CP C110
U 1 1 625266DF
P 8300 6050
F 0 "C110" V 8450 6250 50  0000 C BNN
F 1 "3300µF" V 8350 6250 50  0000 C CNN
F 2 "Capacitors_ThroughHole:CP_Radial_D12.5mm_P5.00mm" H 8338 5900 50  0001 C CNN
F 3 "~" H 8300 6050 50  0001 C CNN
	1    8300 6050
	0    -1   -1   0   
$EndComp
$Comp
L power:-12V #PWR0121
U 1 1 625266E5
P 8500 6100
F 0 "#PWR0121" H 8500 6200 50  0001 C CNN
F 1 "-12V" H 8515 6273 50  0000 C CNN
F 2 "" H 8500 6100 50  0001 C CNN
F 3 "" H 8500 6100 50  0001 C CNN
	1    8500 6100
	-1   0    0    1   
$EndComp
Wire Wire Line
	8500 6000 8500 6050
Wire Wire Line
	8450 6050 8500 6050
Connection ~ 8500 6050
Wire Wire Line
	8500 6050 8500 6100
$Comp
L Device:CP C109
U 1 1 625266F7
P 8300 5050
F 0 "C109" V 8045 5050 50  0000 C CNN
F 1 "3300µF" V 8136 5050 50  0000 C CNN
F 2 "Capacitors_ThroughHole:CP_Radial_D12.5mm_P5.00mm" H 8338 4900 50  0001 C CNN
F 3 "~" H 8300 5050 50  0001 C CNN
	1    8300 5050
	0    1    1    0   
$EndComp
Wire Wire Line
	8150 5050 8100 5050
Wire Wire Line
	8100 5050 8100 5100
$Comp
L power:+12V #PWR0120
U 1 1 62526705
P 8500 5000
F 0 "#PWR0120" H 8500 4850 50  0001 C CNN
F 1 "+12V" H 8515 5173 50  0000 C CNN
F 2 "" H 8500 5000 50  0001 C CNN
F 3 "" H 8500 5000 50  0001 C CNN
	1    8500 5000
	1    0    0    -1  
$EndComp
Wire Wire Line
	8500 5100 8500 5050
Wire Wire Line
	8500 5050 8450 5050
Connection ~ 8500 5050
Wire Wire Line
	8500 5050 8500 5000
$Comp
L Device:R_POT_Dual_Separate RV101
U 1 1 62526732
P 5400 3750
F 0 "RV101" V 5250 3750 50  0000 C CNN
F 1 "100k" V 5350 3750 50  0000 C BNN
F 2 "" H 5400 3750 50  0001 C CNN
F 3 "~" H 5400 3750 50  0001 C CNN
	1    5400 3750
	0    1    1    0   
$EndComp
$Comp
L Device:R R104
U 1 1 62526747
P 6650 5450
F 0 "R104" V 6857 5450 50  0000 C CNN
F 1 "8.2k" V 6766 5450 50  0000 C CNN
F 2 "Resistors_ThroughHole:R_Axial_DIN0207_L6.3mm_D2.5mm_P10.16mm_Horizontal" V 6580 5450 50  0001 C CNN
F 3 "~" H 6650 5450 50  0001 C CNN
	1    6650 5450
	0    -1   -1   0   
$EndComp
Wire Wire Line
	6800 5450 6850 5450
$Comp
L Device:C C104
U 1 1 6252674E
P 6850 5650
F 0 "C104" H 6750 5650 50  0000 R BNN
F 1 "180pF" H 6750 5600 50  0000 R CNN
F 2 "Capacitors_ThroughHole:C_Disc_D4.7mm_W2.5mm_P5.00mm" H 6888 5500 50  0001 C CNN
F 3 "~" H 6850 5650 50  0001 C CNN
	1    6850 5650
	1    0    0    -1  
$EndComp
Wire Wire Line
	6850 5500 6850 5450
Wire Wire Line
	6850 5850 6850 5800
$Comp
L Device:R R101
U 1 1 62526759
P 5600 3950
F 0 "R101" V 5450 3950 50  0000 C CNN
F 1 "12k" V 5550 3950 50  0000 C BNN
F 2 "" V 5530 3950 50  0001 C CNN
F 3 "~" H 5600 3950 50  0001 C CNN
	1    5600 3950
	0    1    1    0   
$EndComp
$Comp
L Device:R R114
U 1 1 62526766
P 8300 5550
F 0 "R114" V 8100 5400 50  0000 C CNN
F 1 "150" V 8200 5400 50  0000 C CNN
F 2 "Resistors_ThroughHole:R_Axial_DIN0207_L6.3mm_D2.5mm_P10.16mm_Horizontal" V 8230 5550 50  0001 C CNN
F 3 "~" H 8300 5550 50  0001 C CNN
	1    8300 5550
	0    1    1    0   
$EndComp
$Comp
L Transistor_BJT:BD234 Q108
U 1 1 6252676C
P 8400 5800
F 0 "Q108" H 8592 5754 50  0000 L CNN
F 1 "2SB772" H 8592 5845 50  0000 L CNN
F 2 "TO_SOT_Packages_THT:TO-126_Horizontal_Reversed" H 8600 5725 50  0001 L CIN
F 3 "http://www.electronica-pt.com/datasheets/bd/BD234.pdf" H 8400 5800 50  0001 L CNN
	1    8400 5800
	1    0    0    1   
$EndComp
$Comp
L Transistor_BJT:BD237 Q107
U 1 1 62526772
P 8400 5300
F 0 "Q107" H 8592 5346 50  0000 L CNN
F 1 "2SD882" H 8592 5255 50  0000 L CNN
F 2 "TO_SOT_Packages_THT:TO-126_Horizontal_Reversed" H 8600 5225 50  0001 L CIN
F 3 "https://media.digikey.com/pdf/Data%20Sheets/Micro%20Commercial%20PDFs/BD233,235,237.pdf" H 8400 5300 50  0001 L CNN
	1    8400 5300
	1    0    0    -1  
$EndComp
$Comp
L Device:R R107
U 1 1 6252677E
P 7500 6000
F 0 "R107" V 7650 6000 50  0000 C CNN
F 1 "8.2k" V 7550 6000 50  0000 C TNN
F 2 "Resistors_ThroughHole:R_Axial_DIN0207_L6.3mm_D2.5mm_P10.16mm_Horizontal" V 7430 6000 50  0001 C CNN
F 3 "~" H 7500 6000 50  0001 C CNN
	1    7500 6000
	0    -1   -1   0   
$EndComp
$Comp
L Device:R R108
U 1 1 6252678A
P 7500 6350
F 0 "R108" V 7350 6350 50  0000 C CNN
F 1 "39k" V 7450 6350 50  0000 C BNN
F 2 "Resistors_ThroughHole:R_Axial_DIN0207_L6.3mm_D2.5mm_P10.16mm_Horizontal" V 7430 6350 50  0001 C CNN
F 3 "~" H 7500 6350 50  0001 C CNN
	1    7500 6350
	0    1    1    0   
$EndComp
Connection ~ 6850 5450
Wire Wire Line
	8450 5550 8500 5550
Wire Wire Line
	8500 5550 8500 5600
Wire Wire Line
	8250 4750 8900 4750
Wire Wire Line
	8900 5550 8500 5550
Wire Wire Line
	8500 5500 8500 5550
Wire Wire Line
	9700 3400 9750 3400
Connection ~ 9700 3400
Wire Wire Line
	9700 3400 9700 3450
Wire Wire Line
	9700 3000 9900 3000
Wire Wire Line
	10400 3000 10400 3400
Wire Wire Line
	10400 3400 10350 3400
Wire Wire Line
	8900 3300 8900 3900
Wire Wire Line
	8900 3900 9450 3900
Connection ~ 8900 3300
Wire Wire Line
	10450 4750 8900 4750
Connection ~ 8900 4750
Wire Wire Line
	7050 2900 7000 2900
Wire Wire Line
	7000 2900 7000 2000
$Comp
L Transistor_BJT:BC547 Q103
U 1 1 6231AAEF
P 7600 2250
F 0 "Q103" H 7791 2296 50  0000 L CNN
F 1 "BC547" H 7791 2205 50  0000 L CNN
F 2 "TO_SOT_Packages_THT:TO-92_Molded_Narrow_Oval" H 7800 2175 50  0001 L CIN
F 3 "https://www.onsemi.com/pub/Collateral/BC550-D.pdf" H 7600 2250 50  0001 L CNN
	1    7600 2250
	-1   0    0    -1  
$EndComp
$Comp
L Transistor_BJT:BC547 Q102
U 1 1 627022F9
P 7250 5050
F 0 "Q102" V 7050 5100 50  0000 L TNN
F 1 "BC547" V 7150 5050 50  0000 L CNN
F 2 "TO_SOT_Packages_THT:TO-92_Molded_Narrow_Oval" H 7450 4975 50  0001 L CIN
F 3 "https://www.onsemi.com/pub/Collateral/BC550-D.pdf" H 7250 5050 50  0001 L CNN
	1    7250 5050
	0    -1   1    0   
$EndComp
Wire Wire Line
	7500 4250 7500 4300
Wire Wire Line
	7500 4750 7500 4800
Wire Wire Line
	7900 4800 7900 4750
Wire Wire Line
	7950 4750 7900 4750
Connection ~ 7900 4750
$Comp
L Device:R R110
U 1 1 6270230A
P 7500 4950
F 0 "R110" H 7500 4800 50  0000 R CNN
F 1 "68k" H 7450 4850 50  0000 R BNN
F 2 "Resistors_ThroughHole:R_Axial_DIN0207_L6.3mm_D2.5mm_P10.16mm_Horizontal" V 7430 4950 50  0001 C CNN
F 3 "~" H 7500 4950 50  0001 C CNN
	1    7500 4950
	1    0    0    1   
$EndComp
Wire Wire Line
	7500 5150 7500 5100
Wire Wire Line
	7500 5150 7550 5150
Connection ~ 7500 5150
Wire Wire Line
	7450 5150 7500 5150
Wire Wire Line
	7250 4750 7250 4850
Wire Wire Line
	7050 5150 7000 5150
Wire Wire Line
	7000 5150 7000 4250
Wire Wire Line
	7000 4250 7500 4250
$Comp
L Transistor_BJT:BC547 Q104
U 1 1 6270231D
P 7600 4500
F 0 "Q104" H 7791 4546 50  0000 L CNN
F 1 "BC547" H 7791 4455 50  0000 L CNN
F 2 "TO_SOT_Packages_THT:TO-92_Molded_Narrow_Oval" H 7800 4425 50  0001 L CIN
F 3 "https://www.onsemi.com/pub/Collateral/BC550-D.pdf" H 7600 4500 50  0001 L CNN
	1    7600 4500
	-1   0    0    -1  
$EndComp
Wire Wire Line
	7250 4750 7500 4750
Connection ~ 7500 4750
Wire Wire Line
	7500 4750 7900 4750
$Comp
L power:GND #PWR0111
U 1 1 62702328
P 7500 5200
F 0 "#PWR0111" H 7500 4950 50  0001 C CNN
F 1 "GND" H 7505 5027 50  0001 C CNN
F 2 "" H 7500 5200 50  0001 C CNN
F 3 "" H 7500 5200 50  0001 C CNN
	1    7500 5200
	1    0    0    -1  
$EndComp
Wire Wire Line
	7500 5150 7500 5200
$Comp
L Device:R R112
U 1 1 6270F008
P 8100 4750
F 0 "R112" V 8307 4750 50  0000 C CNN
F 1 "68k" V 8216 4750 50  0000 C CNN
F 2 "Resistors_ThroughHole:R_Axial_DIN0207_L6.3mm_D2.5mm_P10.16mm_Horizontal" V 8030 4750 50  0001 C CNN
F 3 "~" H 8100 4750 50  0001 C CNN
	1    8100 4750
	0    1    -1   0   
$EndComp
$Comp
L power:GND #PWR0116
U 1 1 6270F77D
P 8100 5100
F 0 "#PWR0116" H 8100 4850 50  0001 C CNN
F 1 "GND" H 8105 4927 50  0001 C CNN
F 2 "" H 8100 5100 50  0001 C CNN
F 3 "" H 8100 5100 50  0001 C CNN
	1    8100 5100
	1    0    0    -1  
$EndComp
Wire Wire Line
	7000 2900 7000 4250
Connection ~ 7000 2900
Connection ~ 7000 4250
Wire Wire Line
	6850 3200 7350 3200
Wire Wire Line
	6850 5450 7350 5450
Wire Wire Line
	9450 3950 9450 3900
Connection ~ 9450 3900
Wire Wire Line
	9450 3900 9750 3900
Wire Wire Line
	10350 3800 10550 3800
Wire Wire Line
	10550 3800 10550 4450
Wire Wire Line
	10450 4750 10450 4650
Wire Wire Line
	10450 4200 10350 4200
Connection ~ 9450 4450
Wire Wire Line
	9450 4450 9450 4250
Wire Wire Line
	9100 4100 7650 4100
Wire Wire Line
	7300 6350 7350 6350
Wire Wire Line
	9700 5100 9650 5100
$Comp
L power:GND #PWR0125
U 1 1 629DF8A6
P 9650 5650
F 0 "#PWR0125" H 9650 5400 50  0001 C CNN
F 1 "GND" H 9655 5477 50  0001 C CNN
F 2 "" H 9650 5650 50  0001 C CNN
F 3 "" H 9650 5650 50  0001 C CNN
	1    9650 5650
	1    0    0    -1  
$EndComp
Wire Wire Line
	9700 5600 9650 5600
Wire Wire Line
	9650 5600 9650 5650
Wire Wire Line
	7300 5650 7300 6000
Wire Wire Line
	7300 3400 7300 3750
Wire Wire Line
	9550 4300 9750 4300
$Comp
L Device:R R115
U 1 1 62438EF0
P 8900 2200
F 0 "R115" H 8950 2150 50  0000 L CNN
F 1 "68k" H 8950 2200 50  0000 L BNN
F 2 "Resistors_ThroughHole:R_Axial_DIN0207_L6.3mm_D2.5mm_P10.16mm_Horizontal" V 8830 2200 50  0001 C CNN
F 3 "~" H 8900 2200 50  0001 C CNN
	1    8900 2200
	-1   0    0    1   
$EndComp
$Comp
L Transistor_BJT:BC557 Q109
U 1 1 62437B2A
P 9150 2400
F 0 "Q109" H 9150 2500 50  0000 R BNN
F 1 "BC557" H 9150 2600 50  0000 R CNN
F 2 "TO_SOT_Packages_THT:TO-92_Molded_Narrow_Oval" H 9350 2325 50  0001 L CIN
F 3 "https://www.onsemi.com/pub/Collateral/BC556BTA-D.pdf" H 9150 2400 50  0001 L CNN
	1    9150 2400
	1    0    0    1   
$EndComp
$Comp
L Device:R R120
U 1 1 62D1C91E
P 9550 2450
F 0 "R120" H 9600 2500 50  0000 L CNN
F 1 "8.2k" H 9600 2450 50  0000 L TNN
F 2 "Resistors_ThroughHole:R_Axial_DIN0207_L6.3mm_D2.5mm_P10.16mm_Horizontal" V 9480 2450 50  0001 C CNN
F 3 "~" H 9550 2450 50  0001 C CNN
	1    9550 2450
	1    0    0    -1  
$EndComp
Wire Wire Line
	9700 3000 9700 3050
Wire Wire Line
	9250 3400 9250 3250
Wire Wire Line
	9600 2750 9550 2750
Connection ~ 9550 2750
Wire Wire Line
	9550 2750 9550 2600
Wire Wire Line
	9550 2300 9550 2150
Wire Wire Line
	9900 2150 9900 2200
Wire Wire Line
	9250 2200 9250 2150
Wire Wire Line
	9250 2150 9550 2150
Connection ~ 9550 2150
Wire Wire Line
	9550 2100 9550 2150
Wire Wire Line
	9550 2150 9900 2150
Wire Wire Line
	9700 3350 9700 3400
Wire Wire Line
	9900 2950 9900 3000
Wire Wire Line
	9900 3000 10400 3000
Connection ~ 9900 3000
Wire Wire Line
	9550 2750 9250 2750
Wire Wire Line
	9250 2750 9250 2600
Wire Wire Line
	9250 2950 9250 2750
Connection ~ 9250 2750
Wire Wire Line
	8900 2350 8900 2400
Wire Wire Line
	8900 2400 8950 2400
$Comp
L power:GND #PWR0112
U 1 1 62E93211
P 7700 3800
F 0 "#PWR0112" H 7700 3550 50  0001 C CNN
F 1 "GND" H 7705 3627 50  0001 C CNN
F 2 "" H 7700 3800 50  0001 C CNN
F 3 "" H 7700 3800 50  0001 C CNN
	1    7700 3800
	1    0    0    -1  
$EndComp
Wire Wire Line
	7650 3750 7700 3750
Wire Wire Line
	7700 3750 7700 3800
Wire Wire Line
	7350 3750 7300 3750
Connection ~ 7300 3750
Wire Wire Line
	7300 3750 7300 4100
Wire Wire Line
	7350 4100 7300 4100
Wire Wire Line
	7650 6350 9000 6350
Wire Wire Line
	7300 6000 7350 6000
Connection ~ 7300 6000
Wire Wire Line
	7300 6000 7300 6350
$Comp
L power:GND #PWR0113
U 1 1 62ED5AA9
P 7700 6050
F 0 "#PWR0113" H 7700 5800 50  0001 C CNN
F 1 "GND" H 7705 5877 50  0001 C CNN
F 2 "" H 7700 6050 50  0001 C CNN
F 3 "" H 7700 6050 50  0001 C CNN
	1    7700 6050
	1    0    0    -1  
$EndComp
Wire Wire Line
	7650 6000 7700 6000
Wire Wire Line
	7700 6000 7700 6050
Wire Wire Line
	9650 5100 9650 5150
$Comp
L power:GND #PWR0124
U 1 1 6242974B
P 9650 5150
F 0 "#PWR0124" H 9650 4900 50  0001 C CNN
F 1 "GND" H 9655 4977 50  0001 C CNN
F 2 "" H 9650 5150 50  0001 C CNN
F 3 "" H 9650 5150 50  0001 C CNN
	1    9650 5150
	1    0    0    -1  
$EndComp
Wire Wire Line
	8900 2000 8900 2050
Wire Wire Line
	6000 5250 6000 5300
Wire Wire Line
	6250 5250 6000 5250
Wire Wire Line
	6000 6000 6000 6050
Wire Wire Line
	6000 5600 6000 5650
$Comp
L Device:C C102
U 1 1 62FCA73D
P 6000 5850
F 0 "C102" H 6115 5896 50  0000 L CNN
F 1 "220nF" H 6115 5805 50  0000 L CNN
F 2 "Capacitors_ThroughHole:C_Disc_D5.1mm_W3.2mm_P5.00mm" H 6038 5700 50  0001 C CNN
F 3 "~" H 6000 5850 50  0001 C CNN
	1    6000 5850
	-1   0    0    -1  
$EndComp
$Comp
L Device:C C101
U 1 1 62FC7941
P 6000 5450
F 0 "C101" H 6115 5496 50  0000 L CNN
F 1 "220nF" H 6115 5405 50  0000 L CNN
F 2 "Capacitors_ThroughHole:C_Disc_D5.1mm_W3.2mm_P5.00mm" H 6038 5300 50  0001 C CNN
F 3 "~" H 6000 5450 50  0001 C CNN
	1    6000 5450
	-1   0    0    -1  
$EndComp
$Comp
L Amplifier_Operational:TL082 U101
U 3 1 62FC0659
P 6150 5650
F 0 "U101" H 6150 6017 50  0000 C CNN
F 1 "TL082" H 6150 5926 50  0000 C CNN
F 2 "Housings_DIP:DIP-8_W7.62mm_LongPads" H 6150 5650 50  0001 C CNN
F 3 "http://www.ti.com/lit/ds/symlink/tl081.pdf" H 6150 5650 50  0001 C CNN
	3    6150 5650
	-1   0    0    -1  
$EndComp
Connection ~ 6000 5650
Wire Wire Line
	6000 5650 6000 5700
Connection ~ 6000 5250
$Comp
L Connector:Screw_Terminal_01x03 J101
U 1 1 630691A7
P 5200 2750
F 0 "J101" H 5280 2792 50  0000 L CNN
F 1 "PWR" H 5280 2701 50  0000 L CNN
F 2 "Connectors_Phoenix:PhoenixContact_MC-G_03x3.81mm_Angled" H 5200 2750 50  0001 C CNN
F 3 "~" H 5200 2750 50  0001 C CNN
	1    5200 2750
	-1   0    0    -1  
$EndComp
Connection ~ 6000 6050
Wire Wire Line
	6150 5650 6000 5650
$Comp
L power:GND #PWR0106
U 1 1 6304AFC0
P 6150 5700
F 0 "#PWR0106" H 6150 5450 50  0001 C CNN
F 1 "GND" H 6155 5527 50  0001 C CNN
F 2 "" H 6150 5700 50  0001 C CNN
F 3 "" H 6150 5700 50  0001 C CNN
	1    6150 5700
	-1   0    0    -1  
$EndComp
Wire Wire Line
	6250 5350 6250 5250
Wire Wire Line
	6250 5950 6250 6050
Wire Wire Line
	6250 6050 6000 6050
Wire Wire Line
	6150 5700 6150 5650
NoConn ~ 9750 4100
NoConn ~ 9750 3700
$Comp
L power:-12V #PWR0103
U 1 1 631E1210
P 5850 3200
F 0 "#PWR0103" H 5850 3300 50  0001 C CNN
F 1 "-12V" H 5800 3250 50  0000 R CNN
F 2 "" H 5850 3200 50  0001 C CNN
F 3 "" H 5850 3200 50  0001 C CNN
	1    5850 3200
	-1   0    0    1   
$EndComp
$Comp
L power:GND #PWR0101
U 1 1 631E45AF
P 5650 2800
F 0 "#PWR0101" H 5650 2550 50  0001 C CNN
F 1 "GND" H 5655 2627 50  0001 C CNN
F 2 "" H 5650 2800 50  0001 C CNN
F 3 "" H 5650 2800 50  0001 C CNN
	1    5650 2800
	1    0    0    -1  
$EndComp
Wire Wire Line
	5400 2650 5450 2650
Wire Wire Line
	5650 2750 5650 2800
Wire Wire Line
	9250 3400 9700 3400
$Comp
L Device:D D101
U 1 1 63238822
P 5850 2550
F 0 "D101" V 5850 2500 50  0000 R CNN
F 1 "1N4001" V 5900 2500 50  0000 R TNN
F 2 "Diodes_ThroughHole:D_DO-41_SOD81_P7.62mm_Horizontal" H 5850 2550 50  0001 C CNN
F 3 "~" H 5850 2550 50  0001 C CNN
	1    5850 2550
	0    -1   1    0   
$EndComp
$Comp
L Device:D D102
U 1 1 6323C0C4
P 5850 2950
F 0 "D102" V 5850 2900 50  0000 R CNN
F 1 "1N4001" V 5900 2900 50  0000 R TNN
F 2 "Diodes_ThroughHole:D_DO-41_SOD81_P7.62mm_Horizontal" H 5850 2950 50  0001 C CNN
F 3 "~" H 5850 2950 50  0001 C CNN
	1    5850 2950
	0    -1   1    0   
$EndComp
Wire Wire Line
	5850 2700 5850 2750
Wire Wire Line
	5850 2300 5850 2350
$Comp
L Device:Polyfuse F101
U 1 1 6326128C
P 5650 2350
F 0 "F101" V 5500 2350 50  0000 C BNN
F 1 "PFRA.110" V 5550 2350 50  0000 C CNN
F 2 "Fuse_Holders_and_Fuses:Fuse_TE5_Littlefuse-395Series" H 5700 2150 50  0001 L CNN
F 3 "~" H 5650 2350 50  0001 C CNN
	1    5650 2350
	0    1    1    0   
$EndComp
Wire Wire Line
	5850 3100 5850 3150
$Comp
L Device:Polyfuse F102
U 1 1 63261A1C
P 5650 3150
F 0 "F102" V 5750 3150 50  0000 C CNN
F 1 "PFRA.110" V 5800 3150 50  0000 C TNN
F 2 "Fuse_Holders_and_Fuses:Fuse_TE5_Littlefuse-395Series" H 5700 2950 50  0001 L CNN
F 3 "~" H 5650 3150 50  0001 C CNN
	1    5650 3150
	0    1    1    0   
$EndComp
Wire Wire Line
	5800 2350 5850 2350
Connection ~ 5850 2350
Wire Wire Line
	5850 2350 5850 2400
Wire Wire Line
	5800 3150 5850 3150
Connection ~ 5850 3150
Wire Wire Line
	5850 3150 5850 3200
Wire Wire Line
	5500 2350 5450 2350
Wire Wire Line
	5450 2350 5450 2650
Wire Wire Line
	5650 2750 5850 2750
Connection ~ 5850 2750
Wire Wire Line
	5850 2750 5850 2800
Wire Wire Line
	5500 3150 5450 3150
$Comp
L Device:LED D104
U 1 1 6234F49D
P 9900 2350
F 0 "D104" V 9939 2232 50  0000 R CNN
F 1 "LED" V 9848 2232 50  0000 R CNN
F 2 "LEDs:LED_D3.0mm" H 9900 2350 50  0001 C CNN
F 3 "~" H 9900 2350 50  0001 C CNN
	1    9900 2350
	0    -1   -1   0   
$EndComp
Wire Wire Line
	9900 2500 9900 2550
$Comp
L Mechanical:Housing N101
U 1 1 62438DA8
P 5250 5650
F 0 "N101" H 5403 5684 50  0000 L CNN
F 1 "Housing" H 5403 5593 50  0000 L CNN
F 2 "ProjectFootprints:Eurorack" H 5300 5700 50  0001 C CNN
F 3 "~" H 5300 5700 50  0001 C CNN
	1    5250 5650
	1    0    0    -1  
$EndComp
$Comp
L Mechanical:Heatsink HS101
U 1 1 62394CD0
P 5150 5200
F 0 "HS101" H 5292 5321 50  0000 L CNN
F 1 "Heatsink" H 5292 5230 50  0000 L CNN
F 2 "ProjectFootprints:Heatsink_Custom_39x41mm_Dual" H 5162 5200 50  0001 C CNN
F 3 "~" H 5162 5200 50  0001 C CNN
	1    5150 5200
	1    0    0    -1  
$EndComp
$Comp
L Mechanical:Heatsink HS102
U 1 1 624494B5
P 5150 5400
F 0 "HS102" H 5292 5521 50  0000 L CNN
F 1 "Heatsink" H 5292 5430 50  0000 L CNN
F 2 "ProjectFootprints:Heatsink_Custom_39x41mm_Dual" H 5162 5400 50  0001 C CNN
F 3 "~" H 5162 5400 50  0001 C CNN
	1    5150 5400
	1    0    0    -1  
$EndComp
$Comp
L Amplifier_Operational:TL082 U101
U 2 1 625266D5
P 7650 5550
F 0 "U101" H 7750 5800 50  0000 C CNN
F 1 "TL082" H 7750 5700 50  0000 C CNN
F 2 "Housings_DIP:DIP-8_W7.62mm_LongPads" H 7650 5550 50  0001 C CNN
F 3 "http://www.ti.com/lit/ds/symlink/tl081.pdf" H 7650 5550 50  0001 C CNN
	2    7650 5550
	1    0    0    -1  
$EndComp
$Comp
L Connector:Conn_Coaxial J102
U 1 1 62526794
P 5000 3750
F 0 "J102" H 5000 3950 50  0000 C CNN
F 1 "RCA" H 5000 3850 50  0000 C BNN
F 2 "" H 5000 3750 50  0001 C CNN
F 3 " ~" H 5000 3750 50  0001 C CNN
	1    5000 3750
	-1   0    0    -1  
$EndComp
$Comp
L Connector_Generic:Conn_01x06 J104
U 1 1 625CC960
P 6050 4150
F 0 "J104" H 6130 4142 50  0000 L CNN
F 1 "Conn_01x06" H 6130 4051 50  0000 L CNN
F 2 "" H 6050 4150 50  0001 C CNN
F 3 "~" H 6050 4150 50  0001 C CNN
	1    6050 4150
	1    0    0    -1  
$EndComp
Wire Wire Line
	4700 6400 4750 6400
Wire Wire Line
	5200 3750 5250 3750
Wire Wire Line
	5400 3900 5400 3950
Wire Wire Line
	5400 3950 5450 3950
$Comp
L Device:R R102
U 1 1 62699F56
P 5600 4450
F 0 "R102" V 5500 4450 50  0000 C CNN
F 1 "12k" V 5450 4450 50  0000 C BNN
F 2 "" V 5530 4450 50  0001 C CNN
F 3 "~" H 5600 4450 50  0001 C CNN
	1    5600 4450
	0    1    -1   0   
$EndComp
$Comp
L Connector:Conn_Coaxial J103
U 1 1 62699F5C
P 5000 4650
F 0 "J103" H 5000 4750 50  0000 C BNN
F 1 "RCA" H 5000 4850 50  0000 C CNN
F 2 "" H 5000 4650 50  0001 C CNN
F 3 " ~" H 5000 4650 50  0001 C CNN
	1    5000 4650
	-1   0    0    1   
$EndComp
Wire Wire Line
	5200 4650 5250 4650
Wire Wire Line
	5400 4500 5400 4450
Wire Wire Line
	5400 4450 5450 4450
$Comp
L Device:R_POT_Dual_Separate RV101
U 2 1 62699F4F
P 5400 4650
F 0 "RV101" V 5350 4650 50  0000 C BNN
F 1 "100k" V 5250 4650 50  0000 C CNN
F 2 "" H 5400 4650 50  0001 C CNN
F 3 "~" H 5400 4650 50  0001 C CNN
	2    5400 4650
	0    1    -1   0   
$EndComp
Wire Wire Line
	5400 3950 5400 4050
Connection ~ 5400 3950
Wire Wire Line
	5000 3950 5000 4150
Wire Wire Line
	5400 4450 5400 4350
Connection ~ 5400 4450
Wire Wire Line
	5000 4450 5000 4250
Wire Wire Line
	5750 3950 5800 3950
Wire Wire Line
	5800 3950 5800 3750
Connection ~ 5800 3950
Wire Wire Line
	5800 3950 5850 3950
Wire Wire Line
	5550 3750 5800 3750
Wire Wire Line
	5800 4650 5800 4450
Wire Wire Line
	5800 4450 5850 4450
Wire Wire Line
	5550 4650 5800 4650
Wire Wire Line
	5800 4450 5750 4450
Connection ~ 5800 4450
Wire Wire Line
	5400 4350 5850 4350
Wire Wire Line
	5400 4050 5850 4050
Wire Wire Line
	5000 4150 5850 4150
Wire Wire Line
	5000 4250 5850 4250
$Comp
L Connector_Generic:Conn_01x06 J105
U 1 1 627E0663
P 6200 4150
F 0 "J105" H 6118 4567 50  0000 C CNN
F 1 "Conn_01x06" H 6118 4476 50  0000 C CNN
F 2 "Connectors_JST:JST_EH_B06B-EH-A_06x2.50mm_Straight" H 6200 4150 50  0001 C CNN
F 3 "~" H 6200 4150 50  0001 C CNN
	1    6200 4150
	-1   0    0    -1  
$EndComp
Wire Wire Line
	6400 4350 6450 4350
Wire Wire Line
	6450 4350 6450 5450
Wire Wire Line
	6400 3950 6550 3950
Wire Wire Line
	6550 3950 6550 4150
Wire Wire Line
	6550 4150 6400 4150
Wire Wire Line
	6550 4150 6550 4250
Wire Wire Line
	6550 4250 6400 4250
Connection ~ 6550 4150
Wire Wire Line
	6550 4250 6550 4450
Wire Wire Line
	6550 4450 6400 4450
Connection ~ 6550 4250
$Comp
L power:GND #PWR0107
U 1 1 62837454
P 6550 4500
F 0 "#PWR0107" H 6550 4250 50  0001 C CNN
F 1 "GND" H 6555 4327 50  0001 C CNN
F 2 "" H 6550 4500 50  0001 C CNN
F 3 "" H 6550 4500 50  0001 C CNN
	1    6550 4500
	1    0    0    -1  
$EndComp
Wire Wire Line
	6550 4450 6550 4500
Connection ~ 6550 4450
Wire Wire Line
	6450 4050 6400 4050
Wire Wire Line
	6450 3200 6450 4050
Wire Wire Line
	6450 3200 6500 3200
Wire Wire Line
	6450 5450 6500 5450
$Comp
L power:GND #PWR0109
U 1 1 629438CF
P 6850 5850
F 0 "#PWR0109" H 6850 5600 50  0001 C CNN
F 1 "GND" H 6855 5677 50  0001 C CNN
F 2 "" H 6850 5850 50  0001 C CNN
F 3 "" H 6850 5850 50  0001 C CNN
	1    6850 5850
	1    0    0    -1  
$EndComp
$Comp
L power:+12V #PWR0102
U 1 1 631DE57D
P 5850 2300
F 0 "#PWR0102" H 5850 2150 50  0001 C CNN
F 1 "+12V" H 5900 2350 50  0000 L CNN
F 2 "" H 5850 2300 50  0001 C CNN
F 3 "" H 5850 2300 50  0001 C CNN
	1    5850 2300
	1    0    0    -1  
$EndComp
Wire Wire Line
	6000 6100 6000 6050
Wire Wire Line
	6000 5200 6000 5250
$Comp
L power:-12V #PWR0105
U 1 1 63049350
P 6000 6100
F 0 "#PWR0105" H 6000 6200 50  0001 C CNN
F 1 "-12V" H 6015 6273 50  0000 C CNN
F 2 "" H 6000 6100 50  0001 C CNN
F 3 "" H 6000 6100 50  0001 C CNN
	1    6000 6100
	1    0    0    1   
$EndComp
$Comp
L power:+12V #PWR0104
U 1 1 63029F51
P 6000 5200
F 0 "#PWR0104" H 6000 5050 50  0001 C CNN
F 1 "+12V" H 6015 5373 50  0000 C CNN
F 2 "" H 6000 5200 50  0001 C CNN
F 3 "" H 6000 5200 50  0001 C CNN
	1    6000 5200
	-1   0    0    -1  
$EndComp
Wire Wire Line
	5400 2750 5650 2750
Connection ~ 5650 2750
Wire Wire Line
	5450 3150 5450 2850
Wire Wire Line
	5450 2850 5400 2850
$Comp
L power:GND #PWR0127
U 1 1 623FCF73
P 7850 4550
F 0 "#PWR0127" H 7850 4300 50  0001 C CNN
F 1 "GND" H 7855 4377 50  0001 C CNN
F 2 "" H 7850 4550 50  0001 C CNN
F 3 "" H 7850 4550 50  0001 C CNN
	1    7850 4550
	1    0    0    -1  
$EndComp
Wire Wire Line
	7800 4500 7850 4500
Wire Wire Line
	7850 4500 7850 4550
Wire Wire Line
	9650 6050 9550 6050
$Comp
L Mechanical:MountingHole H1
U 1 1 623508A7
P 5100 6000
F 0 "H1" H 5200 6046 50  0000 L CNN
F 1 "MountingHole" H 5200 5955 50  0000 L CNN
F 2 "Mounting_Holes:MountingHole_3.2mm_M3_DIN965" H 5100 6000 50  0001 C CNN
F 3 "~" H 5100 6000 50  0001 C CNN
	1    5100 6000
	1    0    0    -1  
$EndComp
$Comp
L Mechanical:MountingHole H2
U 1 1 62351D5F
P 5100 6250
F 0 "H2" H 5200 6296 50  0000 L CNN
F 1 "MountingHole" H 5200 6205 50  0000 L CNN
F 2 "Mounting_Holes:MountingHole_3.2mm_M3_DIN965" H 5100 6250 50  0001 C CNN
F 3 "~" H 5100 6250 50  0001 C CNN
	1    5100 6250
	1    0    0    -1  
$EndComp
Wire Wire Line
	10550 4450 9450 4450
$Comp
L Device:R R121
U 1 1 627F80E4
P 9450 4100
F 0 "R121" H 9400 4150 50  0000 R CNN
F 1 "6.8k" H 9400 4100 50  0000 R TNN
F 2 "Resistors_ThroughHole:R_Axial_DIN0207_L6.3mm_D2.5mm_P10.16mm_Horizontal" V 9380 4100 50  0001 C CNN
F 3 "~" H 9450 4100 50  0001 C CNN
	1    9450 4100
	1    0    0    -1  
$EndComp
Wire Wire Line
	9550 4300 9550 4650
Wire Wire Line
	8900 4750 8900 5550
$Comp
L Device:R R119
U 1 1 622F19C7
P 10050 4650
F 0 "R119" V 10200 4650 50  0000 C CNN
F 1 "6.8k" V 10100 4650 50  0000 C TNN
F 2 "Resistors_ThroughHole:R_Axial_DIN0207_L6.3mm_D2.5mm_P10.16mm_Horizontal" V 9980 4650 50  0001 C CNN
F 3 "~" H 10050 4650 50  0001 C CNN
	1    10050 4650
	0    -1   -1   0   
$EndComp
Wire Wire Line
	9550 4650 9900 4650
Connection ~ 9550 4650
Wire Wire Line
	10200 4650 10450 4650
Connection ~ 10450 4650
Wire Wire Line
	10450 4650 10450 4200
Wire Wire Line
	9100 4100 9100 5000
$Comp
L ProjectSymbols:AudioJack_Numbered J106
U 1 1 6253EC17
P 10200 6050
F 0 "J106" H 9921 5983 50  0000 R CNN
F 1 "AudioJack3" H 9921 6074 50  0000 R CNN
F 2 "Connectors_JST:JST_EH_B03B-EH-A_03x2.50mm_Straight" H 10200 6050 50  0001 C CNN
F 3 "~" H 10200 6050 50  0001 C CNN
	1    10200 6050
	-1   0    0    1   
$EndComp
Wire Wire Line
	9950 6050 10000 6050
Wire Wire Line
	9950 5950 10000 5950
Wire Wire Line
	9000 5500 9000 6350
Wire Wire Line
	9450 5950 9650 5950
$Comp
L Device:CP C1
U 1 1 624CF999
P 7700 2900
F 0 "C1" V 7445 2900 50  0000 C CNN
F 1 "10µF" V 7536 2900 50  0000 C CNN
F 2 "Capacitors_ThroughHole:CP_Radial_D5.0mm_P2.00mm" H 7738 2750 50  0001 C CNN
F 3 "~" H 7700 2900 50  0001 C CNN
	1    7700 2900
	0    1    1    0   
$EndComp
$Comp
L Device:CP C3
U 1 1 624E32D0
P 7900 2700
F 0 "C3" H 7850 2600 50  0000 C CNN
F 1 "10µF" H 7800 2850 50  0000 C CNN
F 2 "Capacitors_ThroughHole:CP_Radial_D5.0mm_P2.00mm" H 7938 2550 50  0001 C CNN
F 3 "~" H 7900 2700 50  0001 C CNN
	1    7900 2700
	-1   0    0    1   
$EndComp
$Comp
L power:GND #PWR0110
U 1 1 62562023
P 7500 2950
F 0 "#PWR0110" H 7500 2700 50  0001 C CNN
F 1 "GND" H 7505 2777 50  0001 C CNN
F 2 "" H 7500 2950 50  0001 C CNN
F 3 "" H 7500 2950 50  0001 C CNN
	1    7500 2950
	1    0    0    -1  
$EndComp
Wire Wire Line
	7500 2550 7500 2500
Connection ~ 7500 2500
Wire Wire Line
	7900 2550 7900 2500
Connection ~ 7900 2500
Wire Wire Line
	7900 2500 7500 2500
Wire Wire Line
	7950 2500 7900 2500
Wire Wire Line
	7500 2850 7500 2900
Wire Wire Line
	7500 2900 7550 2900
Wire Wire Line
	7450 2900 7500 2900
Connection ~ 7500 2900
Wire Wire Line
	7500 2950 7500 2900
Wire Wire Line
	7250 2600 7250 2500
Wire Wire Line
	7250 2500 7500 2500
$Comp
L power:GND #PWR0128
U 1 1 627DBEC7
P 7850 2300
F 0 "#PWR0128" H 7850 2050 50  0001 C CNN
F 1 "GND" H 7855 2127 50  0001 C CNN
F 2 "" H 7850 2300 50  0001 C CNN
F 3 "" H 7850 2300 50  0001 C CNN
	1    7850 2300
	1    0    0    -1  
$EndComp
Wire Wire Line
	7850 2900 7900 2900
Wire Wire Line
	7900 2900 7900 2850
Wire Wire Line
	7500 2450 7500 2500
Wire Wire Line
	7800 2250 7850 2250
Wire Wire Line
	7850 2250 7850 2300
Wire Wire Line
	7000 2000 7500 2000
Wire Wire Line
	7500 2000 7500 2050
Wire Wire Line
	8250 2500 8900 2500
Connection ~ 7500 2000
Wire Wire Line
	7500 2000 8900 2000
Wire Wire Line
	7500 4750 7500 4700
$Comp
L Device:CP C4
U 1 1 62E10F7F
P 7900 4950
F 0 "C4" H 7850 4850 50  0000 C CNN
F 1 "10µF" H 7800 5100 50  0000 C CNN
F 2 "Capacitors_ThroughHole:CP_Radial_D5.0mm_P2.00mm" H 7938 4800 50  0001 C CNN
F 3 "~" H 7900 4950 50  0001 C CNN
	1    7900 4950
	-1   0    0    1   
$EndComp
$Comp
L Device:CP C2
U 1 1 62E14717
P 7700 5150
F 0 "C2" V 7950 5150 50  0000 C CNN
F 1 "10µF" V 7850 5150 50  0000 C CNN
F 2 "Capacitors_ThroughHole:CP_Radial_D5.0mm_P2.00mm" H 7738 5000 50  0001 C CNN
F 3 "~" H 7700 5150 50  0001 C CNN
	1    7700 5150
	0    -1   -1   0   
$EndComp
Wire Wire Line
	7850 5150 7900 5150
Wire Wire Line
	7900 5150 7900 5100
Wire Wire Line
	8200 3550 8050 3550
Wire Wire Line
	8050 3050 8200 3050
Wire Wire Line
	8050 3550 8050 3300
Connection ~ 8050 3300
Wire Wire Line
	7950 3300 8050 3300
Wire Wire Line
	8050 3050 8050 3300
Wire Wire Line
	8050 3300 8150 3300
$Comp
L power:GND #PWR0117
U 1 1 625266EF
P 8100 6100
F 0 "#PWR0117" H 8100 5850 50  0001 C CNN
F 1 "GND" H 8105 5927 50  0001 C CNN
F 2 "" H 8100 6100 50  0001 C CNN
F 3 "" H 8100 6100 50  0001 C CNN
	1    8100 6100
	1    0    0    -1  
$EndComp
Wire Wire Line
	8100 6050 8100 6100
Wire Wire Line
	8150 6050 8100 6050
Wire Wire Line
	8200 5800 8050 5800
Wire Wire Line
	8050 5300 8200 5300
Wire Wire Line
	8050 5800 8050 5550
Connection ~ 8050 5550
Wire Wire Line
	7950 5550 8050 5550
Wire Wire Line
	8050 5300 8050 5550
Wire Wire Line
	8050 5550 8150 5550
$Comp
L Device:R R118
U 1 1 62A46C10
P 9800 6050
F 0 "R118" V 9850 6050 50  0000 C TNN
F 1 "150" V 9950 6050 50  0000 C CNN
F 2 "Resistors_ThroughHole:R_Axial_DIN0207_L6.3mm_D2.5mm_P10.16mm_Horizontal" V 9730 6050 50  0001 C CNN
F 3 "~" H 9800 6050 50  0001 C CNN
	1    9800 6050
	0    -1   1    0   
$EndComp
Wire Wire Line
	9000 5500 9700 5500
Wire Wire Line
	9100 5000 9700 5000
Wire Wire Line
	9550 4650 9550 5400
Wire Wire Line
	9450 4450 9450 4900
Wire Wire Line
	9700 5400 9550 5400
Connection ~ 9550 5400
Wire Wire Line
	9550 5400 9550 6050
Wire Wire Line
	9700 4900 9450 4900
Connection ~ 9450 4900
Wire Wire Line
	9450 4900 9450 5950
$EndSCHEMATC
