EESchema Schematic File Version 4
LIBS:usb-hid-display-cache
EELAYER 26 0
EELAYER END
$Descr A4 11693 8268
encoding utf-8
Sheet 1 1
Title ""
Date ""
Rev ""
Comp ""
Comment1 ""
Comment2 ""
Comment3 ""
Comment4 ""
$EndDescr
$Comp
L Connector:USB_B_Micro J1
U 1 1 60239838
P 6700 5350
F 0 "J1" H 6700 5750 50  0000 C CNN
F 1 "USB_B_Micro" H 6700 5700 50  0000 C CNN
F 2 "Connect:USB_Micro-B" H 6850 5300 50  0001 C CNN
F 3 "~" H 6850 5300 50  0001 C CNN
	1    6700 5350
	1    0    0    -1  
$EndComp
NoConn ~ 7000 5550
$Comp
L ProjectSymbols:CH552G U3
U 1 1 602211E1
P 9400 4950
F 0 "U3" H 9400 5450 50  0000 C CNN
F 1 "CH552G" H 9400 5050 50  0000 C CNN
F 2 "Housings_SOIC:SOIC-16_3.9x9.9mm_Pitch1.27mm" H 9400 4950 50  0001 C CNN
F 3 "" H 9400 4950 50  0001 C CNN
	1    9400 4950
	1    0    0    -1  
$EndComp
$Comp
L Device:C C2
U 1 1 60226F43
P 8200 4800
F 0 "C2" H 8150 4650 50  0000 R CNN
F 1 "1uF" H 8200 4700 50  0000 R BNN
F 2 "Capacitors_SMD:C_0603" H 8238 4650 50  0001 C CNN
F 3 "~" H 8200 4800 50  0001 C CNN
	1    8200 4800
	1    0    0    1   
$EndComp
$Comp
L power:GND #PWR02
U 1 1 602270CE
P 8200 5000
F 0 "#PWR02" H 8200 4750 50  0001 C CNN
F 1 "GND" H 8205 4827 50  0001 C CNN
F 2 "" H 8200 5000 50  0001 C CNN
F 3 "" H 8200 5000 50  0001 C CNN
	1    8200 5000
	1    0    0    -1  
$EndComp
Wire Wire Line
	8200 4950 8200 5000
Wire Wire Line
	8200 4550 8200 4650
$Comp
L power:GND #PWR04
U 1 1 60230913
P 8600 5100
F 0 "#PWR04" H 8600 4850 50  0001 C CNN
F 1 "GND" H 8605 4927 50  0001 C CNN
F 2 "" H 8600 5100 50  0001 C CNN
F 3 "" H 8600 5100 50  0001 C CNN
	1    8600 5100
	1    0    0    -1  
$EndComp
$Comp
L Device:C C4
U 1 1 6023E0B4
P 8600 4850
F 0 "C4" H 8600 4450 50  0000 C CNN
F 1 "100nF" H 8600 4550 50  0000 C TNN
F 2 "Capacitors_SMD:C_0603" H 8638 4700 50  0001 C CNN
F 3 "~" H 8600 4850 50  0001 C CNN
	1    8600 4850
	-1   0    0    1   
$EndComp
Wire Wire Line
	8600 4650 8600 4700
Wire Wire Line
	8600 4650 8800 4650
$Comp
L Device:R R1
U 1 1 6024B934
P 8400 4850
F 0 "R1" H 8400 4450 50  0000 C CNN
F 1 "10k" H 8400 4550 50  0000 C TNN
F 2 "Resistors_SMD:R_0603" V 8330 4850 50  0001 C CNN
F 3 "~" H 8400 4850 50  0001 C CNN
	1    8400 4850
	-1   0    0    1   
$EndComp
Wire Wire Line
	8600 4650 8400 4650
Wire Wire Line
	8400 4650 8400 4700
Connection ~ 8600 4650
$Comp
L Device:Jumper_NC_Small JP1
U 1 1 6024F083
P 8400 5150
F 0 "JP1" V 8350 5100 50  0000 R CNN
F 1 "BOOT" V 8450 5100 50  0000 R CNN
F 2 "Resistors_ThroughHole:R_Axial_DIN0204_L3.6mm_D1.6mm_P5.08mm_Vertical" H 8400 5150 50  0001 C CNN
F 3 "~" H 8400 5150 50  0001 C CNN
	1    8400 5150
	0    1    1    0   
$EndComp
Wire Wire Line
	8800 5050 8600 5050
Wire Wire Line
	8600 5050 8600 5100
Wire Wire Line
	8600 5050 8600 5000
Connection ~ 8600 5050
Wire Wire Line
	8800 5350 8400 5350
Wire Wire Line
	8400 5350 8400 5250
Wire Wire Line
	8400 5000 8400 5050
Text GLabel 7050 4550 0    50   Input ~ 0
VSYS_5V
Connection ~ 8200 4550
Connection ~ 8400 5350
Wire Wire Line
	7000 5350 7350 5350
Wire Wire Line
	7000 5450 7350 5450
$Comp
L Device:C C1
U 1 1 60F295A8
P 7750 4800
F 0 "C1" H 7700 4650 50  0000 R CNN
F 1 "100nF" H 7700 4900 50  0000 R CNN
F 2 "Capacitors_SMD:C_0603" H 7788 4650 50  0001 C CNN
F 3 "~" H 7750 4800 50  0001 C CNN
	1    7750 4800
	-1   0    0    1   
$EndComp
Wire Wire Line
	8750 4750 8800 4750
$Comp
L Switch:SW_Push SW1
U 1 1 610F78F0
P 7500 4800
F 0 "SW1" V 7350 4850 50  0000 L CNN
F 1 "RESET" V 7500 4600 50  0000 L CNN
F 2 "Resistors_ThroughHole:R_Axial_DIN0204_L3.6mm_D1.6mm_P5.08mm_Vertical" H 7500 5000 50  0001 C CNN
F 3 "" H 7500 5000 50  0001 C CNN
	1    7500 4800
	0    1    1    0   
$EndComp
$Comp
L power:GND #PWR01
U 1 1 60344569
P 7300 6150
F 0 "#PWR01" H 7300 5900 50  0001 C CNN
F 1 "GND" H 7305 5977 50  0001 C CNN
F 2 "" H 7300 6150 50  0001 C CNN
F 3 "" H 7300 6150 50  0001 C CNN
	1    7300 6150
	1    0    0    -1  
$EndComp
$Comp
L Connector:Conn_01x14_Male J2
U 1 1 6133AA0E
P 10400 6400
F 0 "J2" V 10328 6327 50  0000 C CNN
F 1 "LCD EH1602" V 10237 6327 50  0000 C CNN
F 2 "Pin_Headers:Pin_Header_Straight_1x14_Pitch2.54mm" H 10400 6400 50  0001 C CNN
F 3 "~" H 10400 6400 50  0001 C CNN
	1    10400 6400
	0    -1   -1   0   
$EndComp
Text Label 10000 4950 0    50   ~ 0
DB7
Text Label 10000 4850 0    50   ~ 0
DB6
Text Label 10000 4750 0    50   ~ 0
DB5
Text Label 10000 4650 0    50   ~ 0
DB4
Text Label 11100 6150 1    50   ~ 0
DB7
Text Label 11000 6150 1    50   ~ 0
DB6
Text Label 10900 6150 1    50   ~ 0
DB5
Text Label 10800 6150 1    50   ~ 0
DB4
Text Label 10300 6150 1    50   ~ 0
E
Text Label 10200 6150 1    50   ~ 0
R~W~
Text Label 10100 6150 1    50   ~ 0
RS
$Comp
L power:GND #PWR05
U 1 1 613454DA
P 9500 6200
F 0 "#PWR05" H 9500 5950 50  0001 C CNN
F 1 "GND" H 9505 6027 50  0001 C CNN
F 2 "" H 9500 6200 50  0001 C CNN
F 3 "" H 9500 6200 50  0001 C CNN
	1    9500 6200
	1    0    0    -1  
$EndComp
Wire Wire Line
	9800 6150 9800 6200
Text Label 10000 5050 0    50   ~ 0
E
Text Label 10000 5250 0    50   ~ 0
R~W~
Text Label 10000 5350 0    50   ~ 0
RS
Wire Wire Line
	10300 6200 10300 5050
Wire Wire Line
	11100 4950 11100 6200
Wire Wire Line
	11000 4850 11000 6200
Wire Wire Line
	10900 4750 10900 6200
Wire Wire Line
	10800 4650 10800 6200
Wire Wire Line
	8200 4550 8800 4550
$Comp
L Device:Q_PNP_BEC Q1
U 1 1 6136A58D
P 9050 5850
F 0 "Q1" V 8750 5850 50  0000 C CNN
F 1 "Q_PNP_BEC" V 8650 5850 50  0000 C CNN
F 2 "TO_SOT_Packages_SMD:SOT-23" H 9250 5950 50  0001 C CNN
F 3 "~" H 9050 5850 50  0001 C CNN
	1    9050 5850
	0    1    -1   0   
$EndComp
$Comp
L Device:R R2
U 1 1 6136A91E
P 9650 5650
F 0 "R2" H 9650 5250 50  0000 C CNN
F 1 "2.2k" H 9650 5350 50  0000 C TNN
F 2 "Resistors_SMD:R_0603" V 9580 5650 50  0001 C CNN
F 3 "~" H 9650 5650 50  0001 C CNN
	1    9650 5650
	0    1    1    0   
$EndComp
$Comp
L Device:C C5
U 1 1 61372ABC
P 9700 6000
F 0 "C5" H 9700 5950 50  0000 L TNN
F 1 "100nF" H 9700 5850 50  0000 L CNN
F 2 "Capacitors_SMD:C_0603" H 9738 5850 50  0001 C CNN
F 3 "~" H 9700 6000 50  0001 C CNN
	1    9700 6000
	0    -1   -1   0   
$EndComp
Wire Wire Line
	8000 5500 8550 5500
Wire Wire Line
	9900 6000 9850 6000
Wire Wire Line
	9550 6000 9500 6000
Wire Wire Line
	9500 6000 9500 6150
Wire Wire Line
	9500 6200 9500 6150
Connection ~ 9500 6150
Wire Wire Line
	9500 6150 9800 6150
Wire Wire Line
	9900 6000 9900 6200
Wire Wire Line
	9900 5750 9900 6000
Connection ~ 9900 6000
Wire Wire Line
	9050 6050 9050 6100
Wire Wire Line
	9050 6100 9350 6100
Wire Wire Line
	9350 6100 9350 5650
Wire Wire Line
	9350 5650 9500 5650
Wire Wire Line
	7950 5350 8400 5350
Wire Wire Line
	7950 5450 8800 5450
Wire Wire Line
	7750 4650 7750 4550
Connection ~ 7750 4550
Wire Wire Line
	7750 4550 7500 4550
Wire Wire Line
	7500 4600 7500 4550
Connection ~ 7500 4550
Wire Wire Line
	7750 4950 7750 5050
Wire Wire Line
	7750 5050 7500 5050
Wire Wire Line
	7500 5050 7500 5000
Wire Wire Line
	8100 5050 8100 5300
Wire Wire Line
	8100 5300 8750 5300
Wire Wire Line
	8750 5300 8750 4750
NoConn ~ 10000 6200
NoConn ~ 10400 6200
NoConn ~ 10500 6200
NoConn ~ 10600 6200
NoConn ~ 10700 6200
$Comp
L Interface_Optical:TSOP341xx U2
U 1 1 61401A01
P 7900 5950
F 0 "U2" H 7550 5650 50  0000 C CNN
F 1 "TSOP341xx" H 8000 5650 50  0000 C CNN
F 2 "Opto-Devices:IRReceiver_Vishay_MOLD-3pin" H 7850 5575 50  0001 C CNN
F 3 "http://www.vishay.com/docs/82490/tsop321.pdf" H 8550 6250 50  0001 C CNN
	1    7900 5950
	1    0    0    -1  
$EndComp
$Comp
L Device:C C3
U 1 1 61401C13
P 8550 5950
F 0 "C3" H 8550 5900 50  0000 L TNN
F 1 "100nF" H 8550 5800 50  0000 L CNN
F 2 "Capacitors_SMD:C_0603" H 8588 5800 50  0001 C CNN
F 3 "~" H 8550 5950 50  0001 C CNN
	1    8550 5950
	1    0    0    -1  
$EndComp
Wire Wire Line
	8300 5750 8550 5750
Wire Wire Line
	8550 5750 8850 5750
Wire Wire Line
	8300 6150 8550 6150
$Comp
L power:GND #PWR03
U 1 1 614072AB
P 8550 6200
F 0 "#PWR03" H 8550 5950 50  0001 C CNN
F 1 "GND" H 8555 6027 50  0001 C CNN
F 2 "" H 8550 6200 50  0001 C CNN
F 3 "" H 8550 6200 50  0001 C CNN
	1    8550 6200
	1    0    0    -1  
$EndComp
Connection ~ 8550 5750
Wire Wire Line
	8550 5750 8550 5500
Wire Wire Line
	8300 5950 8400 5950
Wire Wire Line
	8400 5550 10400 5550
Wire Wire Line
	10400 5550 10400 4550
Wire Wire Line
	10400 4550 10000 4550
Wire Wire Line
	7300 5550 7350 5550
Wire Wire Line
	7300 5250 7350 5250
$Comp
L ProjectSymbols:USBLC6-2SC6Y U1
U 1 1 607A167E
P 7650 5450
F 0 "U1" H 7450 5800 50  0000 L CNN
F 1 "USBLC6-2SC6Y" H 7750 5250 50  0000 C CNN
F 2 "TO_SOT_Packages_SMD:SOT-23-6" H 7650 5450 50  0001 C CNN
F 3 "" H 7650 5450 50  0001 C CNN
	1    7650 5450
	1    0    0    -1  
$EndComp
Wire Wire Line
	8400 5950 8400 5550
Wire Wire Line
	8550 5750 8550 5800
Wire Wire Line
	8550 6100 8550 6150
Connection ~ 8550 6150
Wire Wire Line
	8550 6150 8550 6200
$Comp
L Device:Ferrite_Bead_Small FB1
U 1 1 612D16A7
P 7150 5150
F 0 "FB1" V 6913 5150 50  0000 C CNN
F 1 "FB" V 7004 5150 50  0000 C CNN
F 2 "Resistors_SMD:R_0805" V 7080 5150 50  0001 C CNN
F 3 "~" H 7150 5150 50  0001 C CNN
	1    7150 5150
	0    1    1    0   
$EndComp
Wire Wire Line
	7050 4550 7300 4550
Connection ~ 7750 5050
Wire Wire Line
	7750 5050 8100 5050
Wire Wire Line
	7300 5250 7300 5150
Wire Wire Line
	7300 5150 7250 5150
Wire Wire Line
	7300 5150 7300 4550
Connection ~ 7300 5150
Connection ~ 7300 4550
Wire Wire Line
	7300 4550 7500 4550
Wire Wire Line
	7000 5150 7050 5150
Wire Wire Line
	7300 5550 7300 5800
Wire Wire Line
	6700 5750 6700 5800
Wire Wire Line
	6700 5800 7050 5800
Wire Wire Line
	6600 5900 7300 5900
Wire Wire Line
	6600 5750 6600 5900
Connection ~ 7300 5900
Wire Wire Line
	7300 5900 7300 6150
Wire Wire Line
	7250 5800 7300 5800
Connection ~ 7300 5800
Wire Wire Line
	7300 5800 7300 5900
$Comp
L Device:Ferrite_Bead_Small FB2
U 1 1 6130CD01
P 7150 5800
F 0 "FB2" V 6913 5800 50  0000 C CNN
F 1 "FB" V 7004 5800 50  0000 C CNN
F 2 "Resistors_SMD:R_0805" V 7080 5800 50  0001 C CNN
F 3 "~" H 7150 5800 50  0001 C CNN
	1    7150 5800
	0    1    1    0   
$EndComp
Wire Wire Line
	7300 5150 8000 5150
Wire Wire Line
	8000 5150 8000 5500
Wire Wire Line
	7750 4550 8200 4550
Wire Wire Line
	10200 5250 10200 6200
Wire Wire Line
	10100 5350 10100 6200
Wire Wire Line
	10000 5450 10050 5450
Wire Wire Line
	10050 5450 10050 5650
Wire Wire Line
	10050 5650 9800 5650
Wire Wire Line
	10000 5350 10100 5350
Wire Wire Line
	10000 5250 10200 5250
Wire Wire Line
	10000 5050 10300 5050
Wire Wire Line
	10000 4650 10800 4650
Wire Wire Line
	10000 4750 10900 4750
Wire Wire Line
	10000 4850 11000 4850
Wire Wire Line
	10000 4950 11100 4950
Wire Wire Line
	9250 5750 9900 5750
NoConn ~ 10000 5150
$EndSCHEMATC
