(export (version D)
  (design
    (source /home/andi/Projekte/Elektronik/usb-hid-display/hardware/usb-hid-display.sch)
    (date "So 29 Aug 2021 19:22:08 CEST")
    (tool "Eeschema 5.0.2+dfsg1-1")
    (sheet (number 1) (name /) (tstamps /)
      (title_block
        (title)
        (company)
        (rev)
        (date)
        (source usb-hid-display.sch)
        (comment (number 1) (value ""))
        (comment (number 2) (value ""))
        (comment (number 3) (value ""))
        (comment (number 4) (value "")))))
  (components
    (comp (ref J1)
      (value USB_B_Micro)
      (footprint Connect:USB_Micro-B)
      (datasheet ~)
      (libsource (lib Connector) (part USB_B_Micro) (description "USB Micro Type B connector"))
      (sheetpath (names /) (tstamps /))
      (tstamp 60239838))
    (comp (ref U3)
      (value CH552G)
      (footprint Housings_SOIC:SOIC-16_3.9x9.9mm_Pitch1.27mm)
      (libsource (lib ProjectSymbols) (part CH552G) (description ""))
      (sheetpath (names /) (tstamps /))
      (tstamp 602211E1))
    (comp (ref C2)
      (value 1uF)
      (footprint Capacitors_SMD:C_0603)
      (datasheet ~)
      (libsource (lib Device) (part C) (description "Unpolarized capacitor"))
      (sheetpath (names /) (tstamps /))
      (tstamp 60226F43))
    (comp (ref C4)
      (value 100nF)
      (footprint Capacitors_SMD:C_0603)
      (datasheet ~)
      (libsource (lib Device) (part C) (description "Unpolarized capacitor"))
      (sheetpath (names /) (tstamps /))
      (tstamp 6023E0B4))
    (comp (ref R1)
      (value 10k)
      (footprint Resistors_SMD:R_0603)
      (datasheet ~)
      (libsource (lib Device) (part R) (description Resistor))
      (sheetpath (names /) (tstamps /))
      (tstamp 6024B934))
    (comp (ref JP1)
      (value BOOT)
      (footprint Resistors_ThroughHole:R_Axial_DIN0204_L3.6mm_D1.6mm_P5.08mm_Vertical)
      (datasheet ~)
      (libsource (lib Device) (part Jumper_NC_Small) (description "Jumper, normally closed, small symbol"))
      (sheetpath (names /) (tstamps /))
      (tstamp 6024F083))
    (comp (ref C1)
      (value 100nF)
      (footprint Capacitors_SMD:C_0603)
      (datasheet ~)
      (libsource (lib Device) (part C) (description "Unpolarized capacitor"))
      (sheetpath (names /) (tstamps /))
      (tstamp 60F295A8))
    (comp (ref SW1)
      (value RESET)
      (footprint Resistors_ThroughHole:R_Axial_DIN0204_L3.6mm_D1.6mm_P5.08mm_Vertical)
      (libsource (lib Switch) (part SW_Push) (description "Push button switch, generic, two pins"))
      (sheetpath (names /) (tstamps /))
      (tstamp 610F78F0))
    (comp (ref J2)
      (value "LCD EH1602")
      (footprint Pin_Headers:Pin_Header_Straight_1x14_Pitch2.54mm)
      (datasheet ~)
      (libsource (lib Connector) (part Conn_01x14_Male) (description "Generic connector, single row, 01x14, script generated (kicad-library-utils/schlib/autogen/connector/)"))
      (sheetpath (names /) (tstamps /))
      (tstamp 6133AA0E))
    (comp (ref Q1)
      (value Q_PNP_BEC)
      (footprint TO_SOT_Packages_SMD:SOT-23)
      (datasheet ~)
      (libsource (lib Device) (part Q_PNP_BEC) (description "PNP transistor, base/emitter/collector"))
      (sheetpath (names /) (tstamps /))
      (tstamp 6136A58D))
    (comp (ref R2)
      (value 2.2k)
      (footprint Resistors_SMD:R_0603)
      (datasheet ~)
      (libsource (lib Device) (part R) (description Resistor))
      (sheetpath (names /) (tstamps /))
      (tstamp 6136A91E))
    (comp (ref C5)
      (value 100nF)
      (footprint Capacitors_SMD:C_0603)
      (datasheet ~)
      (libsource (lib Device) (part C) (description "Unpolarized capacitor"))
      (sheetpath (names /) (tstamps /))
      (tstamp 61372ABC))
    (comp (ref U2)
      (value TSOP341xx)
      (footprint Opto-Devices:IRReceiver_Vishay_MOLD-3pin)
      (datasheet http://www.vishay.com/docs/82490/tsop321.pdf)
      (libsource (lib Interface_Optical) (part TSOP341xx) (description "IR Receiver Modules for Remote Control Systems"))
      (sheetpath (names /) (tstamps /))
      (tstamp 61401A01))
    (comp (ref C3)
      (value 100nF)
      (footprint Capacitors_SMD:C_0603)
      (datasheet ~)
      (libsource (lib Device) (part C) (description "Unpolarized capacitor"))
      (sheetpath (names /) (tstamps /))
      (tstamp 61401C13))
    (comp (ref U1)
      (value USBLC6-2SC6Y)
      (footprint TO_SOT_Packages_SMD:SOT-23-6)
      (libsource (lib ProjectSymbols) (part USBLC6-2SC6Y) (description ""))
      (sheetpath (names /) (tstamps /))
      (tstamp 607A167E))
    (comp (ref FB1)
      (value FB)
      (footprint Resistors_SMD:R_0805)
      (datasheet ~)
      (libsource (lib Device) (part Ferrite_Bead_Small) (description "Ferrite bead, small symbol"))
      (sheetpath (names /) (tstamps /))
      (tstamp 612D16A7))
    (comp (ref FB2)
      (value FB)
      (footprint Resistors_SMD:R_0805)
      (datasheet ~)
      (libsource (lib Device) (part Ferrite_Bead_Small) (description "Ferrite bead, small symbol"))
      (sheetpath (names /) (tstamps /))
      (tstamp 6130CD01)))
  (libparts
    (libpart (lib Connector) (part Conn_01x14_Male)
      (description "Generic connector, single row, 01x14, script generated (kicad-library-utils/schlib/autogen/connector/)")
      (docs ~)
      (footprints
        (fp Connector*:*_1x??_*))
      (fields
        (field (name Reference) J)
        (field (name Value) Conn_01x14_Male))
      (pins
        (pin (num 1) (name Pin_1) (type passive))
        (pin (num 2) (name Pin_2) (type passive))
        (pin (num 3) (name Pin_3) (type passive))
        (pin (num 4) (name Pin_4) (type passive))
        (pin (num 5) (name Pin_5) (type passive))
        (pin (num 6) (name Pin_6) (type passive))
        (pin (num 7) (name Pin_7) (type passive))
        (pin (num 8) (name Pin_8) (type passive))
        (pin (num 9) (name Pin_9) (type passive))
        (pin (num 10) (name Pin_10) (type passive))
        (pin (num 11) (name Pin_11) (type passive))
        (pin (num 12) (name Pin_12) (type passive))
        (pin (num 13) (name Pin_13) (type passive))
        (pin (num 14) (name Pin_14) (type passive))))
    (libpart (lib Connector) (part USB_B_Micro)
      (aliases
        (alias USB_B_Mini))
      (description "USB Micro Type B connector")
      (docs ~)
      (footprints
        (fp USB*))
      (fields
        (field (name Reference) J)
        (field (name Value) USB_B_Micro))
      (pins
        (pin (num 1) (name VBUS) (type power_out))
        (pin (num 2) (name D-) (type passive))
        (pin (num 3) (name D+) (type passive))
        (pin (num 4) (name ID) (type passive))
        (pin (num 5) (name GND) (type power_out))
        (pin (num 6) (name Shield) (type passive))))
    (libpart (lib Device) (part C)
      (description "Unpolarized capacitor")
      (docs ~)
      (footprints
        (fp C_*))
      (fields
        (field (name Reference) C)
        (field (name Value) C))
      (pins
        (pin (num 1) (name ~) (type passive))
        (pin (num 2) (name ~) (type passive))))
    (libpart (lib Device) (part Ferrite_Bead_Small)
      (description "Ferrite bead, small symbol")
      (docs ~)
      (footprints
        (fp Inductor_*)
        (fp L_*)
        (fp *Ferrite*))
      (fields
        (field (name Reference) FB)
        (field (name Value) Ferrite_Bead_Small))
      (pins
        (pin (num 1) (name ~) (type passive))
        (pin (num 2) (name ~) (type passive))))
    (libpart (lib Device) (part Jumper_NC_Small)
      (description "Jumper, normally closed, small symbol")
      (docs ~)
      (fields
        (field (name Reference) JP)
        (field (name Value) Jumper_NC_Small))
      (pins
        (pin (num 1) (name 1) (type passive))
        (pin (num 2) (name 2) (type passive))))
    (libpart (lib Device) (part Q_PNP_BEC)
      (description "PNP transistor, base/emitter/collector")
      (docs ~)
      (fields
        (field (name Reference) Q)
        (field (name Value) Q_PNP_BEC))
      (pins
        (pin (num 1) (name B) (type input))
        (pin (num 2) (name E) (type passive))
        (pin (num 3) (name C) (type passive))))
    (libpart (lib Device) (part R)
      (description Resistor)
      (docs ~)
      (footprints
        (fp R_*))
      (fields
        (field (name Reference) R)
        (field (name Value) R))
      (pins
        (pin (num 1) (name ~) (type passive))
        (pin (num 2) (name ~) (type passive))))
    (libpart (lib Interface_Optical) (part TSDP341xx)
      (aliases
        (alias TSDP343xx)
        (alias TSOP341xx)
        (alias TSOP343xx)
        (alias TSOP345xx)
        (alias TSOP41xx)
        (alias TSOP43xx)
        (alias TSOP45xx)
        (alias TSOP348xx))
      (description "IR Receiver Modules for Data Transmission")
      (docs http://www.vishay.com/docs/82667/tsdp341.pdf)
      (footprints
        (fp Vishay*MOLD*))
      (fields
        (field (name Reference) U)
        (field (name Value) TSDP341xx)
        (field (name Footprint) OptoDevice:Vishay_MOLD-3Pin))
      (pins
        (pin (num 1) (name OUT) (type output))
        (pin (num 2) (name GND) (type power_in))
        (pin (num 3) (name Vs) (type power_in))))
    (libpart (lib ProjectSymbols) (part CH552G)
      (fields
        (field (name Reference) U)
        (field (name Value) CH552G))
      (pins
        (pin (num 1) (name VBUS1/P3.2) (type passive))
        (pin (num 2) (name P1.4) (type passive))
        (pin (num 3) (name P1.5) (type passive))
        (pin (num 4) (name P1.6) (type passive))
        (pin (num 5) (name P1.7) (type passive))
        (pin (num 6) (name RST) (type passive))
        (pin (num 7) (name TXD/P3.1) (type passive))
        (pin (num 8) (name RXD/P3.0) (type passive))
        (pin (num 9) (name VBUS2/P1.1) (type passive))
        (pin (num 10) (name P3.3) (type passive))
        (pin (num 11) (name P3.4) (type passive))
        (pin (num 12) (name P3.6/UDP) (type BiDi))
        (pin (num 13) (name P3.7/UDM) (type BiDi))
        (pin (num 14) (name GND) (type power_in))
        (pin (num 15) (name VCC) (type power_in))
        (pin (num 16) (name V33) (type BiDi))))
    (libpart (lib ProjectSymbols) (part USBLC6-2SC6Y)
      (fields
        (field (name Reference) U)
        (field (name Value) USBLC6-2SC6Y))
      (pins
        (pin (num 1) (name ~) (type BiDi))
        (pin (num 2) (name GND) (type passive))
        (pin (num 3) (name ~) (type BiDi))
        (pin (num 4) (name I/O2) (type BiDi))
        (pin (num 5) (name VBUS) (type passive))
        (pin (num 6) (name I/O1) (type BiDi))))
    (libpart (lib Switch) (part SW_Push)
      (description "Push button switch, generic, two pins")
      (fields
        (field (name Reference) SW)
        (field (name Value) SW_Push))
      (pins
        (pin (num 1) (name 1) (type passive))
        (pin (num 2) (name 2) (type passive)))))
  (libraries
    (library (logical Connector)
      (uri /usr/share/kicad/library/Connector.lib))
    (library (logical Device)
      (uri /usr/share/kicad/library/Device.lib))
    (library (logical Interface_Optical)
      (uri /usr/share/kicad/library/Interface_Optical.lib))
    (library (logical ProjectSymbols)
      (uri /home/andi/Projekte/Elektronik/usb-hid-display/hardware/ProjectSymbols.lib))
    (library (logical Switch)
      (uri /usr/share/kicad/library/Switch.lib)))
  (nets
    (net (code 1) (name "Net-(J2-Pad3)")
      (node (ref J2) (pin 3)))
    (net (code 2) (name "Net-(J2-Pad7)")
      (node (ref J2) (pin 7)))
    (net (code 3) (name "Net-(J2-Pad8)")
      (node (ref J2) (pin 8)))
    (net (code 4) (name "Net-(J2-Pad9)")
      (node (ref J2) (pin 9)))
    (net (code 5) (name "Net-(J2-Pad10)")
      (node (ref J2) (pin 10)))
    (net (code 6) (name GND)
      (node (ref C5) (pin 1))
      (node (ref C4) (pin 1))
      (node (ref FB2) (pin 1))
      (node (ref U1) (pin 2))
      (node (ref J2) (pin 1))
      (node (ref J1) (pin 6))
      (node (ref U2) (pin 2))
      (node (ref C2) (pin 1))
      (node (ref C3) (pin 2))
      (node (ref U3) (pin 14)))
    (net (code 7) (name "Net-(U2-Pad1)")
      (node (ref U3) (pin 9))
      (node (ref U2) (pin 1)))
    (net (code 8) (name "Net-(Q1-Pad1)")
      (node (ref R2) (pin 2))
      (node (ref Q1) (pin 1)))
    (net (code 9) (name "Net-(C5-Pad2)")
      (node (ref Q1) (pin 3))
      (node (ref C5) (pin 2))
      (node (ref J2) (pin 2)))
    (net (code 10) (name "Net-(U1-Pad3)")
      (node (ref U3) (pin 13))
      (node (ref U1) (pin 3)))
    (net (code 11) (name "Net-(FB2-Pad2)")
      (node (ref FB2) (pin 2))
      (node (ref J1) (pin 5)))
    (net (code 12) (name "Net-(R2-Pad1)")
      (node (ref R2) (pin 1))
      (node (ref U3) (pin 11)))
    (net (code 13) (name "Net-(FB1-Pad2)")
      (node (ref FB1) (pin 2))
      (node (ref J1) (pin 1)))
    (net (code 14) (name "Net-(C4-Pad2)")
      (node (ref R1) (pin 2))
      (node (ref C4) (pin 2))
      (node (ref U3) (pin 16)))
    (net (code 15) (name "Net-(JP1-Pad1)")
      (node (ref JP1) (pin 1))
      (node (ref R1) (pin 1)))
    (net (code 16) (name "Net-(JP1-Pad2)")
      (node (ref U1) (pin 1))
      (node (ref JP1) (pin 2))
      (node (ref U3) (pin 12)))
    (net (code 17) (name VSYS_5V)
      (node (ref U3) (pin 15))
      (node (ref C1) (pin 2))
      (node (ref SW1) (pin 1))
      (node (ref Q1) (pin 2))
      (node (ref C3) (pin 1))
      (node (ref U2) (pin 3))
      (node (ref C2) (pin 2))
      (node (ref U1) (pin 5))
      (node (ref FB1) (pin 1)))
    (net (code 18) (name "Net-(J1-Pad2)")
      (node (ref J1) (pin 2))
      (node (ref U1) (pin 4)))
    (net (code 19) (name "Net-(J1-Pad3)")
      (node (ref U1) (pin 6))
      (node (ref J1) (pin 3)))
    (net (code 20) (name "Net-(J1-Pad4)")
      (node (ref J1) (pin 4)))
    (net (code 21) (name "Net-(C1-Pad1)")
      (node (ref SW1) (pin 2))
      (node (ref C1) (pin 1))
      (node (ref U3) (pin 6)))
    (net (code 22) (name "Net-(U3-Pad7)")
      (node (ref U3) (pin 7)))
    (net (code 23) (name /DB7)
      (node (ref U3) (pin 5))
      (node (ref J2) (pin 14)))
    (net (code 24) (name /DB6)
      (node (ref J2) (pin 13))
      (node (ref U3) (pin 4)))
    (net (code 25) (name /DB5)
      (node (ref U3) (pin 3))
      (node (ref J2) (pin 12)))
    (net (code 26) (name /DB4)
      (node (ref J2) (pin 11))
      (node (ref U3) (pin 2)))
    (net (code 27) (name /E)
      (node (ref U3) (pin 8))
      (node (ref J2) (pin 6)))
    (net (code 28) (name /R~W~)
      (node (ref U3) (pin 1))
      (node (ref J2) (pin 5)))
    (net (code 29) (name /RS)
      (node (ref J2) (pin 4))
      (node (ref U3) (pin 10)))))