EESchema Schematic File Version 4
LIBS:tda3810-cache
EELAYER 26 0
EELAYER END
$Descr A4 11693 8268
encoding utf-8
Sheet 1 1
Title "TDA3810 based Stereo Width/Pseudo Stereo Ctrl"
Date "2021-02-05"
Rev "1"
Comp "(c) 2021 Andreas Messer"
Comment1 "This work is licensed under a Creative Commons Attribution 4.0 International License."
Comment2 ""
Comment3 ""
Comment4 ""
$EndDescr
$Comp
L ProjectSymbols:TDA3810 U2
U 1 1 600D6043
P 7550 4650
F 0 "U2" H 7000 5800 50  0000 C CNN
F 1 "TDA3810" H 7550 3100 50  0000 C CNN
F 2 "Housings_DIP:DIP-18_W7.62mm_Socket_LongPads" H 7550 4650 50  0001 C CNN
F 3 "" H 7550 4650 50  0001 C CNN
	1    7550 4650
	1    0    0    -1  
$EndComp
$Comp
L Device:C C1
U 1 1 600D60B7
P 4350 4600
F 0 "C1" V 4150 4600 50  0000 C CNN
F 1 "150nF" V 4250 4600 50  0000 C BNN
F 2 "Capacitors_ThroughHole:C_Rect_L7.2mm_W3.5mm_P5.00mm_FKS2_FKP2_MKS2_MKP2" H 4388 4450 50  0001 C CNN
F 3 "~" H 4350 4600 50  0001 C CNN
	1    4350 4600
	0    1    1    0   
$EndComp
$Comp
L Device:C C2
U 1 1 600D6240
P 4350 4800
F 0 "C2" V 4450 4800 50  0000 C TNN
F 1 "150nF" V 4550 4800 50  0000 C CNN
F 2 "Capacitors_ThroughHole:C_Rect_L7.2mm_W3.5mm_P5.00mm_FKS2_FKP2_MKS2_MKP2" H 4388 4650 50  0001 C CNN
F 3 "~" H 4350 4800 50  0001 C CNN
	1    4350 4800
	0    1    1    0   
$EndComp
$Comp
L Device:R R14
U 1 1 600D63AE
P 6550 3800
F 0 "R14" V 6400 3800 50  0000 C CNN
F 1 "10k" V 6500 3800 50  0000 C BNN
F 2 "Resistors_ThroughHole:R_Axial_DIN0207_L6.3mm_D2.5mm_P5.08mm_Vertical" V 6480 3800 50  0001 C CNN
F 3 "~" H 6550 3800 50  0001 C CNN
	1    6550 3800
	0    1    1    0   
$EndComp
$Comp
L Device:R R12
U 1 1 600D66BD
P 6150 3800
F 0 "R12" V 6000 3800 50  0000 C CNN
F 1 "10k" V 6100 3800 50  0000 C BNN
F 2 "Resistors_ThroughHole:R_Axial_DIN0207_L6.3mm_D2.5mm_P5.08mm_Vertical" V 6080 3800 50  0001 C CNN
F 3 "~" H 6150 3800 50  0001 C CNN
	1    6150 3800
	0    1    1    0   
$EndComp
Wire Wire Line
	5950 3800 5950 3350
Wire Wire Line
	5950 3350 8950 3350
$Comp
L Device:R R9
U 1 1 600D6D85
P 5950 4000
F 0 "R9" H 6000 4050 50  0000 L CNN
F 1 "10k" H 6000 3950 50  0000 L BNN
F 2 "Resistors_ThroughHole:R_Axial_DIN0207_L6.3mm_D2.5mm_P5.08mm_Vertical" V 5880 4000 50  0001 C CNN
F 3 "~" H 5950 4000 50  0001 C CNN
	1    5950 4000
	1    0    0    -1  
$EndComp
$Comp
L Device:C C8
U 1 1 600D6DEE
P 5750 4000
F 0 "C8" H 5850 3950 50  0000 L CNN
F 1 "3.9nF" H 5850 4050 50  0000 L TNN
F 2 "Capacitors_ThroughHole:C_Rect_L7.2mm_W2.5mm_P5.00mm_FKS2_FKP2_MKS2_MKP2" H 5788 3850 50  0001 C CNN
F 3 "~" H 5750 4000 50  0001 C CNN
	1    5750 4000
	-1   0    0    1   
$EndComp
Wire Wire Line
	5950 3800 5950 3850
Connection ~ 5950 3800
Wire Wire Line
	5950 3800 5750 3800
Wire Wire Line
	5750 3800 5750 3850
$Comp
L Device:R R16
U 1 1 600D76F1
P 6550 5200
F 0 "R16" H 6600 5250 50  0000 L CNN
F 1 "10k" H 6600 5150 50  0000 L BNN
F 2 "Resistors_ThroughHole:R_Axial_DIN0207_L6.3mm_D2.5mm_P5.08mm_Vertical" V 6480 5200 50  0001 C CNN
F 3 "~" H 6550 5200 50  0001 C CNN
	1    6550 5200
	1    0    0    -1  
$EndComp
$Comp
L Device:C C12
U 1 1 600D7723
P 6350 5200
F 0 "C12" H 6350 5350 50  0000 L CNN
F 1 "3.9nF" H 6350 5500 50  0000 L TNN
F 2 "Capacitors_ThroughHole:C_Rect_L7.2mm_W2.5mm_P5.00mm_FKS2_FKP2_MKS2_MKP2" H 6388 5050 50  0001 C CNN
F 3 "~" H 6350 5200 50  0001 C CNN
	1    6350 5200
	-1   0    0    1   
$EndComp
Wire Wire Line
	6350 5350 6350 5400
Wire Wire Line
	6350 5400 6550 5400
Wire Wire Line
	6550 5400 6550 5350
$Comp
L Device:R R15
U 1 1 600D7F73
P 6550 4400
F 0 "R15" H 6500 4350 50  0000 R CNN
F 1 "1k" H 6500 4450 50  0000 R TNN
F 2 "Resistors_ThroughHole:R_Axial_DIN0207_L6.3mm_D2.5mm_P5.08mm_Vertical" V 6480 4400 50  0001 C CNN
F 3 "~" H 6550 4400 50  0001 C CNN
	1    6550 4400
	-1   0    0    1   
$EndComp
$Comp
L Device:R_POT RV1
U 1 1 600D8023
P 6550 4800
F 0 "RV1" H 6500 4750 50  0000 R CNN
F 1 "47k" H 6500 4850 50  0000 R TNN
F 2 "ProjectFootprints:Pancon_MUSS100-03-D-E" H 6550 4800 50  0001 C CNN
F 3 "~" H 6550 4800 50  0001 C CNN
	1    6550 4800
	-1   0    0    1   
$EndComp
$Comp
L Device:R R13
U 1 1 600DA3A1
P 6150 5200
F 0 "R13" H 6100 5250 50  0000 R CNN
F 1 "100k" H 6100 5150 50  0000 R BNN
F 2 "Resistors_ThroughHole:R_Axial_DIN0207_L6.3mm_D2.5mm_P5.08mm_Vertical" V 6080 5200 50  0001 C CNN
F 3 "~" H 6150 5200 50  0001 C CNN
	1    6150 5200
	1    0    0    -1  
$EndComp
$Comp
L Device:R R3
U 1 1 600DB449
P 4950 5750
F 0 "R3" H 5000 5800 50  0000 L CNN
F 1 "15k" H 5000 5700 50  0000 L BNN
F 2 "Resistors_ThroughHole:R_Axial_DIN0207_L6.3mm_D2.5mm_P5.08mm_Vertical" V 4880 5750 50  0001 C CNN
F 3 "~" H 4950 5750 50  0001 C CNN
	1    4950 5750
	1    0    0    -1  
$EndComp
$Comp
L Device:R R4
U 1 1 600DC609
P 5150 5000
F 0 "R4" V 5300 5000 50  0000 C CNN
F 1 "22k" V 5200 5000 50  0000 C TNN
F 2 "Resistors_ThroughHole:R_Axial_DIN0207_L6.3mm_D2.5mm_P5.08mm_Vertical" V 5080 5000 50  0001 C CNN
F 3 "~" H 5150 5000 50  0001 C CNN
	1    5150 5000
	0    -1   -1   0   
$EndComp
$Comp
L Device:R R8
U 1 1 600DC6A9
P 5550 5000
F 0 "R8" V 5700 5000 50  0000 C CNN
F 1 "22k" V 5600 5000 50  0000 C TNN
F 2 "Resistors_ThroughHole:R_Axial_DIN0207_L6.3mm_D2.5mm_P5.08mm_Vertical" V 5480 5000 50  0001 C CNN
F 3 "~" H 5550 5000 50  0001 C CNN
	1    5550 5000
	0    -1   -1   0   
$EndComp
$Comp
L Device:C C5
U 1 1 600DC6EB
P 5350 5200
F 0 "C5" H 5250 5150 50  0000 R CNN
F 1 "33nF" H 5250 5250 50  0000 R TNN
F 2 "Capacitors_ThroughHole:C_Rect_L7.2mm_W2.5mm_P5.00mm_FKS2_FKP2_MKS2_MKP2" H 5388 5050 50  0001 C CNN
F 3 "~" H 5350 5200 50  0001 C CNN
	1    5350 5200
	-1   0    0    1   
$EndComp
Wire Wire Line
	5300 5000 5350 5000
Wire Wire Line
	5350 5000 5350 5050
Connection ~ 5350 5000
Wire Wire Line
	5350 5000 5400 5000
$Comp
L Device:C C3
U 1 1 600DDA55
P 5150 5550
F 0 "C3" V 5350 5550 50  0000 C CNN
F 1 "10nF" V 5250 5550 50  0000 C TNN
F 2 "Capacitors_ThroughHole:C_Rect_L7.2mm_W2.5mm_P5.00mm_FKS2_FKP2_MKS2_MKP2" H 5188 5400 50  0001 C CNN
F 3 "~" H 5150 5550 50  0001 C CNN
	1    5150 5550
	0    -1   -1   0   
$EndComp
$Comp
L power:GND #PWR04
U 1 1 600DDB90
P 5350 5400
F 0 "#PWR04" H 5350 5150 50  0001 C CNN
F 1 "GND" H 5355 5227 50  0001 C CNN
F 2 "" H 5350 5400 50  0001 C CNN
F 3 "" H 5350 5400 50  0001 C CNN
	1    5350 5400
	1    0    0    -1  
$EndComp
Wire Wire Line
	5350 5350 5350 5400
$Comp
L Device:C C6
U 1 1 600DE732
P 5550 5550
F 0 "C6" V 5750 5550 50  0000 C CNN
F 1 "10nF" V 5650 5550 50  0000 C TNN
F 2 "Capacitors_ThroughHole:C_Rect_L7.2mm_W2.5mm_P5.00mm_FKS2_FKP2_MKS2_MKP2" H 5588 5400 50  0001 C CNN
F 3 "~" H 5550 5550 50  0001 C CNN
	1    5550 5550
	0    -1   -1   0   
$EndComp
$Comp
L Device:R R5
U 1 1 600DE786
P 5350 5750
F 0 "R5" H 5400 5800 50  0000 L CNN
F 1 "10k" H 5400 5700 50  0000 L BNN
F 2 "Resistors_ThroughHole:R_Axial_DIN0207_L6.3mm_D2.5mm_P5.08mm_Vertical" V 5280 5750 50  0001 C CNN
F 3 "~" H 5350 5750 50  0001 C CNN
	1    5350 5750
	1    0    0    -1  
$EndComp
$Comp
L power:GND #PWR05
U 1 1 600DE7EE
P 5350 5950
F 0 "#PWR05" H 5350 5700 50  0001 C CNN
F 1 "GND" H 5355 5777 50  0001 C CNN
F 2 "" H 5350 5950 50  0001 C CNN
F 3 "" H 5350 5950 50  0001 C CNN
	1    5350 5950
	1    0    0    -1  
$EndComp
Wire Wire Line
	5350 5900 5350 5950
Wire Wire Line
	5300 5550 5350 5550
Wire Wire Line
	5350 5550 5350 5600
Connection ~ 5350 5550
Wire Wire Line
	5350 5550 5400 5550
Wire Wire Line
	5000 5000 4950 5000
Wire Wire Line
	4950 5000 4950 5550
Wire Wire Line
	4950 5550 5000 5550
Wire Wire Line
	5700 5000 5750 5000
Wire Wire Line
	5750 5000 5750 5550
Wire Wire Line
	5750 5550 5700 5550
$Comp
L Device:R R11
U 1 1 600E408E
P 5950 5000
F 0 "R11" V 6100 5000 50  0000 C CNN
F 1 "15k" V 6000 5000 50  0000 C TNN
F 2 "Resistors_ThroughHole:R_Axial_DIN0207_L6.3mm_D2.5mm_P5.08mm_Vertical" V 5880 5000 50  0001 C CNN
F 3 "~" H 5950 5000 50  0001 C CNN
	1    5950 5000
	0    -1   -1   0   
$EndComp
Wire Wire Line
	5750 5000 5800 5000
Connection ~ 5750 5000
$Comp
L Device:R R10
U 1 1 600E62B0
P 5950 4400
F 0 "R10" V 6100 4300 50  0000 C CNN
F 1 "22k" V 6000 4300 50  0000 C TNN
F 2 "Resistors_ThroughHole:R_Axial_DIN0207_L6.3mm_D2.5mm_P5.08mm_Vertical" V 5880 4400 50  0001 C CNN
F 3 "~" H 5950 4400 50  0001 C CNN
	1    5950 4400
	0    -1   -1   0   
$EndComp
$Comp
L Device:C C9
U 1 1 600E66BB
P 5750 4600
F 0 "C9" H 5850 4650 50  0000 L CNN
F 1 "10nF" H 5850 4550 50  0000 L BNN
F 2 "Capacitors_ThroughHole:C_Rect_L7.2mm_W2.5mm_P5.00mm_FKS2_FKP2_MKS2_MKP2" H 5788 4450 50  0001 C CNN
F 3 "~" H 5750 4600 50  0001 C CNN
	1    5750 4600
	1    0    0    -1  
$EndComp
$Comp
L Device:R R7
U 1 1 600E6794
P 5550 4400
F 0 "R7" V 5700 4400 50  0000 C CNN
F 1 "18k" V 5600 4400 50  0000 C TNN
F 2 "Resistors_ThroughHole:R_Axial_DIN0207_L6.3mm_D2.5mm_P5.08mm_Vertical" V 5480 4400 50  0001 C CNN
F 3 "~" H 5550 4400 50  0001 C CNN
	1    5550 4400
	0    -1   -1   0   
$EndComp
$Comp
L Device:C C4
U 1 1 600E6833
P 5200 4400
F 0 "C4" V 5000 4400 50  0000 C CNN
F 1 "10nF" V 5100 4400 50  0000 C BNN
F 2 "Capacitors_ThroughHole:C_Rect_L7.2mm_W2.5mm_P5.00mm_FKS2_FKP2_MKS2_MKP2" H 5238 4250 50  0001 C CNN
F 3 "~" H 5200 4400 50  0001 C CNN
	1    5200 4400
	0    1    1    0   
$EndComp
$Comp
L power:GND #PWR07
U 1 1 600E7953
P 5750 4800
F 0 "#PWR07" H 5750 4550 50  0001 C CNN
F 1 "GND" H 5755 4627 50  0001 C CNN
F 2 "" H 5750 4800 50  0001 C CNN
F 3 "" H 5750 4800 50  0001 C CNN
	1    5750 4800
	1    0    0    -1  
$EndComp
Wire Wire Line
	5750 4750 5750 4800
Wire Wire Line
	5700 4400 5750 4400
Wire Wire Line
	5750 4400 5750 4450
Connection ~ 5750 4400
Wire Wire Line
	5750 4400 5800 4400
Wire Wire Line
	5350 4400 5400 4400
Wire Wire Line
	6100 4400 6150 4400
Wire Wire Line
	6150 4400 6150 4600
Wire Wire Line
	6150 5000 6100 5000
Wire Wire Line
	6150 5000 6150 5050
Connection ~ 6150 5000
Wire Wire Line
	6350 5050 6350 5000
Wire Wire Line
	6350 5000 6550 5000
Wire Wire Line
	6550 5000 6550 5050
Wire Wire Line
	6400 4800 6350 4800
Wire Wire Line
	6350 4800 6350 5000
Connection ~ 6350 5000
Wire Wire Line
	6550 4950 6550 5000
Connection ~ 6550 5000
Wire Wire Line
	6550 4550 6550 4650
Wire Wire Line
	6550 4200 6550 4250
Wire Wire Line
	5050 4400 4950 4400
Wire Wire Line
	4950 4400 4950 3800
Connection ~ 5750 3800
Wire Wire Line
	6150 4600 6750 4600
Connection ~ 6150 4600
Wire Wire Line
	6150 4600 6150 5000
Wire Wire Line
	6550 4200 6750 4200
Wire Wire Line
	6150 5350 6150 5400
Wire Wire Line
	6150 5400 6350 5400
Connection ~ 6350 5400
Wire Wire Line
	6550 5000 6750 5000
Wire Wire Line
	4950 3800 5750 3800
Wire Wire Line
	5750 4150 5750 4200
Wire Wire Line
	5750 4200 5950 4200
Wire Wire Line
	5950 4150 5950 4200
Connection ~ 5950 4200
Wire Wire Line
	5950 4200 6550 4200
Connection ~ 6550 4200
Wire Wire Line
	5950 3800 6000 3800
Wire Wire Line
	6300 3800 6350 3800
Wire Wire Line
	6700 3800 6750 3800
Wire Wire Line
	6350 3800 6350 4000
Wire Wire Line
	6350 4000 6750 4000
Connection ~ 6350 3800
Wire Wire Line
	6350 3800 6400 3800
Wire Wire Line
	4950 5550 4950 5600
Connection ~ 4950 5550
Wire Wire Line
	4950 5900 4950 6100
Wire Wire Line
	6350 6300 8950 6300
$Comp
L power:GND #PWR014
U 1 1 601289E1
P 8850 6150
F 0 "#PWR014" H 8850 5900 50  0001 C CNN
F 1 "GND" H 8855 5977 50  0001 C CNN
F 2 "" H 8850 6150 50  0001 C CNN
F 3 "" H 8850 6150 50  0001 C CNN
	1    8850 6150
	1    0    0    -1  
$EndComp
$Comp
L Device:CP C15
U 1 1 60129F2A
P 8550 5900
F 0 "C15" V 8650 5850 50  0000 R TNN
F 1 "47uF" V 8600 5850 50  0000 R CNN
F 2 "Capacitors_ThroughHole:CP_Radial_D6.3mm_P2.50mm" H 8588 5750 50  0001 C CNN
F 3 "~" H 8550 5900 50  0001 C CNN
	1    8550 5900
	0    -1   -1   0   
$EndComp
$Comp
L Device:CP C14
U 1 1 6012A0C9
P 8550 5700
F 0 "C14" V 8650 5650 50  0000 R TNN
F 1 "100uF" V 8600 5650 50  0000 R CNN
F 2 "Capacitors_ThroughHole:CP_Radial_D6.3mm_P2.50mm" H 8588 5550 50  0001 C CNN
F 3 "~" H 8550 5700 50  0001 C CNN
	1    8550 5700
	0    -1   -1   0   
$EndComp
$Comp
L Device:LED D7
U 1 1 6012A1BA
P 8550 5300
F 0 "D7" H 8600 5200 50  0000 L TNN
F 1 "red" H 8600 5250 50  0000 L CNN
F 2 "LEDs:LED_D3.0mm_Horizontal_O1.27mm_Z2.0mm" H 8550 5300 50  0001 C CNN
F 3 "~" H 8550 5300 50  0001 C CNN
	1    8550 5300
	-1   0    0    1   
$EndComp
$Comp
L Device:LED D8
U 1 1 6012A33B
P 8550 5500
F 0 "D8" H 8600 5400 50  0000 L TNN
F 1 "green" H 8600 5450 50  0000 L CNN
F 2 "LEDs:LED_D3.0mm_Horizontal_O1.27mm_Z2.0mm" H 8550 5500 50  0001 C CNN
F 3 "~" H 8550 5500 50  0001 C CNN
	1    8550 5500
	-1   0    0    1   
$EndComp
Wire Wire Line
	8350 5300 8400 5300
Wire Wire Line
	8350 6100 8850 6100
Connection ~ 8850 6100
Wire Wire Line
	8850 6100 8850 6150
Wire Wire Line
	8700 5900 8850 5900
Connection ~ 8850 5900
Wire Wire Line
	8850 5900 8850 6100
Wire Wire Line
	8700 5700 8850 5700
Connection ~ 8850 5700
Wire Wire Line
	8850 5700 8850 5900
Wire Wire Line
	8700 5500 8850 5500
Wire Wire Line
	8350 5500 8400 5500
Wire Wire Line
	8350 5700 8400 5700
Wire Wire Line
	8350 5900 8400 5900
$Comp
L Device:C C16
U 1 1 6013B3DC
P 10650 4000
F 0 "C16" H 10550 4000 50  0000 R CNN
F 1 "4.7uF" H 10550 3950 50  0000 R TNN
F 2 "Capacitors_ThroughHole:CP_Axial_L29.0mm_D10.0mm_P35.00mm_Horizontal" H 10688 3850 50  0001 C CNN
F 3 "~" H 10650 4000 50  0001 C CNN
	1    10650 4000
	1    0    0    -1  
$EndComp
$Comp
L Device:C C17
U 1 1 6013B4BE
P 10650 4600
F 0 "C17" H 10700 4450 50  0000 L CNN
F 1 "4.7uF" H 10700 4550 50  0000 L TNN
F 2 "Capacitors_ThroughHole:CP_Axial_L29.0mm_D10.0mm_P35.00mm_Horizontal" H 10688 4450 50  0001 C CNN
F 3 "~" H 10650 4600 50  0001 C CNN
	1    10650 4600
	-1   0    0    1   
$EndComp
Wire Wire Line
	8350 4500 8950 4500
Wire Wire Line
	8350 4200 8950 4200
$Comp
L Device:C C13
U 1 1 601426FF
P 8400 3800
F 0 "C13" H 8500 3850 50  0000 L CNN
F 1 "100nF" H 8500 3750 50  0000 L BNN
F 2 "Capacitors_ThroughHole:C_Rect_L7.2mm_W2.5mm_P5.00mm_FKS2_FKP2_MKS2_MKP2" H 8438 3650 50  0001 C CNN
F 3 "~" H 8400 3800 50  0001 C CNN
	1    8400 3800
	1    0    0    -1  
$EndComp
$Comp
L power:GND #PWR012
U 1 1 60144267
P 8400 4050
F 0 "#PWR012" H 8400 3800 50  0001 C CNN
F 1 "GND" H 8405 3877 50  0001 C CNN
F 2 "" H 8400 4050 50  0001 C CNN
F 3 "" H 8400 4050 50  0001 C CNN
	1    8400 4050
	1    0    0    -1  
$EndComp
Wire Wire Line
	8350 3600 8400 3600
Wire Wire Line
	8400 3650 8400 3600
Wire Wire Line
	8950 3350 8950 4200
Connection ~ 8950 4200
Wire Wire Line
	8950 4200 9000 4200
Wire Wire Line
	8950 6300 8950 4500
Connection ~ 8950 4500
Wire Wire Line
	8950 4500 9000 4500
Wire Wire Line
	8850 5500 8850 5700
Wire Wire Line
	8700 5300 8850 5300
Wire Wire Line
	8850 5300 8850 5500
Connection ~ 8850 5500
Wire Wire Line
	6350 5400 6350 6300
Wire Wire Line
	8350 4800 8400 4800
Wire Wire Line
	8350 5000 8400 5000
Wire Wire Line
	8800 4900 8850 4900
Wire Wire Line
	8850 4900 8850 5300
Connection ~ 8850 5300
$Comp
L Amplifier_Operational:RC4558 U1
U 1 1 6018BE29
P 9850 4800
F 0 "U1" H 9850 5167 50  0000 C CNN
F 1 "LM358-N" H 9850 5076 50  0000 C CNN
F 2 "Housings_DIP:DIP-8_W7.62mm_Socket_LongPads" H 9850 4800 50  0001 C CNN
F 3 "http://www.ti.com/lit/ds/symlink/rc4558.pdf" H 9850 4800 50  0001 C CNN
	1    9850 4800
	1    0    0    -1  
$EndComp
$Comp
L Device:R_POT_Dual_Separate RV2
U 1 1 6018EA5E
P 9150 4500
F 0 "RV2" V 9050 4500 50  0000 C CNN
F 1 "10k" V 8950 4500 50  0000 C CNN
F 2 "ProjectFootprints:Pancon_MUSS100-05-D-E" H 9150 4500 50  0001 C CNN
F 3 "~" H 9150 4500 50  0001 C CNN
	1    9150 4500
	0    -1   1    0   
$EndComp
$Comp
L Device:R_POT_Dual_Separate RV2
U 2 1 60190FF2
P 9150 4200
F 0 "RV2" V 8943 4200 50  0001 C CNN
F 1 "10k" V 9034 4200 50  0001 C CNN
F 2 "ProjectFootprints:Pancon_MUSS100-05-D-E" H 9150 4200 50  0001 C CNN
F 3 "~" H 9150 4200 50  0001 C CNN
	2    9150 4200
	0    -1   -1   0   
$EndComp
Wire Wire Line
	9350 4500 9300 4500
$Comp
L Device:R R18
U 1 1 6019AD95
P 9350 4700
F 0 "R18" V 9200 4700 50  0000 C CNN
F 1 "10k" V 9300 4700 50  0000 C BNN
F 2 "Resistors_ThroughHole:R_Axial_DIN0207_L6.3mm_D2.5mm_P5.08mm_Vertical" V 9280 4700 50  0001 C CNN
F 3 "~" H 9350 4700 50  0001 C CNN
	1    9350 4700
	0    1    1    0   
$EndComp
$Comp
L Device:R R21
U 1 1 6019AED9
P 9850 5100
F 0 "R21" V 9700 5150 50  0000 C CNN
F 1 "10k" V 9800 5150 50  0000 C BNN
F 2 "Resistors_ThroughHole:R_Axial_DIN0207_L6.3mm_D2.5mm_P5.08mm_Vertical" V 9780 5100 50  0001 C CNN
F 3 "~" H 9850 5100 50  0001 C CNN
	1    9850 5100
	0    1    1    0   
$EndComp
Wire Wire Line
	10150 3800 10200 3800
Wire Wire Line
	10200 3800 10200 4100
Wire Wire Line
	10200 5100 10000 5100
Wire Wire Line
	9700 5100 9500 5100
Wire Wire Line
	9500 5100 9500 4900
Wire Wire Line
	9500 4900 9550 4900
Wire Wire Line
	9500 4700 9550 4700
$Comp
L Device:R R19
U 1 1 601A30F2
P 9350 3700
F 0 "R19" V 9400 3700 50  0000 C TNN
F 1 "10k" V 9500 3700 50  0000 C CNN
F 2 "Resistors_ThroughHole:R_Axial_DIN0207_L6.3mm_D2.5mm_P5.08mm_Vertical" V 9280 3700 50  0001 C CNN
F 3 "~" H 9350 3700 50  0001 C CNN
	1    9350 3700
	0    1    1    0   
$EndComp
$Comp
L Device:R R20
U 1 1 601A3176
P 9800 4100
F 0 "R20" V 9650 4200 50  0000 C CNN
F 1 "10k" V 9750 4200 50  0000 C BNN
F 2 "Resistors_ThroughHole:R_Axial_DIN0207_L6.3mm_D2.5mm_P5.08mm_Vertical" V 9730 4100 50  0001 C CNN
F 3 "~" H 9800 4100 50  0001 C CNN
	1    9800 4100
	0    1    1    0   
$EndComp
Wire Wire Line
	9550 3900 9500 3900
Wire Wire Line
	9500 3900 9500 4100
Wire Wire Line
	9500 4100 9650 4100
Wire Wire Line
	10150 4800 10200 4800
Wire Wire Line
	10200 4800 10200 5100
Wire Wire Line
	10200 4100 9950 4100
Wire Wire Line
	9550 3700 9500 3700
Wire Wire Line
	9150 3700 9200 3700
Wire Wire Line
	9150 3700 9150 4050
Wire Wire Line
	9150 4650 9150 4700
Wire Wire Line
	9150 4700 9200 4700
$Comp
L power:GND #PWR015
U 1 1 6019363A
P 9400 4350
F 0 "#PWR015" H 9400 4100 50  0001 C CNN
F 1 "GND" H 9405 4177 50  0001 C CNN
F 2 "" H 9400 4350 50  0001 C CNN
F 3 "" H 9400 4350 50  0001 C CNN
	1    9400 4350
	0    -1   -1   0   
$EndComp
Wire Wire Line
	9300 4200 9350 4200
Wire Wire Line
	9350 4200 9350 4350
Wire Wire Line
	9350 4350 9400 4350
Connection ~ 9350 4350
Wire Wire Line
	9350 4350 9350 4500
$Comp
L Device:R R22
U 1 1 601C5E88
P 10400 3800
F 0 "R22" V 10250 3800 50  0000 C CNN
F 1 "100R" V 10350 3800 50  0000 C BNN
F 2 "Resistors_ThroughHole:R_Axial_DIN0207_L6.3mm_D2.5mm_P5.08mm_Vertical" V 10330 3800 50  0001 C CNN
F 3 "~" H 10400 3800 50  0001 C CNN
	1    10400 3800
	0    1    1    0   
$EndComp
Wire Wire Line
	10200 3800 10250 3800
Connection ~ 10200 3800
$Comp
L Device:R R23
U 1 1 601C94F3
P 10400 4800
F 0 "R23" V 10250 4800 50  0000 C CNN
F 1 "100R" V 10350 4800 50  0000 C BNN
F 2 "Resistors_ThroughHole:R_Axial_DIN0207_L6.3mm_D2.5mm_P5.08mm_Vertical" V 10330 4800 50  0001 C CNN
F 3 "~" H 10400 4800 50  0001 C CNN
	1    10400 4800
	0    1    1    0   
$EndComp
Wire Wire Line
	10200 4800 10250 4800
Connection ~ 10200 4800
$Comp
L Amplifier_Operational:RC4558 U1
U 3 1 601D3C24
P 6500 7100
F 0 "U1" H 6400 7100 50  0000 L CNN
F 1 "LM358-N" H 6300 7100 50  0001 L CNN
F 2 "Housings_DIP:DIP-8_W7.62mm_Socket_LongPads" H 6500 7100 50  0001 C CNN
F 3 "http://www.ti.com/lit/ds/symlink/rc4558.pdf" H 6500 7100 50  0001 C CNN
	3    6500 7100
	1    0    0    -1  
$EndComp
$Comp
L Device:C C11
U 1 1 601D3E35
P 6200 7100
F 0 "C11" H 6200 7300 50  0000 R BNN
F 1 "100nF" H 6200 7250 50  0000 R CNN
F 2 "Capacitors_ThroughHole:C_Rect_L7.2mm_W2.5mm_P5.00mm_FKS2_FKP2_MKS2_MKP2" H 6238 6950 50  0001 C CNN
F 3 "~" H 6200 7100 50  0001 C CNN
	1    6200 7100
	1    0    0    -1  
$EndComp
Wire Wire Line
	6200 6950 6200 6750
$Comp
L power:GND #PWR016
U 1 1 601E6D4E
P 10900 4650
F 0 "#PWR016" H 10900 4400 50  0001 C CNN
F 1 "GND" H 10905 4477 50  0001 C CNN
F 2 "" H 10900 4650 50  0001 C CNN
F 3 "" H 10900 4650 50  0001 C CNN
	1    10900 4650
	1    0    0    -1  
$EndComp
Wire Wire Line
	10650 3800 10650 3850
Wire Wire Line
	10550 3800 10650 3800
Wire Wire Line
	10650 4150 10650 4200
Wire Wire Line
	10650 4450 10650 4400
Wire Wire Line
	10650 4800 10650 4750
Wire Wire Line
	10550 4800 10650 4800
Wire Wire Line
	10900 4600 10900 4650
$Comp
L power:GND #PWR02
U 1 1 6020E0F5
P 4550 5250
F 0 "#PWR02" H 4550 5000 50  0001 C CNN
F 1 "GND" H 4555 5077 50  0001 C CNN
F 2 "" H 4550 5250 50  0001 C CNN
F 3 "" H 4550 5250 50  0001 C CNN
	1    4550 5250
	1    0    0    -1  
$EndComp
$Comp
L Device:R R1
U 1 1 6021325F
P 4000 4600
F 0 "R1" V 4150 4600 50  0000 C CNN
F 1 "1k" V 4050 4600 50  0000 C TNN
F 2 "Resistors_ThroughHole:R_Axial_DIN0207_L6.3mm_D2.5mm_P5.08mm_Vertical" V 3930 4600 50  0001 C CNN
F 3 "~" H 4000 4600 50  0001 C CNN
	1    4000 4600
	0    -1   -1   0   
$EndComp
$Comp
L Device:R R2
U 1 1 60213592
P 4000 4800
F 0 "R2" V 3950 4800 50  0000 C BNN
F 1 "1k" V 3850 4800 50  0000 C CNN
F 2 "Resistors_ThroughHole:R_Axial_DIN0207_L6.3mm_D2.5mm_P5.08mm_Vertical" V 3930 4800 50  0001 C CNN
F 3 "~" H 4000 4800 50  0001 C CNN
	1    4000 4800
	0    -1   -1   0   
$EndComp
Wire Wire Line
	6250 5900 6250 6200
Wire Wire Line
	4500 4600 4550 4600
Wire Wire Line
	4550 4850 4550 4600
Connection ~ 4550 4600
Wire Wire Line
	4550 4550 4550 4600
Wire Wire Line
	4750 5200 4550 5200
Wire Wire Line
	4550 5150 4550 5200
Connection ~ 4550 5200
$Comp
L power:VCC #PWR01
U 1 1 60277202
P 4500 4200
F 0 "#PWR01" H 4500 4050 50  0001 C CNN
F 1 "VCC" V 4500 4350 50  0000 L CNN
F 2 "" H 4500 4200 50  0001 C CNN
F 3 "" H 4500 4200 50  0001 C CNN
	1    4500 4200
	0    -1   -1   0   
$EndComp
Wire Wire Line
	4500 4200 4550 4200
Wire Wire Line
	4550 4200 4550 4250
Wire Wire Line
	4550 4200 4750 4200
Connection ~ 4550 4200
Wire Wire Line
	4500 4800 4750 4800
Wire Wire Line
	4750 4550 4750 4800
Wire Wire Line
	4750 5150 4750 5200
Connection ~ 4750 4800
Wire Wire Line
	4750 4800 4750 4850
Wire Wire Line
	4750 4200 4750 4250
$Comp
L Device:Q_NPN_CBE Q1
U 1 1 602B4829
P 5600 6850
F 0 "Q1" V 5850 6850 50  0000 C TNN
F 1 "BC547" V 5800 6850 50  0000 C CNN
F 2 "TO_SOT_Packages_THT:TO-92_Molded_Narrow_Oval" H 5800 6950 50  0001 C CNN
F 3 "~" H 5600 6850 50  0001 C CNN
	1    5600 6850
	0    -1   -1   0   
$EndComp
$Comp
L Connector:Jack-DC J2
U 1 1 602B4BCC
P 3900 7350
F 0 "J2" H 3900 7150 50  0000 C CNN
F 1 "Jack-DC" H 3900 7100 50  0000 C TNN
F 2 "ProjectFootprints:CUI_PJ-002AH" H 3950 7310 50  0001 C CNN
F 3 "~" H 3950 7310 50  0001 C CNN
	1    3900 7350
	1    0    0    -1  
$EndComp
$Comp
L Device:Fuse F1
U 1 1 602B510E
P 3900 7050
F 0 "F1" V 3750 7050 50  0000 C CNN
F 1 "50mA T" V 3850 7050 50  0000 C BNN
F 2 "" V 3830 7050 50  0001 C CNN
F 3 "~" H 3900 7050 50  0001 C CNN
	1    3900 7050
	0    1    1    0   
$EndComp
$Comp
L Device:D D5
U 1 1 602C2AA2
P 4600 6750
F 0 "D5" H 4550 6600 50  0000 C TNN
F 1 "1N4148" H 4550 6650 50  0000 C CNN
F 2 "Diodes_ThroughHole:D_DO-41_SOD81_P10.16mm_Horizontal" H 4600 6750 50  0001 C CNN
F 3 "~" H 4600 6750 50  0001 C CNN
	1    4600 6750
	-1   0    0    1   
$EndComp
$Comp
L Device:R R6
U 1 1 602C9C57
P 5000 7100
F 0 "R6" V 4850 7100 50  0000 C CNN
F 1 "1k" V 4950 7100 50  0000 C BNN
F 2 "Resistors_ThroughHole:R_Axial_DIN0207_L6.3mm_D2.5mm_P5.08mm_Vertical" V 4930 7100 50  0001 C CNN
F 3 "~" H 5000 7100 50  0001 C CNN
	1    5000 7100
	0    1    1    0   
$EndComp
$Comp
L Device:CP C7
U 1 1 602E6A7E
P 5600 7300
F 0 "C7" H 5500 7350 50  0000 R CNN
F 1 "100uF" H 5500 7300 50  0000 R TNN
F 2 "Capacitors_ThroughHole:CP_Radial_D6.3mm_P2.50mm" H 5638 7150 50  0001 C CNN
F 3 "~" H 5600 7300 50  0001 C CNN
	1    5600 7300
	1    0    0    -1  
$EndComp
$Comp
L power:GND #PWR06
U 1 1 6032142B
P 5600 7500
F 0 "#PWR06" H 5600 7250 50  0001 C CNN
F 1 "GND" H 5605 7327 50  0001 C CNN
F 2 "" H 5600 7500 50  0001 C CNN
F 3 "" H 5600 7500 50  0001 C CNN
	1    5600 7500
	1    0    0    -1  
$EndComp
$Comp
L Device:D D1
U 1 1 60369B7F
P 4550 4400
F 0 "D1" V 4450 4400 50  0000 L CNN
F 1 "1N4148" V 4250 4350 50  0000 L CNN
F 2 "Diodes_ThroughHole:D_DO-35_SOD27_P7.62mm_Horizontal" H 4550 4400 50  0001 C CNN
F 3 "~" H 4550 4400 50  0001 C CNN
	1    4550 4400
	0    1    1    0   
$EndComp
$Comp
L Device:D D3
U 1 1 60369C37
P 4750 4400
F 0 "D3" V 4650 4400 50  0000 L CNN
F 1 "1N4148" V 4795 4479 50  0001 L CNN
F 2 "Diodes_ThroughHole:D_DO-35_SOD27_P7.62mm_Horizontal" H 4750 4400 50  0001 C CNN
F 3 "~" H 4750 4400 50  0001 C CNN
	1    4750 4400
	0    1    1    0   
$EndComp
$Comp
L Device:D D2
U 1 1 60369CC1
P 4550 5000
F 0 "D2" V 4450 5000 50  0000 L CNN
F 1 "1N4148" V 4595 5079 50  0001 L CNN
F 2 "Diodes_ThroughHole:D_DO-35_SOD27_P7.62mm_Horizontal" H 4550 5000 50  0001 C CNN
F 3 "~" H 4550 5000 50  0001 C CNN
	1    4550 5000
	0    1    1    0   
$EndComp
$Comp
L Device:D D4
U 1 1 60369D5B
P 4750 5000
F 0 "D4" V 4650 5000 50  0000 L CNN
F 1 "1N4148" V 4795 5079 50  0001 L CNN
F 2 "Diodes_ThroughHole:D_DO-35_SOD27_P7.62mm_Horizontal" H 4750 5000 50  0001 C CNN
F 3 "~" H 4750 5000 50  0001 C CNN
	1    4750 5000
	0    1    1    0   
$EndComp
Wire Wire Line
	4950 6100 6750 6100
Wire Wire Line
	3600 5000 3600 5200
Wire Wire Line
	3600 5200 4550 5200
Wire Wire Line
	4550 5250 4550 5200
Wire Wire Line
	4150 4600 4200 4600
Wire Wire Line
	4150 4800 4200 4800
Wire Wire Line
	4850 3600 4850 4600
Wire Wire Line
	4850 4600 4550 4600
Wire Wire Line
	4750 4800 4850 4800
Wire Wire Line
	4850 4800 4850 6200
Wire Wire Line
	4850 6200 6250 6200
Wire Wire Line
	6250 5900 6750 5900
Wire Wire Line
	4850 3600 6750 3600
Wire Wire Line
	6200 7450 6300 7450
Wire Wire Line
	8400 3950 8400 4050
Wire Wire Line
	8450 3600 8400 3600
Connection ~ 8400 3600
$Comp
L Switch:SW_SPST SW1
U 1 1 6047BEED
P 3900 6750
F 0 "SW1" H 3900 6900 50  0000 C CNN
F 1 "PWR" H 3900 6850 50  0001 C CNN
F 2 "" H 3900 6750 50  0001 C CNN
F 3 "" H 3900 6750 50  0001 C CNN
	1    3900 6750
	1    0    0    -1  
$EndComp
Wire Wire Line
	3650 6750 3700 6750
$Comp
L power:VCC #PWR011
U 1 1 604D61E4
P 6650 6750
F 0 "#PWR011" H 6650 6600 50  0001 C CNN
F 1 "VCC" V 6650 6900 50  0000 L CNN
F 2 "" H 6650 6750 50  0001 C CNN
F 3 "" H 6650 6750 50  0001 C CNN
	1    6650 6750
	0    1    1    0   
$EndComp
$Comp
L power:VCC #PWR013
U 1 1 604DFF9B
P 8450 3600
F 0 "#PWR013" H 8450 3450 50  0001 C CNN
F 1 "VCC" V 8400 3600 50  0000 L BNN
F 2 "" H 8450 3600 50  0001 C CNN
F 3 "" H 8450 3600 50  0001 C CNN
	1    8450 3600
	0    1    1    0   
$EndComp
$Comp
L Device:LED D6
U 1 1 604F48DF
P 6600 6950
F 0 "D6" V 6650 6900 50  0000 R CNN
F 1 "red" V 6550 6900 50  0000 R TNN
F 2 "LEDs:LED_D3.0mm_Horizontal_O1.27mm_Z2.0mm" H 6600 6950 50  0001 C CNN
F 3 "~" H 6600 6950 50  0001 C CNN
	1    6600 6950
	0    -1   -1   0   
$EndComp
$Comp
L Device:R R17
U 1 1 6050839A
P 6600 7300
F 0 "R17" H 6550 7300 50  0000 R TNN
F 1 "1k" H 6550 7350 50  0000 R CNN
F 2 "Resistors_ThroughHole:R_Axial_DIN0207_L6.3mm_D2.5mm_P5.08mm_Vertical" V 6530 7300 50  0001 C CNN
F 3 "~" H 6600 7300 50  0001 C CNN
	1    6600 7300
	-1   0    0    1   
$EndComp
$Comp
L power:GND #PWR010
U 1 1 60508834
P 6600 7500
F 0 "#PWR010" H 6600 7250 50  0001 C CNN
F 1 "GND" H 6605 7327 50  0001 C CNN
F 2 "" H 6600 7500 50  0001 C CNN
F 3 "" H 6600 7500 50  0001 C CNN
	1    6600 7500
	1    0    0    -1  
$EndComp
Wire Wire Line
	6200 7250 6200 7450
$Comp
L power:GND #PWR09
U 1 1 60546998
P 6300 7500
F 0 "#PWR09" H 6300 7250 50  0001 C CNN
F 1 "GND" H 6305 7327 50  0001 C CNN
F 2 "" H 6300 7500 50  0001 C CNN
F 3 "" H 6300 7500 50  0001 C CNN
	1    6300 7500
	1    0    0    -1  
$EndComp
Wire Wire Line
	6300 7450 6300 7500
Connection ~ 6300 7450
Wire Wire Line
	6300 7450 6400 7450
Wire Wire Line
	5600 7050 5600 7100
Connection ~ 5600 7100
Wire Wire Line
	5600 7100 5600 7150
Wire Wire Line
	4850 7100 4800 7100
Wire Wire Line
	4800 7100 4800 6750
Wire Wire Line
	5600 7450 5600 7500
Connection ~ 6200 6750
Wire Wire Line
	6200 6750 6400 6750
Wire Wire Line
	6400 7450 6400 7400
Wire Wire Line
	6400 6800 6400 6750
Connection ~ 6400 6750
Wire Wire Line
	6400 6750 6600 6750
Wire Wire Line
	4750 6750 4800 6750
Connection ~ 4800 6750
$Comp
L Connector_Generic:Conn_01x01 J3
U 1 1 6025AA19
P 4200 6750
F 0 "J3" H 4100 6600 50  0000 C TNN
F 1 "PWRSW2" H 4100 6650 50  0000 C CNN
F 2 "Wire_Pads:SolderWirePad_single_1-5mmDrill" H 4200 6750 50  0001 C CNN
F 3 "~" H 4200 6750 50  0001 C CNN
	1    4200 6750
	-1   0    0    1   
$EndComp
$Comp
L Connector_Generic:Conn_01x01 J4
U 1 1 6025AC4D
P 4200 7050
F 0 "J4" H 4100 6900 50  0000 C TNN
F 1 "PWRSW1" H 4100 6950 50  0000 C CNN
F 2 "Wire_Pads:SolderWirePad_single_1-5mmDrill" H 4200 7050 50  0001 C CNN
F 3 "~" H 4200 7050 50  0001 C CNN
	1    4200 7050
	-1   0    0    1   
$EndComp
$Comp
L power:GND #PWR03
U 1 1 6026DAD3
P 4250 7500
F 0 "#PWR03" H 4250 7250 50  0001 C CNN
F 1 "GND" H 4255 7327 50  0001 C CNN
F 2 "" H 4250 7500 50  0001 C CNN
F 3 "" H 4250 7500 50  0001 C CNN
	1    4250 7500
	1    0    0    -1  
$EndComp
Wire Wire Line
	4200 7450 4250 7450
Wire Wire Line
	4250 7450 4250 7500
Wire Wire Line
	4400 6750 4450 6750
Wire Wire Line
	6600 7450 6600 7500
Wire Wire Line
	6600 7100 6600 7150
Wire Wire Line
	6600 6800 6600 6750
Connection ~ 6600 6750
Wire Wire Line
	6600 6750 6650 6750
Text Label 4100 6750 2    10   ~ 0
VIN
Text Label 4400 6750 0    10   ~ 0
VIN
$Comp
L Device:CP C10
U 1 1 601ECB06
P 5900 7100
F 0 "C10" H 5900 7300 50  0000 R BNN
F 1 "100uF" H 5900 7250 50  0000 R CNN
F 2 "Capacitors_ThroughHole:CP_Radial_D6.3mm_P2.50mm" H 5938 6950 50  0001 C CNN
F 3 "~" H 5900 7100 50  0001 C CNN
	1    5900 7100
	1    0    0    -1  
$EndComp
$Comp
L power:GND #PWR08
U 1 1 601ECBC6
P 5900 7500
F 0 "#PWR08" H 5900 7250 50  0001 C CNN
F 1 "GND" H 5905 7327 50  0001 C CNN
F 2 "" H 5900 7500 50  0001 C CNN
F 3 "" H 5900 7500 50  0001 C CNN
	1    5900 7500
	1    0    0    -1  
$EndComp
Wire Wire Line
	5900 7250 5900 7500
Wire Wire Line
	5900 6950 5900 6750
Wire Wire Line
	5900 6750 6200 6750
Wire Wire Line
	5800 6750 5900 6750
Connection ~ 5900 6750
Text Notes 3650 6450 0    50   ~ 0
Case mount
$Comp
L Amplifier_Operational:RC4558 U1
U 2 1 601F5A52
P 9850 3800
F 0 "U1" H 9850 4167 50  0000 C CNN
F 1 "LM358-N" H 9850 4076 50  0000 C CNN
F 2 "Housings_DIP:DIP-8_W7.62mm_Socket_LongPads" H 9850 3800 50  0001 C CNN
F 3 "http://www.ti.com/lit/ds/symlink/rc4558.pdf" H 9850 3800 50  0001 C CNN
	2    9850 3800
	1    0    0    -1  
$EndComp
Wire Wire Line
	3650 7050 3750 7050
Wire Wire Line
	3650 6750 3650 7050
Wire Wire Line
	4050 7050 4100 7050
Wire Wire Line
	4400 7050 4450 7050
Wire Wire Line
	4450 7050 4450 7250
Wire Wire Line
	4200 7250 4450 7250
Text Label 4100 7050 2    10   ~ 0
Vext
Text Label 4400 7050 0    10   ~ 0
Vext
Wire Notes Line
	4150 7150 4150 6350
Wire Notes Line
	4150 6350 3600 6350
Wire Notes Line
	3600 6350 3600 7150
Wire Notes Line
	3600 7150 4150 7150
$Comp
L ProjectSymbols:SW_ROT3 SW2
U 1 1 60291390
P 8600 4900
F 0 "SW2" H 8600 5183 50  0000 C CNN
F 1 "SW_ROT3" H 8600 5092 50  0000 C CNN
F 2 "ProjectFootprints:Pancon_MUSS100-03-D-E" H 7975 5075 50  0001 C CNN
F 3 "" H 7975 5075 50  0001 C CNN
	1    8600 4900
	-1   0    0    -1  
$EndComp
$Comp
L Diode:ZPDxx D9
U 1 1 602DCE0B
P 5200 7300
F 0 "D9" V 5150 7250 50  0000 R CNN
F 1 "ZPD15V" V 5200 7250 50  0000 R TNN
F 2 "Diodes_ThroughHole:D_DO-41_SOD81_P10.16mm_Horizontal" H 5200 7125 50  0001 C CNN
F 3 "http://diotec.com/tl_files/diotec/files/pdf/datasheets/zpd1" H 5200 7300 50  0001 C CNN
	1    5200 7300
	0    1    1    0   
$EndComp
Wire Wire Line
	5150 7100 5200 7100
Wire Wire Line
	5200 7150 5200 7100
Connection ~ 5200 7100
Wire Wire Line
	5200 7100 5600 7100
$Comp
L power:GND #PWR0101
U 1 1 60324167
P 5200 7500
F 0 "#PWR0101" H 5200 7250 50  0001 C CNN
F 1 "GND" H 5205 7327 50  0001 C CNN
F 2 "" H 5200 7500 50  0001 C CNN
F 3 "" H 5200 7500 50  0001 C CNN
	1    5200 7500
	1    0    0    -1  
$EndComp
Wire Wire Line
	5200 7450 5200 7500
Wire Wire Line
	4800 6750 5400 6750
$Comp
L ProjectSymbols:Conn_RCA_x2 J1
U 1 1 6036B655
P 3600 4700
F 0 "J1" H 3530 5038 50  0000 C CNN
F 1 "Cinch" H 3530 4947 50  0000 C CNN
F 2 "ProjectFootprints:CUI_RCJ-22xx" H 3600 4600 50  0001 C CNN
F 3 " ~" H 3600 4600 50  0001 C CNN
	1    3600 4700
	-1   0    0    -1  
$EndComp
$Comp
L ProjectSymbols:Conn_RCA_x2 J5
U 1 1 6036BFCC
P 10900 4300
F 0 "J5" H 11000 4276 50  0000 L CNN
F 1 "Cinch" H 11000 4185 50  0000 L CNN
F 2 "ProjectFootprints:CUI_RCJ-22xx" H 10900 4200 50  0001 C CNN
F 3 " ~" H 10900 4200 50  0001 C CNN
	1    10900 4300
	1    0    0    -1  
$EndComp
Wire Wire Line
	3850 4600 3800 4800
Wire Wire Line
	3800 4600 3850 4800
Wire Wire Line
	10650 4400 10700 4200
Wire Wire Line
	10650 4200 10700 4400
$Comp
L Mechanical:Housing N1
U 1 1 60298841
P 9400 5500
F 0 "N1" H 9553 5534 50  0000 L CNN
F 1 "Housing" H 9553 5443 50  0000 L CNN
F 2 "ProjectFootprints:Gainta_ALUG705BK060" H 9450 5550 50  0001 C CNN
F 3 "~" H 9450 5550 50  0001 C CNN
	1    9400 5500
	1    0    0    -1  
$EndComp
$Comp
L Connector_Generic:Conn_01x01 J6
U 1 1 6034752C
P 10200 5550
F 0 "J6" H 10100 5750 50  0000 C TNN
F 1 "GND" H 10100 5650 50  0000 C CNN
F 2 "Wire_Pads:SolderWirePad_single_1-5mmDrill" H 10200 5550 50  0001 C CNN
F 3 "~" H 10200 5550 50  0001 C CNN
	1    10200 5550
	1    0    0    -1  
$EndComp
$Comp
L power:GND #PWR017
U 1 1 60347ADC
P 9950 5600
F 0 "#PWR017" H 9950 5350 50  0001 C CNN
F 1 "GND" H 9955 5427 50  0001 C CNN
F 2 "" H 9950 5600 50  0001 C CNN
F 3 "" H 9950 5600 50  0001 C CNN
	1    9950 5600
	1    0    0    -1  
$EndComp
Wire Wire Line
	10000 5550 9950 5550
Wire Wire Line
	9950 5550 9950 5600
$EndSCHEMATC
