(module Arduino_UNO_R3_WithMountingHoles (layer F.Cu) (tedit 602BFEAF)
  (descr "Arduino UNO R3, http://www.mouser.com/pdfdocs/Gravitech_Arduino_Nano3_0.pdf")
  (tags "Arduino UNO R3")
  (fp_text reference REF** (at 1.52 26.67) (layer F.SilkS)
    (effects (font (size 1 1) (thickness 0.15)))
  )
  (fp_text value Arduino_UNO_R3_WithMountingHoles (at 0.25 0 180) (layer F.Fab)
    (effects (font (size 1 1) (thickness 0.15)))
  )
  (fp_text user %R (at 0.25 2.54) (layer F.Fab)
    (effects (font (size 1 1) (thickness 0.15)))
  )
  (fp_line (start 38.6 25.65) (end 38.6 22.86) (layer F.CrtYd) (width 0.05))
  (fp_line (start 38.6 22.86) (end 41.14 20.32) (layer F.CrtYd) (width 0.05))
  (fp_line (start 41.14 20.32) (end 41.14 -12.45) (layer F.CrtYd) (width 0.05))
  (fp_line (start 41.14 -12.45) (end 38.6 -14.99) (layer F.CrtYd) (width 0.05))
  (fp_line (start 38.6 -14.99) (end 38.6 -26.42) (layer F.CrtYd) (width 0.05))
  (fp_line (start 38.6 -26.42) (end 36.83 -28.19) (layer F.CrtYd) (width 0.05))
  (fp_line (start 36.83 -28.19) (end -27.94 -28.19) (layer F.CrtYd) (width 0.05))
  (fp_line (start -27.94 -28.19) (end -27.94 -18.67) (layer F.CrtYd) (width 0.05))
  (fp_line (start -27.94 -18.67) (end -34.29 -18.67) (layer F.CrtYd) (width 0.05))
  (fp_line (start -34.29 -18.67) (end -34.29 -6.73) (layer F.CrtYd) (width 0.05))
  (fp_line (start -34.29 -6.73) (end -27.94 -6.73) (layer F.CrtYd) (width 0.05))
  (fp_line (start -27.94 -6.73) (end -27.94 13.08) (layer F.CrtYd) (width 0.05))
  (fp_line (start -27.94 13.08) (end -29.85 13.08) (layer F.CrtYd) (width 0.05))
  (fp_line (start -29.85 13.08) (end -29.85 22.48) (layer F.CrtYd) (width 0.05))
  (fp_line (start -29.85 22.48) (end -27.94 22.48) (layer F.CrtYd) (width 0.05))
  (fp_line (start -27.94 22.48) (end -27.94 25.65) (layer F.CrtYd) (width 0.05))
  (fp_line (start -27.94 25.65) (end 38.6 25.65) (layer F.CrtYd) (width 0.05))
  (fp_line (start -29.72 13.21) (end -27.82 13.21) (layer F.SilkS) (width 0.12))
  (fp_line (start -34.04 -6.98) (end -18.16 -6.98) (layer F.Fab) (width 0.1))
  (fp_line (start -18.16 -6.98) (end -18.16 -18.41) (layer F.Fab) (width 0.1))
  (fp_line (start -18.16 -18.41) (end -34.04 -18.41) (layer F.Fab) (width 0.1))
  (fp_line (start -34.04 -18.41) (end -34.04 -6.98) (layer F.Fab) (width 0.1))
  (fp_line (start -29.59 22.22) (end -16.26 22.22) (layer F.Fab) (width 0.1))
  (fp_line (start -16.26 22.22) (end -16.26 13.33) (layer F.Fab) (width 0.1))
  (fp_line (start -16.26 13.33) (end -29.59 13.33) (layer F.Fab) (width 0.1))
  (fp_line (start -29.59 13.33) (end -29.59 22.22) (layer F.Fab) (width 0.1))
  (fp_line (start 38.35 -14.99) (end 38.35 -26.42) (layer F.Fab) (width 0.1))
  (fp_line (start 40.89 20.32) (end 40.89 -12.45) (layer F.Fab) (width 0.1))
  (fp_line (start 40.89 -12.45) (end 38.35 -14.99) (layer F.Fab) (width 0.1))
  (fp_line (start 38.35 25.4) (end 38.35 22.86) (layer F.Fab) (width 0.1))
  (fp_line (start 38.35 22.86) (end 40.89 20.32) (layer F.Fab) (width 0.1))
  (fp_line (start 38.35 -26.42) (end 36.83 -27.94) (layer F.Fab) (width 0.1))
  (fp_line (start 36.83 -27.94) (end -27.69 -27.94) (layer F.Fab) (width 0.1))
  (fp_line (start -27.69 -27.94) (end -27.69 25.4) (layer F.Fab) (width 0.1))
  (fp_line (start -27.69 25.4) (end 38.35 25.4) (layer F.Fab) (width 0.1))
  (fp_line (start -10.16 -26.67) (end 36.83 -26.67) (layer F.Fab) (width 0.1))
  (fp_line (start 36.83 -26.67) (end 36.83 -24.13) (layer F.Fab) (width 0.1))
  (fp_line (start 36.83 -24.13) (end -10.16 -24.13) (layer F.Fab) (width 0.1))
  (fp_line (start -10.16 -24.13) (end -10.16 -26.67) (layer F.Fab) (width 0.1))
  (fp_circle (center -12.45 -25.4) (end -9.7 -25.4) (layer F.Fab) (width 0.1))
  (fp_circle (center 38.35 -10.16) (end 41.1 -10.16) (layer F.Fab) (width 0.1))
  (fp_circle (center 38.35 17.78) (end 41.1 17.78) (layer F.Fab) (width 0.1))
  (fp_circle (center -13.72 22.86) (end -10.97 22.86) (layer F.Fab) (width 0.1))
  (fp_line (start -1.016 21.59) (end 37.084 21.59) (layer F.Fab) (width 0.1))
  (fp_line (start 37.084 21.59) (end 37.084 24.13) (layer F.Fab) (width 0.1))
  (fp_line (start 37.084 24.13) (end -1.016 24.13) (layer F.Fab) (width 0.1))
  (fp_line (start -1.016 24.13) (end -1.016 21.59) (layer F.Fab) (width 0.1))
  (pad 32 thru_hole oval (at -8.89 -25.4 90) (size 1.6 1.6) (drill 0.8) (layers *.Cu *.Mask))
  (pad 31 thru_hole oval (at -6.35 -25.4 90) (size 1.6 1.6) (drill 0.8) (layers *.Cu *.Mask))
  (pad 1 thru_hole rect (at 0.25 22.86 90) (size 1.6 1.6) (drill 0.8) (layers *.Cu *.Mask))
  (pad 17 thru_hole oval (at 30.73 -25.4 90) (size 1.6 1.6) (drill 0.8) (layers *.Cu *.Mask))
  (pad 2 thru_hole oval (at 2.79 22.86 90) (size 1.6 1.6) (drill 0.8) (layers *.Cu *.Mask))
  (pad 18 thru_hole oval (at 28.19 -25.4 90) (size 1.6 1.6) (drill 0.8) (layers *.Cu *.Mask))
  (pad 3 thru_hole oval (at 5.33 22.86 90) (size 1.6 1.6) (drill 0.8) (layers *.Cu *.Mask))
  (pad 19 thru_hole oval (at 25.65 -25.4 90) (size 1.6 1.6) (drill 0.8) (layers *.Cu *.Mask))
  (pad 4 thru_hole oval (at 7.87 22.86 90) (size 1.6 1.6) (drill 0.8) (layers *.Cu *.Mask))
  (pad 20 thru_hole oval (at 23.11 -25.4 90) (size 1.6 1.6) (drill 0.8) (layers *.Cu *.Mask))
  (pad 5 thru_hole oval (at 10.41 22.86 90) (size 1.6 1.6) (drill 0.8) (layers *.Cu *.Mask))
  (pad 21 thru_hole oval (at 20.57 -25.4 90) (size 1.6 1.6) (drill 0.8) (layers *.Cu *.Mask))
  (pad 6 thru_hole oval (at 12.95 22.86 90) (size 1.6 1.6) (drill 0.8) (layers *.Cu *.Mask))
  (pad 22 thru_hole oval (at 18.03 -25.4 90) (size 1.6 1.6) (drill 0.8) (layers *.Cu *.Mask))
  (pad 7 thru_hole oval (at 15.49 22.86 90) (size 1.6 1.6) (drill 0.8) (layers *.Cu *.Mask))
  (pad 23 thru_hole oval (at 13.97 -25.4 90) (size 1.6 1.6) (drill 0.8) (layers *.Cu *.Mask))
  (pad 8 thru_hole oval (at 18.03 22.86 90) (size 1.6 1.6) (drill 0.8) (layers *.Cu *.Mask))
  (pad 24 thru_hole oval (at 11.43 -25.4 90) (size 1.6 1.6) (drill 0.8) (layers *.Cu *.Mask))
  (pad 9 thru_hole oval (at 23.11 22.86 90) (size 1.6 1.6) (drill 0.8) (layers *.Cu *.Mask))
  (pad 25 thru_hole oval (at 8.89 -25.4 90) (size 1.6 1.6) (drill 0.8) (layers *.Cu *.Mask))
  (pad 10 thru_hole oval (at 25.65 22.86 90) (size 1.6 1.6) (drill 0.8) (layers *.Cu *.Mask))
  (pad 26 thru_hole oval (at 6.35 -25.4 90) (size 1.6 1.6) (drill 0.8) (layers *.Cu *.Mask))
  (pad 11 thru_hole oval (at 28.19 22.86 90) (size 1.6 1.6) (drill 0.8) (layers *.Cu *.Mask))
  (pad 27 thru_hole oval (at 3.81 -25.4 90) (size 1.6 1.6) (drill 0.8) (layers *.Cu *.Mask))
  (pad 12 thru_hole oval (at 30.73 22.86 90) (size 1.6 1.6) (drill 0.8) (layers *.Cu *.Mask))
  (pad 28 thru_hole oval (at 1.27 -25.4 90) (size 1.6 1.6) (drill 0.8) (layers *.Cu *.Mask))
  (pad 13 thru_hole oval (at 33.27 22.86 90) (size 1.6 1.6) (drill 0.8) (layers *.Cu *.Mask))
  (pad 29 thru_hole oval (at -1.27 -25.4 90) (size 1.6 1.6) (drill 0.8) (layers *.Cu *.Mask))
  (pad 14 thru_hole oval (at 35.81 22.86 90) (size 1.6 1.6) (drill 0.8) (layers *.Cu *.Mask))
  (pad 30 thru_hole oval (at -3.81 -25.4 90) (size 1.6 1.6) (drill 0.8) (layers *.Cu *.Mask))
  (pad 15 thru_hole oval (at 35.81 -25.4 90) (size 1.6 1.6) (drill 0.8) (layers *.Cu *.Mask))
  (pad 16 thru_hole oval (at 33.27 -25.4 90) (size 1.6 1.6) (drill 0.8) (layers *.Cu *.Mask))
  (pad "" np_thru_hole circle (at -13.72 22.86 90) (size 3.2 3.2) (drill 3.2) (layers *.Cu *.Mask))
  (pad "" np_thru_hole circle (at -12.45 -25.4 90) (size 3.2 3.2) (drill 3.2) (layers *.Cu *.Mask))
  (pad "" np_thru_hole circle (at 38.35 -10.16 90) (size 3.2 3.2) (drill 3.2) (layers *.Cu *.Mask))
  (pad "" np_thru_hole circle (at 38.35 17.78 90) (size 3.2 3.2) (drill 3.2) (layers *.Cu *.Mask))
  (model ${KISYS3DMOD}/Module.3dshapes/Arduino_UNO_R3_WithMountingHoles.wrl
    (at (xyz 0 0 0))
    (scale (xyz 1 1 1))
    (rotate (xyz 0 0 0))
  )
)
