(export (version D)
  (design
    (source /home/andi/Projekte/small-stuff/hardware/soic8-dip8-adaptor/soic8-dip8-adaptor.sch)
    (date "Do 31 Dez 2020 14:28:32 CET")
    (tool "Eeschema 5.0.2+dfsg1-1")
    (sheet (number 1) (name /) (tstamps /)
      (title_block
        (title "SOIC-8 to DIP-8 adaptor")
        (company "Copyright (c) 2020 Andreas Messer")
        (rev 1)
        (date 2020-12-31)
        (source soic8-dip8-adaptor.sch)
        (comment (number 1) (value "This work is licensed under a Creative Commons Attribution 4.0 International License."))
        (comment (number 2) (value ""))
        (comment (number 3) (value ""))
        (comment (number 4) (value "")))))
  (components
    (comp (ref U1)
      (value MCP6002-xSN)
      (footprint Housings_SOIC:SOIC-8_3.9x4.9mm_Pitch1.27mm)
      (datasheet http://ww1.microchip.com/downloads/en/DeviceDoc/21733j.pdf)
      (libsource (lib Amplifier_Operational) (part MCP6002-xSN) (description "1MHz, Low-Power Op Amp, SOIC-8"))
      (sheetpath (names /) (tstamps /))
      (tstamp 5FEDCDDB))
    (comp (ref J1)
      (value DIL8)
      (footprint Housings_DIP:DIP-8_W10.16mm)
      (datasheet ~)
      (libsource (lib Connector_Generic) (part Conn_02x04_Counter_Clockwise) (description "Generic connector, double row, 02x04, counter clockwise pin numbering scheme (similar to DIP packge numbering), script generated (kicad-library-utils/schlib/autogen/connector/)"))
      (sheetpath (names /) (tstamps /))
      (tstamp 5FEDD016)))
  (libparts
    (libpart (lib Amplifier_Operational) (part LM2904)
      (aliases
        (alias LM358)
        (alias AD8620)
        (alias LMC6062)
        (alias LMC6082)
        (alias TL062)
        (alias TL072)
        (alias TL082)
        (alias NE5532)
        (alias SA5532)
        (alias RC4558)
        (alias RC4560)
        (alias RC4580)
        (alias LMV358)
        (alias TS912)
        (alias TSV912IDT)
        (alias TSV912IST)
        (alias TLC272)
        (alias TLC277)
        (alias MCP602)
        (alias OPA2134)
        (alias OPA2340)
        (alias OPA2376xxD)
        (alias OPA2376xxDGK)
        (alias MC33078)
        (alias MC33178)
        (alias LM4562)
        (alias OP249)
        (alias OP275)
        (alias ADA4075-2)
        (alias MCP6002-xP)
        (alias MCP6002-xSN)
        (alias MCP6002-xMS)
        (alias LM7332)
        (alias OPA2333xxD)
        (alias OPA2333xxDGK)
        (alias LMC6482)
        (alias LT1492)
        (alias LTC6081xMS8)
        (alias LM6172)
        (alias MCP6L92)
        (alias NJM2043)
        (alias NJM2114)
        (alias NJM4556A)
        (alias NJM4558)
        (alias NJM4559)
        (alias NJM4560)
        (alias NJM4580)
        (alias NJM5532)
        (alias ADA4807-2ARM)
        (alias OPA2691)
        (alias LT6233)
        (alias OPA2356xxD)
        (alias OPA2356xxDGK)
        (alias OPA1612AxD)
        (alias MC33172)
        (alias OPA1602))
      (description "Dual Operational Amplifiers, DIP-8/SOIC-8/TSSOP-8/VSSOP-8")
      (docs http://www.ti.com/lit/ds/symlink/lm358.pdf)
      (footprints
        (fp SOIC*3.9x4.9mm*P1.27mm*)
        (fp DIP*W7.62mm*)
        (fp TO*99*)
        (fp OnSemi*Micro8*)
        (fp TSSOP*3x3mm*P0.65mm*)
        (fp TSSOP*4.4x3mm*P0.65mm*)
        (fp MSOP*3x3mm*P0.65mm*)
        (fp SSOP*3.9x4.9mm*P0.635mm*)
        (fp LFCSP*2x2mm*P0.5mm*)
        (fp *SIP*)
        (fp SOIC*5.3x6.2mm*P1.27mm*))
      (fields
        (field (name Reference) U)
        (field (name Value) LM2904))
      (pins
        (pin (num 1) (name ~) (type output))
        (pin (num 2) (name -) (type input))
        (pin (num 3) (name +) (type input))
        (pin (num 4) (name V-) (type power_in))
        (pin (num 5) (name +) (type input))
        (pin (num 6) (name -) (type input))
        (pin (num 7) (name ~) (type output))
        (pin (num 8) (name V+) (type power_in))))
    (libpart (lib Connector_Generic) (part Conn_02x04_Counter_Clockwise)
      (description "Generic connector, double row, 02x04, counter clockwise pin numbering scheme (similar to DIP packge numbering), script generated (kicad-library-utils/schlib/autogen/connector/)")
      (docs ~)
      (footprints
        (fp Connector*:*_2x??_*))
      (fields
        (field (name Reference) J)
        (field (name Value) Conn_02x04_Counter_Clockwise))
      (pins
        (pin (num 1) (name Pin_1) (type passive))
        (pin (num 2) (name Pin_2) (type passive))
        (pin (num 3) (name Pin_3) (type passive))
        (pin (num 4) (name Pin_4) (type passive))
        (pin (num 5) (name Pin_5) (type passive))
        (pin (num 6) (name Pin_6) (type passive))
        (pin (num 7) (name Pin_7) (type passive))
        (pin (num 8) (name Pin_8) (type passive)))))
  (libraries
    (library (logical Amplifier_Operational)
      (uri /usr/share/kicad/library/Amplifier_Operational.lib))
    (library (logical Connector_Generic)
      (uri /usr/share/kicad/library/Connector_Generic.lib)))
  (nets
    (net (code 1) (name "Net-(J1-Pad7)")
      (node (ref J1) (pin 7))
      (node (ref U1) (pin 7)))
    (net (code 2) (name "Net-(J1-Pad6)")
      (node (ref J1) (pin 6))
      (node (ref U1) (pin 6)))
    (net (code 3) (name "Net-(J1-Pad5)")
      (node (ref U1) (pin 5))
      (node (ref J1) (pin 5)))
    (net (code 4) (name "Net-(J1-Pad4)")
      (node (ref U1) (pin 4))
      (node (ref J1) (pin 4)))
    (net (code 5) (name "Net-(J1-Pad8)")
      (node (ref U1) (pin 8))
      (node (ref J1) (pin 8)))
    (net (code 6) (name "Net-(J1-Pad2)")
      (node (ref J1) (pin 2))
      (node (ref U1) (pin 2)))
    (net (code 7) (name "Net-(J1-Pad3)")
      (node (ref J1) (pin 3))
      (node (ref U1) (pin 3)))
    (net (code 8) (name "Net-(J1-Pad1)")
      (node (ref U1) (pin 1))
      (node (ref J1) (pin 1)))))