EESchema Schematic File Version 4
LIBS:bastelino-radio-conshield-cache
EELAYER 26 0
EELAYER END
$Descr A4 11693 8268
encoding utf-8
Sheet 1 1
Title "Bastelino Radio Connector Shield"
Date "2021-04-19"
Rev "r1"
Comp "(c) 2021 Andreas Messer"
Comment1 "This work is licensed under a Creative Commons Attribution 4.0 international License"
Comment2 ""
Comment3 ""
Comment4 ""
$EndDescr
$Comp
L Connector:Conn_01x18_Female J3
U 1 1 5FECA72B
P 9900 4700
F 0 "J3" H 9927 4676 50  0000 L CNN
F 1 "Display" H 9927 4585 50  0000 L CNN
F 2 "Connector_FFC-FPC:TE_1-84953-8_1x18-1MP_P1.0mm_Horizontal" H 9900 4700 50  0001 C CNN
F 3 "~" H 9900 4700 50  0001 C CNN
F 4 "18Pin FPC Top Contact" H 9900 4700 50  0001 C CNN "Comment"
	1    9900 4700
	1    0    0    -1  
$EndComp
$Comp
L Device:C C8
U 1 1 5FECD275
P 9400 4000
F 0 "C8" V 9450 3950 50  0000 R CNN
F 1 "22n" V 9350 3950 50  0000 R CNN
F 2 "Capacitors_SMD:C_0603_HandSoldering" H 9438 3850 50  0001 C CNN
F 3 "~" H 9400 4000 50  0001 C CNN
	1    9400 4000
	0    -1   1    0   
$EndComp
$Comp
L power:GND #PWR014
U 1 1 5FED227E
P 9200 4050
F 0 "#PWR014" H 9200 3800 50  0001 C CNN
F 1 "GND" H 9205 3877 50  0001 C CNN
F 2 "" H 9200 4050 50  0001 C CNN
F 3 "" H 9200 4050 50  0001 C CNN
	1    9200 4050
	1    0    0    -1  
$EndComp
NoConn ~ 9700 4100
Wire Wire Line
	9650 5200 9700 5200
Wire Wire Line
	9650 5100 9700 5100
Wire Wire Line
	9650 5000 9700 5000
Wire Wire Line
	9650 4900 9700 4900
Wire Wire Line
	9650 4800 9700 4800
Wire Wire Line
	9700 4700 9650 4700
Wire Wire Line
	9700 4600 9650 4600
Wire Wire Line
	9650 5100 9650 5200
Connection ~ 9650 5100
Wire Wire Line
	9650 5000 9650 5100
Connection ~ 9650 5000
Wire Wire Line
	9650 4900 9650 5000
Connection ~ 9650 4900
Wire Wire Line
	9650 4800 9650 4900
Connection ~ 9650 4800
Wire Wire Line
	9650 4700 9650 4800
Connection ~ 9650 4700
Wire Wire Line
	9650 4600 9650 4700
Connection ~ 9650 4600
Wire Wire Line
	9700 4500 9650 4500
Connection ~ 9650 4500
Wire Wire Line
	9650 4500 9650 4600
Text Label 9300 4200 0    50   ~ 0
~LCD_RES~
Text Label 9300 4300 0    50   ~ 0
~LCD_CS~
Text Label 9300 4400 0    50   ~ 0
LCD_RS
Text Label 9350 5300 0    50   ~ 0
LCD_SCK
Text Label 9350 5400 0    50   ~ 0
LCD_SI
Text Label 9350 5600 0    50   ~ 0
LCD_LED-
Wire Wire Line
	9200 3900 9200 4000
Wire Wire Line
	9200 4000 9250 4000
Text Label 9350 5500 0    50   ~ 0
LCD_LED+
Wire Wire Line
	9550 4000 9650 4000
Wire Wire Line
	9200 4050 9200 4000
Connection ~ 9200 4000
Wire Wire Line
	9200 3900 9700 3900
Wire Wire Line
	9650 4500 9650 4000
Connection ~ 9650 4000
Wire Wire Line
	9650 4000 9700 4000
$Comp
L Device:Q_PMOS_GSD Q1
U 1 1 6075B220
P 9250 5850
F 0 "Q1" H 9456 5896 50  0000 L CNN
F 1 "IRLML2030" H 9456 5805 50  0000 L CNN
F 2 "TO_SOT_Packages_SMD:SOT-23" H 9450 5950 50  0001 C CNN
F 3 "~" H 9250 5850 50  0001 C CNN
	1    9250 5850
	1    0    0    -1  
$EndComp
Wire Wire Line
	9350 5600 9350 5650
$Comp
L power:GND #PWR015
U 1 1 6075B8C7
P 9350 6150
F 0 "#PWR015" H 9350 5900 50  0001 C CNN
F 1 "GND" H 9355 5977 50  0001 C CNN
F 2 "" H 9350 6150 50  0001 C CNN
F 3 "" H 9350 6150 50  0001 C CNN
	1    9350 6150
	1    0    0    -1  
$EndComp
Wire Wire Line
	9350 6050 9350 6100
$Comp
L Device:C C7
U 1 1 6075BEA8
P 8850 5700
F 0 "C7" V 8900 5650 50  0000 R CNN
F 1 "1µF" V 8800 5650 50  0000 R CNN
F 2 "Capacitors_SMD:C_0603_HandSoldering" H 8888 5550 50  0001 C CNN
F 3 "~" H 8850 5700 50  0001 C CNN
	1    8850 5700
	1    0    0    -1  
$EndComp
$Comp
L Device:R R7
U 1 1 6075CF48
P 9200 5500
F 0 "R7" V 9300 5500 50  0000 C CNN
F 1 "22" V 9350 5500 50  0000 C TNN
F 2 "Resistors_SMD:R_0603_HandSoldering" V 9130 5500 50  0001 C CNN
F 3 "~" H 9200 5500 50  0001 C CNN
	1    9200 5500
	0    1    1    0   
$EndComp
$Comp
L Device:R R6
U 1 1 6075D63A
P 9150 6100
F 0 "R6" V 9050 6100 50  0000 C CNN
F 1 "470k" V 9000 6100 50  0000 C BNN
F 2 "Resistors_SMD:R_0603_HandSoldering" V 9080 6100 50  0001 C CNN
F 3 "~" H 9150 6100 50  0001 C CNN
	1    9150 6100
	0    -1   -1   0   
$EndComp
Wire Wire Line
	9300 6100 9350 6100
Connection ~ 9350 6100
Wire Wire Line
	9350 6100 9350 6150
Wire Wire Line
	9000 6100 9000 5850
Wire Wire Line
	9000 5850 9050 5850
Wire Wire Line
	9050 5500 8850 5500
Wire Wire Line
	9350 5600 9700 5600
Wire Wire Line
	9350 5500 9700 5500
Wire Wire Line
	8850 5900 8850 5850
$Comp
L power:GND #PWR013
U 1 1 6075F846
P 8850 5900
F 0 "#PWR013" H 8850 5650 50  0001 C CNN
F 1 "GND" H 8855 5727 50  0001 C CNN
F 2 "" H 8850 5900 50  0001 C CNN
F 3 "" H 8850 5900 50  0001 C CNN
	1    8850 5900
	1    0    0    -1  
$EndComp
$Comp
L MCU_Module:Arduino_UNO_R3 A1
U 1 1 609A44A8
P 7600 5000
F 0 "A1" H 7950 5950 50  0000 C CNN
F 1 "Arduino_UNO_R3" V 7600 5000 50  0000 C CNN
F 2 "ProjectFootprints:Arduino_UNO_R3_WithMountingHoles" H 7750 3950 50  0001 L CNN
F 3 "https://www.arduino.cc/en/Main/arduinoBoardUno" H 7400 6050 50  0001 C CNN
	1    7600 5000
	-1   0    0    -1  
$EndComp
Wire Wire Line
	8350 5300 8100 5300
Text Label 8100 5200 0    50   ~ 0
XTAL_32K_P
Text Label 8100 5300 0    50   ~ 0
XTAL_32K_N
$Comp
L power:GND #PWR010
U 1 1 60E1B61A
P 7600 6200
F 0 "#PWR010" H 7600 5950 50  0001 C CNN
F 1 "GND" H 7605 6027 50  0001 C CNN
F 2 "" H 7600 6200 50  0001 C CNN
F 3 "" H 7600 6200 50  0001 C CNN
	1    7600 6200
	1    0    0    -1  
$EndComp
Wire Wire Line
	7600 6100 7600 6150
Wire Wire Line
	7700 6100 7700 6150
Wire Wire Line
	7700 6150 7600 6150
Connection ~ 7600 6150
Wire Wire Line
	7600 6150 7600 6200
Wire Wire Line
	7500 6100 7500 6150
Wire Wire Line
	7500 6150 7600 6150
NoConn ~ 7100 4800
NoConn ~ 7700 4000
Wire Wire Line
	9200 4800 9200 5400
Wire Wire Line
	9200 5400 9700 5400
Wire Wire Line
	9300 4900 9300 5300
Wire Wire Line
	9300 5300 9700 5300
Wire Wire Line
	9200 4700 9200 4300
Wire Wire Line
	9150 4600 9150 4400
Wire Wire Line
	9250 5100 9250 4200
Wire Wire Line
	9250 5100 8100 5100
Wire Wire Line
	9300 4900 8100 4900
Wire Wire Line
	9200 4800 8100 4800
Wire Wire Line
	9200 4700 8100 4700
Wire Wire Line
	9150 4600 8100 4600
NoConn ~ 8100 5400
NoConn ~ 8100 5500
Connection ~ 9000 5850
$Comp
L Device:C C6
U 1 1 60789590
P 8550 5400
F 0 "C6" V 8600 5350 50  0000 R CNN
F 1 "1nF" V 8500 5350 50  0000 R CNN
F 2 "Capacitors_SMD:C_0603_HandSoldering" H 8588 5250 50  0001 C CNN
F 3 "~" H 8550 5400 50  0001 C CNN
	1    8550 5400
	-1   0    0    -1  
$EndComp
$Comp
L power:GND #PWR012
U 1 1 60789665
P 8550 5600
F 0 "#PWR012" H 8550 5350 50  0001 C CNN
F 1 "GND" H 8555 5427 50  0001 C CNN
F 2 "" H 8550 5600 50  0001 C CNN
F 3 "" H 8550 5600 50  0001 C CNN
	1    8550 5600
	1    0    0    -1  
$EndComp
Wire Wire Line
	8550 5200 8550 5250
Wire Wire Line
	8100 5200 8550 5200
Wire Wire Line
	8550 5550 8550 5600
$Comp
L 74xGxx:74LVC1GU04 U1
U 1 1 60794537
P 6300 6350
F 0 "U1" H 6300 6450 50  0000 C CNN
F 1 "74LVC1GU04" H 6300 6200 50  0000 C CNN
F 2 "TO_SOT_Packages_SMD:SOT-23-5" H 6300 6350 50  0001 C CNN
F 3 "http://www.ti.com/lit/sg/scyt129e/scyt129e.pdf" H 6300 6350 50  0001 C CNN
	1    6300 6350
	1    0    0    -1  
$EndComp
Wire Wire Line
	6700 3800 6750 3800
$Comp
L Device:C C1
U 1 1 607993EF
P 6750 4000
F 0 "C1" H 7000 4050 50  0000 R CNN
F 1 "22n" H 7000 3950 50  0000 R BNN
F 2 "Capacitors_SMD:C_0603_HandSoldering" H 6788 3850 50  0001 C CNN
F 3 "~" H 6750 4000 50  0001 C CNN
	1    6750 4000
	1    0    0    -1  
$EndComp
$Comp
L Device:R R1
U 1 1 60799576
P 6300 5900
F 0 "R1" V 6200 5900 50  0000 C CNN
F 1 "10M" V 6150 5900 50  0000 C BNN
F 2 "Resistors_SMD:R_0603_HandSoldering" V 6230 5900 50  0001 C CNN
F 3 "~" H 6300 5900 50  0001 C CNN
	1    6300 5900
	0    -1   -1   0   
$EndComp
Wire Wire Line
	6150 5900 5950 5900
Wire Wire Line
	5950 5900 5950 6350
Wire Wire Line
	5950 6350 6000 6350
Wire Wire Line
	6450 5900 6600 5900
Wire Wire Line
	6600 5900 6600 6350
Wire Wire Line
	6600 6350 6550 6350
$Comp
L Device:R R2
U 1 1 6079E2FA
P 6600 6550
F 0 "R2" H 6650 6600 50  0000 L CNN
F 1 "470k" H 6650 6500 50  0000 L BNN
F 2 "Resistors_SMD:R_0603_HandSoldering" V 6530 6550 50  0001 C CNN
F 3 "~" H 6600 6550 50  0001 C CNN
	1    6600 6550
	1    0    0    -1  
$EndComp
Wire Wire Line
	6600 6350 6600 6400
Connection ~ 6600 6350
$Comp
L Device:Crystal_GND3 Y1
U 1 1 607A0DBF
P 6300 6850
F 0 "Y1" H 6300 7100 50  0000 C TNN
F 1 "32.768kHz" H 6300 7000 50  0000 C CNN
F 2 "Crystals:Crystal_C38-LF_d3.0mm_l8.0mm_Horizontal_1EP_style2" H 6300 6850 50  0001 C CNN
F 3 "~" H 6300 6850 50  0001 C CNN
F 4 "DT-38" H 6300 6850 50  0001 C CNN "MPN"
F 5 "KDS" H 6300 6850 50  0001 C CNN "Manufacturer"
	1    6300 6850
	-1   0    0    -1  
$EndComp
Wire Wire Line
	5950 6350 5950 6850
Wire Wire Line
	5950 6850 6150 6850
Connection ~ 5950 6350
Wire Wire Line
	6450 6850 6600 6850
Wire Wire Line
	6600 6850 6600 6700
$Comp
L Device:C C2
U 1 1 607A6408
P 5950 7050
F 0 "C2" H 6200 7100 50  0000 R CNN
F 1 "22p" H 6200 7000 50  0000 R BNN
F 2 "Capacitors_SMD:C_0603_HandSoldering" H 5988 6900 50  0001 C CNN
F 3 "~" H 5950 7050 50  0001 C CNN
	1    5950 7050
	-1   0    0    -1  
$EndComp
$Comp
L Device:C C3
U 1 1 607A646F
P 6600 7050
F 0 "C3" H 6500 7100 50  0000 R CNN
F 1 "22p" H 6500 7000 50  0000 R BNN
F 2 "Capacitors_SMD:C_0603_HandSoldering" H 6638 6900 50  0001 C CNN
F 3 "~" H 6600 7050 50  0001 C CNN
	1    6600 7050
	-1   0    0    -1  
$EndComp
Wire Wire Line
	5950 6850 5950 6900
Connection ~ 5950 6850
Wire Wire Line
	6600 6850 6600 6900
Connection ~ 6600 6850
$Comp
L power:GND #PWR05
U 1 1 607ABEB9
P 6300 7300
F 0 "#PWR05" H 6300 7050 50  0001 C CNN
F 1 "GND" H 6305 7127 50  0001 C CNN
F 2 "" H 6300 7300 50  0001 C CNN
F 3 "" H 6300 7300 50  0001 C CNN
	1    6300 7300
	1    0    0    -1  
$EndComp
Wire Wire Line
	5950 7200 5950 7250
Wire Wire Line
	5950 7250 6300 7250
Wire Wire Line
	6600 7250 6600 7200
Wire Wire Line
	6300 7300 6300 7250
Connection ~ 6300 7250
Wire Wire Line
	6300 7250 6600 7250
Wire Wire Line
	6300 7250 6300 7050
$Comp
L power:GND #PWR02
U 1 1 607B52FD
P 6750 4200
F 0 "#PWR02" H 6750 3950 50  0001 C CNN
F 1 "GND" H 6755 4027 50  0001 C CNN
F 2 "" H 6750 4200 50  0001 C CNN
F 3 "" H 6750 4200 50  0001 C CNN
	1    6750 4200
	-1   0    0    -1  
$EndComp
Wire Wire Line
	6750 4150 6750 4200
$Comp
L power:VCC #PWR01
U 1 1 607B8729
P 6350 3800
F 0 "#PWR01" H 6350 3650 50  0001 C CNN
F 1 "VCC" H 6367 3973 50  0000 C CNN
F 2 "" H 6350 3800 50  0001 C CNN
F 3 "" H 6350 3800 50  0001 C CNN
	1    6350 3800
	0    -1   1    0   
$EndComp
Wire Wire Line
	7500 3800 7500 4000
Wire Wire Line
	9650 3800 9650 4000
NoConn ~ 7100 5700
NoConn ~ 7100 5800
NoConn ~ 7100 4400
$Comp
L Connector_Generic:Conn_02x03_Odd_Even J2
U 1 1 6081D05E
P 5650 5300
F 0 "J2" H 5700 5500 50  0000 C CNN
F 1 "BTN_LEFT" H 5700 5100 50  0000 C CNN
F 2 "Socket_Strips:Socket_Strip_Straight_2x03_Pitch2.54mm" H 5650 5300 50  0001 C CNN
F 3 "~" H 5650 5300 50  0001 C CNN
	1    5650 5300
	1    0    0    -1  
$EndComp
Wire Wire Line
	6150 5300 6150 5050
Wire Wire Line
	5400 5050 5400 5300
Wire Wire Line
	5400 5300 5450 5300
Wire Wire Line
	6100 5400 6100 5300
Wire Wire Line
	6100 5300 5950 5300
Wire Wire Line
	5400 5600 5400 5400
Wire Wire Line
	5400 5400 5450 5400
$Comp
L Device:C C4
U 1 1 608C26B0
P 6750 5800
F 0 "C4" V 6800 5750 50  0000 R CNN
F 1 "10n" V 6700 5750 50  0000 R CNN
F 2 "Capacitors_SMD:C_0603_HandSoldering" H 6788 5650 50  0001 C CNN
F 3 "~" H 6750 5800 50  0001 C CNN
	1    6750 5800
	-1   0    0    -1  
$EndComp
$Comp
L Device:C C5
U 1 1 608C2817
P 6950 5800
F 0 "C5" V 7000 5750 50  0000 R CNN
F 1 "10n" V 6900 5750 50  0000 R CNN
F 2 "Capacitors_SMD:C_0603_HandSoldering" H 6988 5650 50  0001 C CNN
F 3 "~" H 6950 5800 50  0001 C CNN
	1    6950 5800
	-1   0    0    -1  
$EndComp
$Comp
L power:GND #PWR07
U 1 1 608CD1F6
P 6750 6000
F 0 "#PWR07" H 6750 5750 50  0001 C CNN
F 1 "GND" H 6755 5827 50  0001 C CNN
F 2 "" H 6750 6000 50  0001 C CNN
F 3 "" H 6750 6000 50  0001 C CNN
	1    6750 6000
	1    0    0    -1  
$EndComp
Wire Wire Line
	6750 5950 6750 6000
$Comp
L power:GND #PWR08
U 1 1 608D2969
P 6950 6000
F 0 "#PWR08" H 6950 5750 50  0001 C CNN
F 1 "GND" H 6955 5827 50  0001 C CNN
F 2 "" H 6950 6000 50  0001 C CNN
F 3 "" H 6950 6000 50  0001 C CNN
	1    6950 6000
	1    0    0    -1  
$EndComp
Wire Wire Line
	6950 6000 6950 5950
$Comp
L power:GND #PWR04
U 1 1 608DDC6A
P 6000 5450
F 0 "#PWR04" H 6000 5200 50  0001 C CNN
F 1 "GND" H 6005 5277 50  0001 C CNN
F 2 "" H 6000 5450 50  0001 C CNN
F 3 "" H 6000 5450 50  0001 C CNN
	1    6000 5450
	1    0    0    -1  
$EndComp
Wire Wire Line
	5950 5400 6000 5400
Wire Wire Line
	6000 5400 6000 5450
Wire Wire Line
	6100 5400 6150 5400
Wire Wire Line
	5400 5600 6100 5600
Wire Wire Line
	8350 6350 8350 5300
NoConn ~ 8100 5600
NoConn ~ 8100 5700
$Comp
L power:GND #PWR03
U 1 1 60B4512F
P 6050 4750
F 0 "#PWR03" H 6050 4500 50  0001 C CNN
F 1 "GND" H 6055 4577 50  0001 C CNN
F 2 "" H 6050 4750 50  0001 C CNN
F 3 "" H 6050 4750 50  0001 C CNN
	1    6050 4750
	1    0    0    -1  
$EndComp
Wire Wire Line
	6050 4700 6050 4750
Wire Wire Line
	6000 4700 6050 4700
$Comp
L Connector_Generic:Conn_02x02_Odd_Even J1
U 1 1 60B689B3
P 5700 4600
F 0 "J1" H 5750 4700 50  0000 C CNN
F 1 "BTN_RIGHT" H 5750 4400 50  0000 C CNN
F 2 "Socket_Strips:Socket_Strip_Straight_2x02_Pitch2.54mm" H 5700 4600 50  0001 C CNN
F 3 "~" H 5700 4600 50  0001 C CNN
	1    5700 4600
	1    0    0    -1  
$EndComp
$Comp
L power:GND #PWR011
U 1 1 6080B96C
P 8350 4450
F 0 "#PWR011" H 8350 4200 50  0001 C CNN
F 1 "GND" H 8355 4277 50  0001 C CNN
F 2 "" H 8350 4450 50  0001 C CNN
F 3 "" H 8350 4450 50  0001 C CNN
	1    8350 4450
	1    0    0    -1  
$EndComp
Wire Wire Line
	8850 5550 8850 5500
Connection ~ 8850 5500
Wire Wire Line
	8850 5500 8850 3900
Wire Wire Line
	7400 3900 8850 3900
Wire Wire Line
	9650 3800 8900 3800
Connection ~ 7500 3800
$Comp
L Device:R_Pack04 RN1
U 1 1 60A2A502
P 6350 5500
F 0 "RN1" V 6200 5950 50  0000 R CNN
F 1 "10k" V 6100 5950 50  0000 R TNN
F 2 "Resistors_SMD:R_Array_Concave_4x0603" V 6625 5500 50  0001 C CNN
F 3 "~" H 6350 5500 50  0001 C CNN
	1    6350 5500
	0    -1   -1   0   
$EndComp
Wire Wire Line
	6100 5400 6100 5500
Wire Wire Line
	6100 5500 6150 5500
Connection ~ 6100 5400
Wire Wire Line
	6100 5600 6100 5700
Wire Wire Line
	6100 5700 6150 5700
Connection ~ 6100 5600
Wire Wire Line
	6100 5600 6150 5600
Wire Wire Line
	6550 5600 6750 5600
Wire Wire Line
	6750 5600 6750 5650
Wire Wire Line
	6550 5400 6950 5400
Wire Wire Line
	6950 5400 6950 5650
Wire Wire Line
	6550 5700 6600 5700
Wire Wire Line
	6600 5700 6600 5500
Wire Wire Line
	6600 5500 6550 5500
NoConn ~ 5450 5200
$Comp
L Device:R_Pack04 RN2
U 1 1 60AC471C
P 6650 4800
F 0 "RN2" V 6250 4800 50  0000 C TNN
F 1 "10k" V 6350 4800 50  0000 C CNN
F 2 "Resistors_SMD:R_Array_Concave_4x0603" V 6925 4800 50  0001 C CNN
F 3 "~" H 6650 4800 50  0001 C CNN
	1    6650 4800
	0    -1   1    0   
$EndComp
Wire Wire Line
	6750 5600 7050 5600
Connection ~ 6750 5600
Wire Wire Line
	6950 5400 7100 5400
Connection ~ 6950 5400
Connection ~ 6600 5500
Wire Wire Line
	6250 5000 7100 5000
Wire Wire Line
	5400 5050 6150 5050
Wire Wire Line
	5450 4600 5500 4600
Wire Wire Line
	7050 5600 7050 5500
Wire Wire Line
	7050 5500 7100 5500
Wire Wire Line
	6900 5500 6600 5500
$Comp
L Device:R_Pack04 RN3
U 1 1 60D0D188
P 8600 4200
F 0 "RN3" H 8350 4150 50  0000 R CNN
F 1 "10k" H 8350 4250 50  0000 R TNN
F 2 "Resistors_SMD:R_Array_Concave_4x0603" V 8875 4200 50  0001 C CNN
F 3 "~" H 8600 4200 50  0001 C CNN
	1    8600 4200
	0    1    -1   0   
$EndComp
Wire Wire Line
	9150 4400 8800 4400
Connection ~ 9150 4400
Wire Wire Line
	9200 4300 8800 4300
Connection ~ 9200 4300
Wire Wire Line
	9250 4200 8800 4200
Connection ~ 9250 4200
Wire Wire Line
	9250 4200 9700 4200
Wire Wire Line
	9200 4300 9700 4300
Wire Wire Line
	9150 4400 9700 4400
Wire Wire Line
	8350 4450 8350 4400
Wire Wire Line
	8350 4200 8400 4200
Wire Wire Line
	8400 4300 8350 4300
Connection ~ 8350 4300
Wire Wire Line
	8350 4300 8350 4200
Wire Wire Line
	8400 4400 8350 4400
Connection ~ 8350 4400
Wire Wire Line
	8350 4400 8350 4300
Wire Wire Line
	8400 4100 8150 4100
Connection ~ 8150 4100
Wire Wire Line
	8150 4100 8150 3700
Wire Wire Line
	9000 5000 9000 5150
Wire Wire Line
	8800 4100 8900 4100
Wire Wire Line
	8900 4100 8900 3800
Connection ~ 8900 3800
Wire Wire Line
	8900 3800 7500 3800
Wire Wire Line
	7400 4000 7400 3900
Connection ~ 6900 3800
Wire Wire Line
	6900 3800 7500 3800
Wire Wire Line
	6900 3800 6900 4600
Wire Wire Line
	6850 4600 6900 4600
Connection ~ 6900 4600
Wire Wire Line
	6900 4600 6900 4700
Wire Wire Line
	6850 4700 6900 4700
Connection ~ 6900 4700
Wire Wire Line
	6900 4700 6900 4800
Wire Wire Line
	6850 4800 6900 4800
Connection ~ 6900 4800
Wire Wire Line
	6900 4800 6900 4900
Wire Wire Line
	6850 4900 6900 4900
Connection ~ 6900 4900
Wire Wire Line
	6900 4900 6900 5500
NoConn ~ 7100 4600
$Comp
L Device:R R5
U 1 1 60E52CE9
P 9000 5300
F 0 "R5" V 9100 5300 50  0000 C CNN
F 1 "4.7k" V 9150 5300 50  0000 C TNN
F 2 "Resistors_SMD:R_0603_HandSoldering" V 8930 5300 50  0001 C CNN
F 3 "~" H 9000 5300 50  0001 C CNN
	1    9000 5300
	-1   0    0    1   
$EndComp
Wire Wire Line
	9000 5450 9000 5850
NoConn ~ 8100 4500
$Comp
L Device:R R3
U 1 1 60E66EB2
P 6550 3800
F 0 "R3" V 6450 3800 50  0000 C CNN
F 1 "100k" V 6400 3800 50  0000 C BNN
F 2 "Resistors_SMD:R_0603_HandSoldering" V 6480 3800 50  0001 C CNN
F 3 "~" H 6550 3800 50  0001 C CNN
	1    6550 3800
	0    1    -1   0   
$EndComp
Wire Wire Line
	6400 3800 6350 3800
Wire Wire Line
	6750 3850 6750 3800
Wire Wire Line
	6600 6350 8350 6350
Connection ~ 6750 3800
Wire Wire Line
	6750 3800 6900 3800
Wire Wire Line
	8150 5000 8100 5000
Wire Wire Line
	8150 4100 8150 5000
Wire Wire Line
	8100 4400 8250 4400
Wire Wire Line
	8250 4400 8250 5000
Wire Wire Line
	8250 5000 9000 5000
Wire Wire Line
	5450 4600 5450 4450
Wire Wire Line
	5450 4450 6250 4450
Wire Wire Line
	6200 4600 6000 4600
Wire Wire Line
	6200 5100 7100 5100
Wire Wire Line
	5400 4700 5400 3700
Wire Wire Line
	5400 4700 5500 4700
Wire Wire Line
	5400 3700 8150 3700
Wire Wire Line
	6200 4700 6200 5100
Wire Wire Line
	6200 4600 6200 4700
Connection ~ 6200 4700
Wire Wire Line
	6200 4700 6450 4700
Wire Wire Line
	6350 4800 6450 4800
Wire Wire Line
	6450 4900 6400 4900
Wire Wire Line
	6400 5300 7100 5300
Wire Wire Line
	6150 5300 6400 5300
Connection ~ 6400 5300
Wire Wire Line
	6400 4900 6400 5300
Wire Wire Line
	6350 5200 7100 5200
Wire Wire Line
	5950 5200 6350 5200
Connection ~ 6350 5200
Wire Wire Line
	6350 5200 6350 4800
Wire Wire Line
	6250 4450 6250 4600
Wire Wire Line
	6250 4600 6250 5000
Connection ~ 6250 4600
Wire Wire Line
	6450 4600 6250 4600
Wire Notes Line
	6100 3750 6850 3750
Wire Notes Line
	6850 3750 6850 4350
Wire Notes Line
	6850 4350 6100 4350
Wire Notes Line
	6100 4350 6100 3750
Text Notes 6100 4300 0    50   ~ 0
Powersupply for\n74LVC1G04
Wire Notes Line
	6650 5800 5400 5800
Wire Notes Line
	5400 5800 5400 7450
Wire Notes Line
	5400 7450 6900 7450
Wire Notes Line
	6900 7450 6900 6300
Wire Notes Line
	6900 6300 6650 6300
Wire Notes Line
	6650 6300 6650 5800
Text Notes 5400 6550 0    50   ~ 0
Low-Power\nCrystal-Osc\n\nRemind\nPower-Supply\nabove!\n\nMeasured\n13µA@3.3V
$EndSCHEMATC
