(kicad_pcb (version 20171130) (host pcbnew 5.0.2+dfsg1-1)

  (general
    (thickness 1.6)
    (drawings 8)
    (tracks 70)
    (zones 0)
    (modules 3)
    (nets 9)
  )

  (page A4)
  (title_block
    (title "Powertip PE12864LRF-042-H-Q Breadboard adapter")
    (date 2020-12-31)
    (rev 1)
    (company "Copyright (c) 2020 Andreas Messer")
    (comment 1 "This work is licensed under a Creative Commons Attribution 4.0 International License.")
  )

  (layers
    (0 F.Cu signal)
    (31 B.Cu signal)
    (32 B.Adhes user)
    (33 F.Adhes user)
    (34 B.Paste user)
    (35 F.Paste user)
    (36 B.SilkS user)
    (37 F.SilkS user)
    (38 B.Mask user)
    (39 F.Mask user)
    (40 Dwgs.User user)
    (41 Cmts.User user)
    (42 Eco1.User user)
    (43 Eco2.User user)
    (44 Edge.Cuts user)
    (45 Margin user)
    (46 B.CrtYd user)
    (47 F.CrtYd user)
    (48 B.Fab user)
    (49 F.Fab user)
  )

  (setup
    (last_trace_width 0.4)
    (trace_clearance 0.3)
    (zone_clearance 0.508)
    (zone_45_only no)
    (trace_min 0.3)
    (segment_width 0.2)
    (edge_width 0.15)
    (via_size 1.3)
    (via_drill 0.8)
    (via_min_size 0.4)
    (via_min_drill 0.3)
    (uvia_size 1)
    (uvia_drill 0.5)
    (uvias_allowed no)
    (uvia_min_size 0.2)
    (uvia_min_drill 0.1)
    (pcb_text_width 0.3)
    (pcb_text_size 1.5 1.5)
    (mod_edge_width 0.15)
    (mod_text_size 1 1)
    (mod_text_width 0.15)
    (pad_size 1.524 1.524)
    (pad_drill 0.762)
    (pad_to_mask_clearance 0.051)
    (solder_mask_min_width 0.25)
    (aux_axis_origin 0 0)
    (grid_origin 78.74 49.53)
    (visible_elements FFFFFF7F)
    (pcbplotparams
      (layerselection 0x00000_7fffffff)
      (usegerberextensions false)
      (usegerberattributes false)
      (usegerberadvancedattributes false)
      (creategerberjobfile false)
      (excludeedgelayer false)
      (linewidth 0.050000)
      (plotframeref false)
      (viasonmask false)
      (mode 1)
      (useauxorigin false)
      (hpglpennumber 1)
      (hpglpenspeed 20)
      (hpglpendiameter 15.000000)
      (psnegative false)
      (psa4output false)
      (plotreference true)
      (plotvalue true)
      (plotinvisibletext false)
      (padsonsilk false)
      (subtractmaskfromsilk false)
      (outputformat 5)
      (mirror true)
      (drillshape 1)
      (scaleselection 1)
      (outputdirectory "/tmp/"))
  )

  (net 0 "")
  (net 1 GND)
  (net 2 /VDD)
  (net 3 /LED_K)
  (net 4 /SI)
  (net 5 /SCK)
  (net 6 /RS)
  (net 7 /~CS~)
  (net 8 /~RES~)

  (net_class Default "Dies ist die voreingestellte Netzklasse."
    (clearance 0.3)
    (trace_width 0.4)
    (via_dia 1.3)
    (via_drill 0.8)
    (uvia_dia 1)
    (uvia_drill 0.5)
    (diff_pair_gap 0.3)
    (diff_pair_width 0.3)
    (add_net /LED_K)
    (add_net /RS)
    (add_net /SCK)
    (add_net /SI)
    (add_net /VDD)
    (add_net /~CS~)
    (add_net /~RES~)
    (add_net GND)
  )

  (module Capacitors_SMD:C_0603_HandSoldering (layer F.Cu) (tedit 58AA848B) (tstamp 5FED0B9F)
    (at 78.74 38.1 180)
    (descr "Capacitor SMD 0603, hand soldering")
    (tags "capacitor 0603")
    (path /5FECD275)
    (attr smd)
    (fp_text reference C1 (at 0 -1.25 180) (layer F.SilkS)
      (effects (font (size 1 1) (thickness 0.15)))
    )
    (fp_text value 22n (at 0 1.5 180) (layer F.Fab)
      (effects (font (size 1 1) (thickness 0.15)))
    )
    (fp_line (start 1.8 0.65) (end -1.8 0.65) (layer F.CrtYd) (width 0.05))
    (fp_line (start 1.8 0.65) (end 1.8 -0.65) (layer F.CrtYd) (width 0.05))
    (fp_line (start -1.8 -0.65) (end -1.8 0.65) (layer F.CrtYd) (width 0.05))
    (fp_line (start -1.8 -0.65) (end 1.8 -0.65) (layer F.CrtYd) (width 0.05))
    (fp_line (start 0.35 0.6) (end -0.35 0.6) (layer F.SilkS) (width 0.12))
    (fp_line (start -0.35 -0.6) (end 0.35 -0.6) (layer F.SilkS) (width 0.12))
    (fp_line (start -0.8 -0.4) (end 0.8 -0.4) (layer F.Fab) (width 0.1))
    (fp_line (start 0.8 -0.4) (end 0.8 0.4) (layer F.Fab) (width 0.1))
    (fp_line (start 0.8 0.4) (end -0.8 0.4) (layer F.Fab) (width 0.1))
    (fp_line (start -0.8 0.4) (end -0.8 -0.4) (layer F.Fab) (width 0.1))
    (fp_text user %R (at 0 -1.25 180) (layer F.Fab)
      (effects (font (size 1 1) (thickness 0.15)))
    )
    (pad 2 smd rect (at 0.95 0 180) (size 1.2 0.75) (layers F.Cu F.Paste F.Mask)
      (net 1 GND))
    (pad 1 smd rect (at -0.95 0 180) (size 1.2 0.75) (layers F.Cu F.Paste F.Mask)
      (net 2 /VDD))
    (model Capacitors_SMD.3dshapes/C_0603.wrl
      (at (xyz 0 0 0))
      (scale (xyz 1 1 1))
      (rotate (xyz 0 0 0))
    )
  )

  (module Pin_Headers:Pin_Header_Straight_1x08_Pitch2.54mm (layer F.Cu) (tedit 59650532) (tstamp 5FED0B41)
    (at 78.74 40.64)
    (descr "Through hole straight pin header, 1x08, 2.54mm pitch, single row")
    (tags "Through hole pin header THT 1x08 2.54mm single row")
    (path /5FEEBB8E)
    (fp_text reference J1 (at 0 -2.33) (layer F.SilkS)
      (effects (font (size 1 1) (thickness 0.15)))
    )
    (fp_text value Pinheader (at 0 20.11) (layer F.Fab)
      (effects (font (size 1 1) (thickness 0.15)))
    )
    (fp_text user %R (at 0 8.89 90) (layer F.Fab)
      (effects (font (size 1 1) (thickness 0.15)))
    )
    (fp_line (start 1.8 -1.8) (end -1.8 -1.8) (layer F.CrtYd) (width 0.05))
    (fp_line (start 1.8 19.55) (end 1.8 -1.8) (layer F.CrtYd) (width 0.05))
    (fp_line (start -1.8 19.55) (end 1.8 19.55) (layer F.CrtYd) (width 0.05))
    (fp_line (start -1.8 -1.8) (end -1.8 19.55) (layer F.CrtYd) (width 0.05))
    (fp_line (start -1.33 -1.33) (end 0 -1.33) (layer F.SilkS) (width 0.12))
    (fp_line (start -1.33 0) (end -1.33 -1.33) (layer F.SilkS) (width 0.12))
    (fp_line (start -1.33 1.27) (end 1.33 1.27) (layer F.SilkS) (width 0.12))
    (fp_line (start 1.33 1.27) (end 1.33 19.11) (layer F.SilkS) (width 0.12))
    (fp_line (start -1.33 1.27) (end -1.33 19.11) (layer F.SilkS) (width 0.12))
    (fp_line (start -1.33 19.11) (end 1.33 19.11) (layer F.SilkS) (width 0.12))
    (fp_line (start -1.27 -0.635) (end -0.635 -1.27) (layer F.Fab) (width 0.1))
    (fp_line (start -1.27 19.05) (end -1.27 -0.635) (layer F.Fab) (width 0.1))
    (fp_line (start 1.27 19.05) (end -1.27 19.05) (layer F.Fab) (width 0.1))
    (fp_line (start 1.27 -1.27) (end 1.27 19.05) (layer F.Fab) (width 0.1))
    (fp_line (start -0.635 -1.27) (end 1.27 -1.27) (layer F.Fab) (width 0.1))
    (pad 8 thru_hole oval (at 0 17.78) (size 1.7 1.7) (drill 1) (layers *.Cu *.Mask)
      (net 3 /LED_K))
    (pad 7 thru_hole oval (at 0 15.24) (size 1.7 1.7) (drill 1) (layers *.Cu *.Mask)
      (net 4 /SI))
    (pad 6 thru_hole oval (at 0 12.7) (size 1.7 1.7) (drill 1) (layers *.Cu *.Mask)
      (net 5 /SCK))
    (pad 5 thru_hole oval (at 0 10.16) (size 1.7 1.7) (drill 1) (layers *.Cu *.Mask)
      (net 2 /VDD))
    (pad 4 thru_hole oval (at 0 7.62) (size 1.7 1.7) (drill 1) (layers *.Cu *.Mask)
      (net 6 /RS))
    (pad 3 thru_hole oval (at 0 5.08) (size 1.7 1.7) (drill 1) (layers *.Cu *.Mask)
      (net 7 /~CS~))
    (pad 2 thru_hole oval (at 0 2.54) (size 1.7 1.7) (drill 1) (layers *.Cu *.Mask)
      (net 8 /~RES~))
    (pad 1 thru_hole rect (at 0 0) (size 1.7 1.7) (drill 1) (layers *.Cu *.Mask)
      (net 1 GND))
    (model ${KISYS3DMOD}/Pin_Headers.3dshapes/Pin_Header_Straight_1x08_Pitch2.54mm.wrl
      (at (xyz 0 0 0))
      (scale (xyz 1 1 1))
      (rotate (xyz 0 0 0))
    )
  )

  (module Connector_FFC-FPC:TE_1-84953-8_1x18-1MP_P1.0mm_Horizontal (layer F.Cu) (tedit 5AEE14E3) (tstamp 5FED0AAF)
    (at 73.6092 49.53 270)
    (descr "TE FPC connector, 18 top-side contacts, 1.0mm pitch, 1.0mm height, SMT, http://www.te.com/commerce/DocumentDelivery/DDEController?Action=srchrtrv&DocNm=84953&DocType=Customer+Drawing&DocLang=English&DocFormat=pdf&PartCntxt=84953-4")
    (tags "te fpc 84953")
    (path /5FECA72B)
    (attr smd)
    (fp_text reference J2 (at 0 -4 270) (layer F.SilkS)
      (effects (font (size 1 1) (thickness 0.15)))
    )
    (fp_text value "18Pin FPC Top Contact" (at 0 7.7 270) (layer F.Fab)
      (effects (font (size 1 1) (thickness 0.15)))
    )
    (fp_line (start -11.935 -0.8) (end 11.935 -0.8) (layer F.Fab) (width 0.1))
    (fp_line (start 11.935 -0.8) (end 11.935 3.71) (layer F.Fab) (width 0.1))
    (fp_line (start 11.935 3.71) (end 12.96 3.71) (layer F.Fab) (width 0.1))
    (fp_line (start 12.96 3.71) (end 12.96 4.6) (layer F.Fab) (width 0.1))
    (fp_line (start 12.96 4.6) (end -12.96 4.6) (layer F.Fab) (width 0.1))
    (fp_line (start -12.96 4.6) (end -12.96 3.71) (layer F.Fab) (width 0.1))
    (fp_line (start -12.96 3.71) (end -11.935 3.71) (layer F.Fab) (width 0.1))
    (fp_line (start -11.935 3.71) (end -11.935 -0.8) (layer F.Fab) (width 0.1))
    (fp_line (start -9 -0.8) (end -8.5 0.2) (layer F.Fab) (width 0.1))
    (fp_line (start -8.5 0.2) (end -8 -0.8) (layer F.Fab) (width 0.1))
    (fp_line (start 11.935 4.6) (end 11.935 5.61) (layer F.Fab) (width 0.1))
    (fp_line (start 11.935 5.61) (end 12.96 5.61) (layer F.Fab) (width 0.1))
    (fp_line (start 12.96 5.61) (end 12.96 6.5) (layer F.Fab) (width 0.1))
    (fp_line (start 12.96 6.5) (end -12.96 6.5) (layer F.Fab) (width 0.1))
    (fp_line (start -12.96 6.5) (end -12.96 5.61) (layer F.Fab) (width 0.1))
    (fp_line (start -12.96 5.61) (end -11.935 5.61) (layer F.Fab) (width 0.1))
    (fp_line (start -11.935 5.61) (end -11.935 4.6) (layer F.Fab) (width 0.1))
    (fp_line (start 12.045 3.06) (end 12.045 3.6) (layer F.SilkS) (width 0.12))
    (fp_line (start 12.045 3.6) (end 13.07 3.6) (layer F.SilkS) (width 0.12))
    (fp_line (start 13.07 3.6) (end 13.07 4.71) (layer F.SilkS) (width 0.12))
    (fp_line (start 13.07 4.71) (end -13.07 4.71) (layer F.SilkS) (width 0.12))
    (fp_line (start -13.07 4.71) (end -13.07 3.6) (layer F.SilkS) (width 0.12))
    (fp_line (start -13.07 3.6) (end -12.045 3.6) (layer F.SilkS) (width 0.12))
    (fp_line (start -12.045 3.6) (end -12.045 3.06) (layer F.SilkS) (width 0.12))
    (fp_line (start -9.89 -0.91) (end -9.065 -0.91) (layer F.SilkS) (width 0.12))
    (fp_line (start -9.065 -0.91) (end -9.065 -2.71) (layer F.SilkS) (width 0.12))
    (fp_line (start 9.065 -0.91) (end 9.89 -0.91) (layer F.SilkS) (width 0.12))
    (fp_line (start -13.46 -3.3) (end -13.46 7) (layer F.CrtYd) (width 0.05))
    (fp_line (start -13.46 7) (end 13.46 7) (layer F.CrtYd) (width 0.05))
    (fp_line (start 13.46 7) (end 13.46 -3.3) (layer F.CrtYd) (width 0.05))
    (fp_line (start 13.46 -3.3) (end -13.46 -3.3) (layer F.CrtYd) (width 0.05))
    (fp_text user %R (at 0 1.9 270) (layer F.Fab)
      (effects (font (size 1 1) (thickness 0.15)))
    )
    (pad 1 smd rect (at -8.5 -1.8 270) (size 0.61 2) (layers F.Cu F.Paste F.Mask)
      (net 1 GND))
    (pad 2 smd rect (at -7.5 -1.8 270) (size 0.61 2) (layers F.Cu F.Paste F.Mask)
      (net 2 /VDD))
    (pad 3 smd rect (at -6.5 -1.8 270) (size 0.61 2) (layers F.Cu F.Paste F.Mask))
    (pad 4 smd rect (at -5.5 -1.8 270) (size 0.61 2) (layers F.Cu F.Paste F.Mask)
      (net 8 /~RES~))
    (pad 5 smd rect (at -4.5 -1.8 270) (size 0.61 2) (layers F.Cu F.Paste F.Mask)
      (net 7 /~CS~))
    (pad 6 smd rect (at -3.5 -1.8 270) (size 0.61 2) (layers F.Cu F.Paste F.Mask)
      (net 6 /RS))
    (pad 7 smd rect (at -2.5 -1.8 270) (size 0.61 2) (layers F.Cu F.Paste F.Mask)
      (net 2 /VDD))
    (pad 8 smd rect (at -1.5 -1.8 270) (size 0.61 2) (layers F.Cu F.Paste F.Mask)
      (net 2 /VDD))
    (pad 9 smd rect (at -0.5 -1.8 270) (size 0.61 2) (layers F.Cu F.Paste F.Mask)
      (net 2 /VDD))
    (pad 10 smd rect (at 0.5 -1.8 270) (size 0.61 2) (layers F.Cu F.Paste F.Mask)
      (net 2 /VDD))
    (pad 11 smd rect (at 1.5 -1.8 270) (size 0.61 2) (layers F.Cu F.Paste F.Mask)
      (net 2 /VDD))
    (pad 12 smd rect (at 2.5 -1.8 270) (size 0.61 2) (layers F.Cu F.Paste F.Mask)
      (net 2 /VDD))
    (pad 13 smd rect (at 3.5 -1.8 270) (size 0.61 2) (layers F.Cu F.Paste F.Mask)
      (net 2 /VDD))
    (pad 14 smd rect (at 4.5 -1.8 270) (size 0.61 2) (layers F.Cu F.Paste F.Mask)
      (net 2 /VDD))
    (pad 15 smd rect (at 5.5 -1.8 270) (size 0.61 2) (layers F.Cu F.Paste F.Mask)
      (net 5 /SCK))
    (pad 16 smd rect (at 6.5 -1.8 270) (size 0.61 2) (layers F.Cu F.Paste F.Mask)
      (net 4 /SI))
    (pad 17 smd rect (at 7.5 -1.8 270) (size 0.61 2) (layers F.Cu F.Paste F.Mask)
      (net 2 /VDD))
    (pad 18 smd rect (at 8.5 -1.8 270) (size 0.61 2) (layers F.Cu F.Paste F.Mask)
      (net 3 /LED_K))
    (pad MP smd rect (at -11.49 1 270) (size 2.68 3.6) (layers F.Cu F.Paste F.Mask))
    (pad MP smd rect (at 11.49 1 270) (size 2.68 3.6) (layers F.Cu F.Paste F.Mask))
    (model ${KISYS3DMOD}/Connector_FFC-FPC.3dshapes/TE_1-84953-8_1x18-1MP_P1.0mm_Horizontal.wrl
      (at (xyz 0 0 0))
      (scale (xyz 1 1 1))
      (rotate (xyz 0 0 0))
    )
  )

  (gr_text PE12864LRF-042-H-Q (at 71.12 49.53 90) (layer F.Cu)
    (effects (font (size 1.5 1.1) (thickness 0.2)))
  )
  (gr_text 18 (at 76.3016 61.6204) (layer F.Cu)
    (effects (font (size 1.5 1.5) (thickness 0.3)))
  )
  (gr_line (start 68.7324 62.7888) (end 68.7324 36.2712) (layer Edge.Cuts) (width 0.2))
  (gr_line (start 80.7212 62.7888) (end 68.7324 62.7888) (layer Edge.Cuts) (width 0.2))
  (gr_line (start 80.7212 61.3156) (end 80.7212 62.7888) (layer Edge.Cuts) (width 0.2))
  (gr_line (start 80.7212 36.2712) (end 80.7212 61.3156) (layer Edge.Cuts) (width 0.2))
  (gr_line (start 78.5368 36.2712) (end 80.7212 36.2712) (layer Edge.Cuts) (width 0.2))
  (gr_line (start 68.7324 36.2712) (end 78.5368 36.2712) (layer Edge.Cuts) (width 0.2))

  (segment (start 78.35 41.03) (end 78.74 40.64) (width 0.4) (layer F.Cu) (net 1) (tstamp 5FED0BC6))
  (segment (start 77.79 38.1) (end 77.79 40.964) (width 0.4) (layer F.Cu) (net 1) (tstamp 5FED0A1F))
  (segment (start 75.4092 41.03) (end 77.724 41.03) (width 0.4) (layer F.Cu) (net 1) (tstamp 5FED0A61))
  (segment (start 77.79 40.964) (end 77.724 41.03) (width 0.4) (layer F.Cu) (net 1) (tstamp 5FED0A5B))
  (segment (start 77.724 41.03) (end 78.35 41.03) (width 0.4) (layer F.Cu) (net 1) (tstamp 5FED0A19))
  (segment (start 73.5768 42.03) (end 73.5584 42.0116) (width 0.4) (layer F.Cu) (net 2) (tstamp 5FED0A70))
  (segment (start 75.4092 42.03) (end 73.5768 42.03) (width 0.4) (layer F.Cu) (net 2) (tstamp 5FED0A49))
  (segment (start 73.5692 47.03) (end 73.5584 47.0408) (width 0.4) (layer F.Cu) (net 2) (tstamp 5FED0B84))
  (segment (start 75.4092 47.03) (end 73.5692 47.03) (width 0.4) (layer F.Cu) (net 2) (tstamp 5FED0A6D))
  (segment (start 73.5584 47.0408) (end 73.5584 42.0116) (width 0.4) (layer F.Cu) (net 2) (tstamp 5FED0A04))
  (segment (start 73.5824 48.03) (end 73.5584 48.006) (width 0.4) (layer F.Cu) (net 2) (tstamp 5FED0A10))
  (segment (start 75.4092 48.03) (end 73.5824 48.03) (width 0.4) (layer F.Cu) (net 2) (tstamp 5FED0A0A))
  (segment (start 73.5584 48.006) (end 73.5584 47.0408) (width 0.4) (layer F.Cu) (net 2) (tstamp 5FED0B7B))
  (segment (start 74.0092 49.03) (end 74.0012 49.022) (width 0.4) (layer F.Cu) (net 2) (tstamp 5FED0A46))
  (segment (start 74.0012 49.022) (end 73.5584 49.022) (width 0.4) (layer F.Cu) (net 2) (tstamp 5FED0A1C))
  (segment (start 75.4092 49.03) (end 74.0092 49.03) (width 0.4) (layer F.Cu) (net 2) (tstamp 5FED0BD5))
  (segment (start 73.5584 49.022) (end 73.5584 48.006) (width 0.4) (layer F.Cu) (net 2) (tstamp 5FED0A55))
  (segment (start 75.4092 50.03) (end 73.5664 50.03) (width 0.4) (layer F.Cu) (net 2) (tstamp 5FED0A2B))
  (segment (start 73.5664 50.03) (end 73.5584 50.038) (width 0.4) (layer F.Cu) (net 2) (tstamp 5FED0BDB))
  (segment (start 73.5584 50.038) (end 73.5584 49.022) (width 0.4) (layer F.Cu) (net 2) (tstamp 5FED0BDE))
  (segment (start 73.5852 51.03) (end 73.5584 51.0032) (width 0.4) (layer F.Cu) (net 2) (tstamp 5FED09FE))
  (segment (start 75.4092 51.03) (end 73.5852 51.03) (width 0.4) (layer F.Cu) (net 2) (tstamp 5FED0B24))
  (segment (start 73.5584 51.0032) (end 73.5584 50.038) (width 0.4) (layer F.Cu) (net 2) (tstamp 5FED0BCF))
  (segment (start 73.5692 52.03) (end 73.5584 52.0192) (width 0.4) (layer F.Cu) (net 2) (tstamp 5FED09F2))
  (segment (start 75.4092 52.03) (end 73.5692 52.03) (width 0.4) (layer F.Cu) (net 2) (tstamp 5FED0A22))
  (segment (start 73.5584 52.0192) (end 73.5584 51.0032) (width 0.4) (layer F.Cu) (net 2) (tstamp 5FED09F8))
  (segment (start 73.5584 53.0352) (end 73.5584 52.0192) (width 0.4) (layer F.Cu) (net 2) (tstamp 5FED0A73))
  (segment (start 73.588 54.03) (end 73.5584 54.0004) (width 0.4) (layer F.Cu) (net 2) (tstamp 5FED0A07))
  (segment (start 75.4092 54.03) (end 73.588 54.03) (width 0.4) (layer F.Cu) (net 2) (tstamp 5FED0A2E))
  (segment (start 73.5584 54.0004) (end 73.5584 53.0352) (width 0.4) (layer F.Cu) (net 2) (tstamp 5FED09EC))
  (segment (start 74.004 53.0352) (end 73.5584 53.0352) (width 0.4) (layer F.Cu) (net 2) (tstamp 5FED0A52))
  (segment (start 75.4092 53.03) (end 75.404 53.0352) (width 0.4) (layer F.Cu) (net 2) (tstamp 5FED0A0D))
  (segment (start 75.404 53.0352) (end 74.004 53.0352) (width 0.4) (layer F.Cu) (net 2) (tstamp 5FED0B81))
  (segment (start 80.2132 39.3982) (end 80.2132 50.546) (width 0.4) (layer F.Cu) (net 2) (tstamp 5FED0A16))
  (segment (start 79.69 38.1) (end 79.69 38.875) (width 0.4) (layer F.Cu) (net 2) (tstamp 5FED0A58))
  (segment (start 79.69 38.875) (end 80.2132 39.3982) (width 0.4) (layer F.Cu) (net 2) (tstamp 5FED0B8D))
  (segment (start 80.2132 50.8) (end 78.74 50.8) (width 0.4) (layer F.Cu) (net 2) (tstamp 5FED0BC3))
  (segment (start 80.2132 50.546) (end 80.2132 50.8) (width 0.4) (layer F.Cu) (net 2) (tstamp 5FED0B7E))
  (segment (start 79.69 37.325) (end 79.69 38.1) (width 0.4) (layer F.Cu) (net 2))
  (segment (start 73.5584 40.4368) (end 74.0156 39.9796) (width 0.4) (layer F.Cu) (net 2))
  (segment (start 79.3982 37.0332) (end 79.69 37.325) (width 0.4) (layer F.Cu) (net 2))
  (segment (start 74.0156 39.9796) (end 75.184 39.9796) (width 0.4) (layer F.Cu) (net 2))
  (segment (start 76.6572 37.0332) (end 79.3982 37.0332) (width 0.4) (layer F.Cu) (net 2))
  (segment (start 73.5584 42.0116) (end 73.5584 40.4368) (width 0.4) (layer F.Cu) (net 2))
  (segment (start 75.184 39.9796) (end 75.7936 39.37) (width 0.4) (layer F.Cu) (net 2))
  (segment (start 75.7936 39.37) (end 75.7936 37.8968) (width 0.4) (layer F.Cu) (net 2))
  (segment (start 75.7936 37.8968) (end 76.6572 37.0332) (width 0.4) (layer F.Cu) (net 2))
  (segment (start 80.2132 59.5376) (end 80.2132 50.546) (width 0.4) (layer F.Cu) (net 2))
  (segment (start 79.3496 60.4012) (end 80.2132 59.5376) (width 0.4) (layer F.Cu) (net 2))
  (segment (start 78.2828 60.4012) (end 79.3496 60.4012) (width 0.4) (layer F.Cu) (net 2))
  (segment (start 74.0092 57.03) (end 73.66 57.3792) (width 0.4) (layer F.Cu) (net 2))
  (segment (start 75.4092 57.03) (end 74.0092 57.03) (width 0.4) (layer F.Cu) (net 2))
  (segment (start 73.66 58.485802) (end 74.102198 58.928) (width 0.4) (layer F.Cu) (net 2))
  (segment (start 73.66 57.3792) (end 73.66 58.485802) (width 0.4) (layer F.Cu) (net 2))
  (segment (start 74.102198 58.928) (end 76.8096 58.928) (width 0.4) (layer F.Cu) (net 2))
  (segment (start 76.8096 58.928) (end 78.2828 60.4012) (width 0.4) (layer F.Cu) (net 2))
  (segment (start 78.35 58.03) (end 78.74 58.42) (width 0.4) (layer F.Cu) (net 3) (tstamp 5FED09E9))
  (segment (start 75.4092 58.03) (end 78.35 58.03) (width 0.4) (layer F.Cu) (net 3) (tstamp 5FED0A40))
  (segment (start 78.59 56.03) (end 78.74 55.88) (width 0.4) (layer F.Cu) (net 4) (tstamp 5FED09FB))
  (segment (start 75.4092 56.03) (end 78.59 56.03) (width 0.4) (layer F.Cu) (net 4) (tstamp 5FED0A34))
  (segment (start 78.3844 53.34) (end 78.74 53.34) (width 0.4) (layer F.Cu) (net 5) (tstamp 5FED09EF))
  (segment (start 75.4092 55.03) (end 76.6944 55.03) (width 0.4) (layer F.Cu) (net 5) (tstamp 5FED0A43))
  (segment (start 76.6944 55.03) (end 78.3844 53.34) (width 0.4) (layer F.Cu) (net 5) (tstamp 5FED0B8A))
  (segment (start 76.51 46.03) (end 78.74 48.26) (width 0.4) (layer F.Cu) (net 6) (tstamp 5FED0A37))
  (segment (start 75.4092 46.03) (end 76.51 46.03) (width 0.4) (layer F.Cu) (net 6) (tstamp 5FED0BC0))
  (segment (start 78.05 45.03) (end 78.74 45.72) (width 0.4) (layer F.Cu) (net 7) (tstamp 5FED0B21))
  (segment (start 75.4092 45.03) (end 78.05 45.03) (width 0.4) (layer F.Cu) (net 7) (tstamp 5FED0A3A))
  (segment (start 77.5208 43.18) (end 78.74 43.18) (width 0.4) (layer F.Cu) (net 8) (tstamp 5FED0A13))
  (segment (start 75.4092 44.03) (end 76.6708 44.03) (width 0.4) (layer F.Cu) (net 8) (tstamp 5FED0A4F))
  (segment (start 76.6708 44.03) (end 77.5208 43.18) (width 0.4) (layer F.Cu) (net 8) (tstamp 5FED0BD2))

)
