EESchema Schematic File Version 4
LIBS:voltcraft_fsp1243-cache
EELAYER 26 0
EELAYER END
$Descr A4 11693 8268
encoding utf-8
Sheet 1 1
Title "FSP1243"
Date "2020-01-19"
Rev "r1"
Comp "Voltcraft"
Comment1 "24V Variant"
Comment2 "Regulated DC Power Supply"
Comment3 ""
Comment4 ""
$EndDescr
$Comp
L Device:D D10
U 1 1 5E24309A
P 7850 1050
F 0 "D10" V 7804 1129 50  0000 L CNN
F 1 "1N5408" V 7895 1129 50  0000 L CNN
F 2 "" H 7850 1050 50  0001 C CNN
F 3 "~" H 7850 1050 50  0001 C CNN
	1    7850 1050
	0    1    1    0   
$EndComp
$Comp
L power:GND #PWR?
U 1 1 5E24316B
P 7850 1300
F 0 "#PWR?" H 7850 1050 50  0001 C CNN
F 1 "GND" H 7855 1127 50  0001 C CNN
F 2 "" H 7850 1300 50  0001 C CNN
F 3 "" H 7850 1300 50  0001 C CNN
	1    7850 1300
	1    0    0    -1  
$EndComp
Wire Wire Line
	7850 1200 7850 1250
$Comp
L Device:C C8
U 1 1 5E2431C2
P 7450 1050
F 0 "C8" H 7565 1096 50  0000 L CNN
F 1 "10nF" H 7565 1005 50  0000 L CNN
F 2 "" H 7488 900 50  0001 C CNN
F 3 "~" H 7450 1050 50  0001 C CNN
	1    7450 1050
	1    0    0    -1  
$EndComp
Wire Wire Line
	7450 1200 7450 1250
Wire Wire Line
	7450 900  7450 850 
Wire Wire Line
	7450 850  7850 850 
Wire Wire Line
	7850 850  7850 900 
$Comp
L Device:R R12
U 1 1 5E243338
P 7050 1050
F 0 "R12" H 7120 1096 50  0000 L CNN
F 1 "2k" H 7120 1005 50  0000 L CNN
F 2 "" V 6980 1050 50  0001 C CNN
F 3 "~" H 7050 1050 50  0001 C CNN
	1    7050 1050
	1    0    0    -1  
$EndComp
Connection ~ 7450 850 
Wire Wire Line
	7050 1200 7050 1250
$Comp
L Transistor_BJT:2N3055 Q5
U 1 1 5E24358F
P 5550 950
F 0 "Q5" V 5878 950 50  0000 C CNN
F 1 "2N3055" V 5787 950 50  0000 C CNN
F 2 "Package_TO_SOT_THT:TO-3" H 5750 875 50  0001 L CIN
F 3 "http://www.onsemi.com/pub_link/Collateral/2N3055-D.PDF" H 5550 950 50  0001 L CNN
	1    5550 950 
	0    -1   -1   0   
$EndComp
$Comp
L Device:R R6
U 1 1 5E243643
P 5350 1200
F 0 "R6" V 5143 1200 50  0000 C CNN
F 1 "30 1W" V 5234 1200 50  0000 C CNN
F 2 "" V 5280 1200 50  0001 C CNN
F 3 "~" H 5350 1200 50  0001 C CNN
	1    5350 1200
	0    1    1    0   
$EndComp
$Comp
L Device:Q_NPN_ECB Q1
U 1 1 5E243808
P 4900 1300
F 0 "Q1" V 5228 1300 50  0000 C CNN
F 1 "2SC1008" V 5137 1300 50  0000 C CNN
F 2 "" H 5100 1400 50  0001 C CNN
F 3 "~" H 4900 1300 50  0001 C CNN
	1    4900 1300
	0    -1   -1   0   
$EndComp
$Comp
L Device:R R7
U 1 1 5E2438E6
P 5800 1150
F 0 "R7" H 5750 1100 50  0000 R CNN
F 1 "100" H 5750 1200 50  0000 R CNN
F 2 "" V 5730 1150 50  0001 C CNN
F 3 "~" H 5800 1150 50  0001 C CNN
	1    5800 1150
	-1   0    0    1   
$EndComp
Wire Wire Line
	5500 1200 5550 1200
Wire Wire Line
	5550 1200 5550 1150
Wire Wire Line
	5750 850  5800 850 
Wire Wire Line
	5800 850  5800 1000
Wire Wire Line
	5800 1700 5800 1300
Wire Wire Line
	5550 1650 5550 1700
Wire Wire Line
	5550 1700 5800 1700
Wire Wire Line
	5550 1250 5550 1200
Connection ~ 5550 1200
$Comp
L Device:Voltmeter_DC MES?
U 1 1 5E2453BA
P 5550 1450
F 0 "MES?" H 5900 1450 50  0000 R CNN
F 1 "Current" H 5900 1500 50  0001 R CNN
F 2 "" V 5550 1550 50  0001 C CNN
F 3 "~" V 5550 1550 50  0001 C CNN
	1    5550 1450
	-1   0    0    1   
$EndComp
Wire Wire Line
	5100 1200 5150 1200
Wire Wire Line
	5150 1200 5150 1700
Wire Wire Line
	5150 1700 5550 1700
Connection ~ 5150 1200
Wire Wire Line
	5150 1200 5200 1200
Connection ~ 5550 1700
$Comp
L Device:Q_NPN_ECB Q2
U 1 1 5E2475EF
P 4650 1650
F 0 "Q2" V 4978 1650 50  0000 C CNN
F 1 "2SC1008" V 4887 1650 50  0000 C CNN
F 2 "" H 4850 1750 50  0001 C CNN
F 3 "~" H 4650 1650 50  0001 C CNN
	1    4650 1650
	0    -1   -1   0   
$EndComp
Wire Wire Line
	4850 1550 4900 1550
Wire Wire Line
	4900 1550 4900 1500
Wire Wire Line
	4450 1550 4400 1550
Wire Wire Line
	4400 1550 4400 1200
$Comp
L Device:R R5
U 1 1 5E247DA2
P 4450 1900
F 0 "R5" V 4243 1900 50  0000 C CNN
F 1 "5k1" V 4334 1900 50  0000 C CNN
F 2 "" V 4380 1900 50  0001 C CNN
F 3 "~" H 4450 1900 50  0001 C CNN
	1    4450 1900
	0    1    1    0   
$EndComp
$Comp
L Device:R R3
U 1 1 5E247E40
P 4250 1700
F 0 "R3" H 4180 1654 50  0000 R CNN
F 1 "1k" H 4180 1745 50  0000 R CNN
F 2 "" V 4180 1700 50  0001 C CNN
F 3 "~" H 4250 1700 50  0001 C CNN
	1    4250 1700
	1    0    0    1   
$EndComp
Wire Wire Line
	4250 1550 4250 1500
Wire Wire Line
	4250 850  4400 850 
Connection ~ 4400 850 
Wire Wire Line
	4250 1850 4250 1900
Wire Wire Line
	4250 1900 4300 1900
Wire Wire Line
	4600 1900 4650 1900
Wire Wire Line
	4650 1900 4650 1850
$Comp
L Device:CP C3
U 1 1 5E249566
P 4250 2150
F 0 "C3" H 4350 2200 50  0000 L CNN
F 1 "10µF" H 4350 2100 50  0000 L CNN
F 2 "" H 4288 2000 50  0001 C CNN
F 3 "~" H 4250 2150 50  0001 C CNN
	1    4250 2150
	1    0    0    -1  
$EndComp
Wire Wire Line
	4250 1900 4250 2000
Connection ~ 4250 1900
$Comp
L Device:Q_NPN_ECB Q4
U 1 1 5E249CC8
P 4750 2150
F 0 "Q4" H 4650 2000 50  0000 L CNN
F 1 "2SC1008" H 4500 1900 50  0000 L CNN
F 2 "" H 4950 2250 50  0001 C CNN
F 3 "~" H 4750 2150 50  0001 C CNN
	1    4750 2150
	-1   0    0    -1  
$EndComp
Wire Wire Line
	4650 1900 4650 1950
Connection ~ 4650 1900
$Comp
L Device:C C?
U 1 1 5E24D416
P 4850 1900
F 0 "C?" V 4598 1900 50  0000 C CNN
F 1 "1nF" V 4689 1900 50  0000 C CNN
F 2 "" H 4888 1750 50  0001 C CNN
F 3 "~" H 4850 1900 50  0001 C CNN
	1    4850 1900
	0    1    1    0   
$EndComp
Wire Wire Line
	4650 1900 4700 1900
Wire Wire Line
	5000 1900 5050 1900
Wire Wire Line
	5050 1900 5050 2150
Wire Wire Line
	5050 2150 4950 2150
Wire Wire Line
	4400 1200 4700 1200
Connection ~ 4400 1200
Wire Wire Line
	4400 1200 4400 850 
$Comp
L Device:D_Zener DD9
U 1 1 5E24F63B
P 6100 1150
F 0 "DD9" V 6054 1229 50  0000 L CNN
F 1 "22V" V 6145 1229 50  0000 L CNN
F 2 "" H 6100 1150 50  0001 C CNN
F 3 "~" H 6100 1150 50  0001 C CNN
	1    6100 1150
	0    1    1    0   
$EndComp
$Comp
L Device:R R10
U 1 1 5E24F781
P 6100 1500
F 0 "R10" H 6170 1546 50  0000 L CNN
F 1 "470" H 6170 1455 50  0000 L CNN
F 2 "" V 6030 1500 50  0001 C CNN
F 3 "~" H 6100 1500 50  0001 C CNN
	1    6100 1500
	1    0    0    -1  
$EndComp
$Comp
L Device:R_POT RP
U 1 1 5E24F940
P 6100 1900
F 0 "RP" H 6030 1854 50  0000 R CNN
F 1 "470" H 6030 1945 50  0000 R CNN
F 2 "" H 6100 1900 50  0001 C CNN
F 3 "~" H 6100 1900 50  0001 C CNN
	1    6100 1900
	-1   0    0    1   
$EndComp
Connection ~ 5800 850 
Wire Wire Line
	6100 1300 6100 1350
Wire Wire Line
	6100 1650 6100 1750
$Comp
L Device:R R?
U 1 1 5E2545CF
P 6100 2250
F 0 "R?" H 6170 2296 50  0000 L CNN
F 1 "220" H 6170 2205 50  0000 L CNN
F 2 "" V 6030 2250 50  0001 C CNN
F 3 "~" H 6100 2250 50  0001 C CNN
	1    6100 2250
	1    0    0    -1  
$EndComp
Wire Wire Line
	6100 2050 6100 2100
$Comp
L power:GND #PWR?
U 1 1 5E255033
P 6100 2450
F 0 "#PWR?" H 6100 2200 50  0001 C CNN
F 1 "GND" H 6105 2277 50  0001 C CNN
F 2 "" H 6100 2450 50  0001 C CNN
F 3 "" H 6100 2450 50  0001 C CNN
	1    6100 2450
	1    0    0    -1  
$EndComp
Wire Wire Line
	6100 2400 6100 2450
$Comp
L power:GND #PWR?
U 1 1 5E255A9B
P 4650 2400
F 0 "#PWR?" H 4650 2150 50  0001 C CNN
F 1 "GND" H 4655 2227 50  0001 C CNN
F 2 "" H 4650 2400 50  0001 C CNN
F 3 "" H 4650 2400 50  0001 C CNN
	1    4650 2400
	1    0    0    -1  
$EndComp
Wire Wire Line
	4650 2350 4650 2400
$Comp
L power:GND #PWR?
U 1 1 5E256566
P 4250 2400
F 0 "#PWR?" H 4250 2150 50  0001 C CNN
F 1 "GND" H 4255 2227 50  0001 C CNN
F 2 "" H 4250 2400 50  0001 C CNN
F 3 "" H 4250 2400 50  0001 C CNN
	1    4250 2400
	1    0    0    -1  
$EndComp
Wire Wire Line
	4250 2300 4250 2400
$Comp
L Device:Q_NPN_ECB Q3
U 1 1 5E257100
P 6600 1700
F 0 "Q3" H 6500 1550 50  0000 L CNN
F 1 "2SC1008" H 6350 1450 50  0000 L CNN
F 2 "" H 6800 1800 50  0001 C CNN
F 3 "~" H 6600 1700 50  0001 C CNN
	1    6600 1700
	-1   0    0    -1  
$EndComp
$Comp
L Device:R R4
U 1 1 5E25FFCE
P 3750 1700
F 0 "R4" H 3820 1746 50  0000 L CNN
F 1 "6k2" H 3820 1655 50  0000 L CNN
F 2 "" V 3680 1700 50  0001 C CNN
F 3 "~" H 3750 1700 50  0001 C CNN
	1    3750 1700
	1    0    0    -1  
$EndComp
$Comp
L Device:C C4
U 1 1 5E260121
P 3750 2150
F 0 "C4" H 4000 2200 50  0000 L CNN
F 1 "22nF" H 3900 2100 50  0000 L CNN
F 2 "" H 3788 2000 50  0001 C CNN
F 3 "~" H 3750 2150 50  0001 C CNN
	1    3750 2150
	-1   0    0    1   
$EndComp
$Comp
L Device:D D2
U 1 1 5E262875
P 5200 2200
F 0 "D2" V 5150 2350 50  0000 R CNN
F 1 "1N4148" V 5250 2550 50  0000 R CNN
F 2 "" H 5200 2200 50  0001 C CNN
F 3 "~" H 5200 2200 50  0001 C CNN
	1    5200 2200
	0    1    1    0   
$EndComp
Wire Wire Line
	5800 850  6100 850 
Wire Wire Line
	6100 850  6100 1000
Wire Wire Line
	5050 1900 5200 1900
Connection ~ 5050 1900
$Comp
L Device:R R9
U 1 1 5E27773A
P 6850 2100
F 0 "R9" H 6920 2146 50  0000 L CNN
F 1 "5k1" H 6920 2055 50  0000 L CNN
F 2 "" V 6780 2100 50  0001 C CNN
F 3 "~" H 6850 2100 50  0001 C CNN
	1    6850 2100
	-1   0    0    -1  
$EndComp
Wire Wire Line
	6800 1700 6850 1700
Wire Wire Line
	6850 1700 6850 1950
$Comp
L power:GND #PWR?
U 1 1 5E27AB61
P 6500 2450
F 0 "#PWR?" H 6500 2200 50  0001 C CNN
F 1 "GND" H 6505 2277 50  0001 C CNN
F 2 "" H 6500 2450 50  0001 C CNN
F 3 "" H 6500 2450 50  0001 C CNN
	1    6500 2450
	1    0    0    -1  
$EndComp
Wire Wire Line
	6500 1900 6500 2450
$Comp
L power:GND #PWR?
U 1 1 5E27BD66
P 6850 2450
F 0 "#PWR?" H 6850 2200 50  0001 C CNN
F 1 "GND" H 6855 2277 50  0001 C CNN
F 2 "" H 6850 2450 50  0001 C CNN
F 3 "" H 6850 2450 50  0001 C CNN
	1    6850 2450
	1    0    0    -1  
$EndComp
Wire Wire Line
	6850 2250 6850 2450
$Comp
L Device:R R8
U 1 1 5E27D025
P 6850 1300
F 0 "R8" H 6780 1254 50  0000 R CNN
F 1 "27k" H 6780 1345 50  0000 R CNN
F 2 "" V 6780 1300 50  0001 C CNN
F 3 "~" H 6850 1300 50  0001 C CNN
	1    6850 1300
	1    0    0    1   
$EndComp
Wire Wire Line
	6100 850  6850 850 
Wire Wire Line
	6850 850  6850 1150
Connection ~ 6100 850 
Wire Wire Line
	6850 1450 6850 1700
Connection ~ 6850 1700
$Comp
L Device:C C5
U 1 1 5E280DEA
P 7050 1700
F 0 "C5" V 6798 1700 50  0000 C CNN
F 1 "100nF" V 6889 1700 50  0000 C CNN
F 2 "" H 7088 1550 50  0001 C CNN
F 3 "~" H 7050 1700 50  0001 C CNN
	1    7050 1700
	0    1    1    0   
$EndComp
Wire Wire Line
	6850 1700 6900 1700
$Comp
L Device:D D7
U 1 1 5E2899BB
P 7250 1900
F 0 "D7" V 7250 2200 50  0000 R CNN
F 1 "1N4148" V 7150 2200 50  0000 R CNN
F 2 "" H 7250 1900 50  0001 C CNN
F 3 "~" H 7250 1900 50  0001 C CNN
	1    7250 1900
	0    -1   -1   0   
$EndComp
$Comp
L Device:D D6
U 1 1 5E289AAB
P 7250 2250
F 0 "D6" V 7250 2550 50  0000 R CNN
F 1 "1N4148" V 7150 2550 50  0000 R CNN
F 2 "" H 7250 2250 50  0001 C CNN
F 3 "~" H 7250 2250 50  0001 C CNN
	1    7250 2250
	0    -1   -1   0   
$EndComp
Wire Wire Line
	7200 1700 7250 1700
Wire Wire Line
	7250 1700 7250 1750
$Comp
L power:GND #PWR?
U 1 1 5E2901FE
P 7250 2450
F 0 "#PWR?" H 7250 2200 50  0001 C CNN
F 1 "GND" H 7255 2277 50  0001 C CNN
F 2 "" H 7250 2450 50  0001 C CNN
F 3 "" H 7250 2450 50  0001 C CNN
	1    7250 2450
	1    0    0    -1  
$EndComp
Wire Wire Line
	7250 2450 7250 2400
$Comp
L Device:R R2
U 1 1 5E2918E2
P 7450 2100
F 0 "R2" H 7520 2146 50  0000 L CNN
F 1 "10k" H 7520 2055 50  0000 L CNN
F 2 "" V 7380 2100 50  0001 C CNN
F 3 "~" H 7450 2100 50  0001 C CNN
	1    7450 2100
	1    0    0    -1  
$EndComp
Wire Wire Line
	7250 1700 7450 1700
Wire Wire Line
	7450 1700 7450 1950
Connection ~ 7250 1700
$Comp
L power:GND #PWR?
U 1 1 5E2930A4
P 7450 2450
F 0 "#PWR?" H 7450 2200 50  0001 C CNN
F 1 "GND" H 7455 2277 50  0001 C CNN
F 2 "" H 7450 2450 50  0001 C CNN
F 3 "" H 7450 2450 50  0001 C CNN
	1    7450 2450
	1    0    0    -1  
$EndComp
Wire Wire Line
	7450 2250 7450 2450
$Comp
L Device:R R1
U 1 1 5E2960A5
P 3250 1800
F 0 "R1" H 3180 1754 50  0000 R CNN
F 1 "1k" H 3180 1845 50  0000 R CNN
F 2 "" V 3180 1800 50  0001 C CNN
F 3 "~" H 3250 1800 50  0001 C CNN
	1    3250 1800
	-1   0    0    1   
$EndComp
Wire Wire Line
	7450 1700 7700 1700
Connection ~ 7450 1700
Connection ~ 6850 850 
Wire Wire Line
	7250 2050 7250 2100
$Comp
L Device:D D1
U 1 1 5E2C2A18
P 3050 850
F 0 "D1" H 3050 634 50  0000 C CNN
F 1 "1N5408" H 3050 725 50  0000 C CNN
F 2 "" H 3050 850 50  0001 C CNN
F 3 "~" H 3050 850 50  0001 C CNN
	1    3050 850 
	-1   0    0    1   
$EndComp
$Comp
L Device:D D3
U 1 1 5E2C2BE6
P 3250 1050
F 0 "D3" V 3204 1129 50  0000 L CNN
F 1 "1N5408" V 3295 1129 50  0000 L CNN
F 2 "" H 3250 1050 50  0001 C CNN
F 3 "~" H 3250 1050 50  0001 C CNN
	1    3250 1050
	0    1    1    0   
$EndComp
$Comp
L Transformer:TRANSF4 TR?
U 1 1 5E2C31BA
P 2650 1050
F 0 "TR?" H 2650 672 50  0000 C CNN
F 1 "240V/2x28V" H 2650 763 50  0000 C CNN
F 2 "" H 2650 1050 50  0001 C CNN
F 3 "" H 2650 1050 50  0001 C CNN
	1    2650 1050
	-1   0    0    1   
$EndComp
Wire Wire Line
	2850 850  2900 850 
Wire Wire Line
	3200 850  3250 850 
Wire Wire Line
	3250 850  3250 900 
Wire Wire Line
	2850 1250 3250 1250
Wire Wire Line
	3250 1250 3250 1200
$Comp
L power:GND #PWR?
U 1 1 5E2C869C
P 2900 1100
F 0 "#PWR?" H 2900 850 50  0001 C CNN
F 1 "GND" H 2905 927 50  0001 C CNN
F 2 "" H 2900 1100 50  0001 C CNN
F 3 "" H 2900 1100 50  0001 C CNN
	1    2900 1100
	1    0    0    -1  
$EndComp
Wire Wire Line
	2850 1050 2900 1050
Wire Wire Line
	2900 1050 2900 1100
$Comp
L Device:CP C1
U 1 1 5E2CA9C3
P 3750 1050
F 0 "C1" H 3868 1096 50  0000 L CNN
F 1 "4700µF" H 3868 1005 50  0000 L CNN
F 2 "" H 3788 900 50  0001 C CNN
F 3 "~" H 3750 1050 50  0001 C CNN
	1    3750 1050
	1    0    0    -1  
$EndComp
Wire Wire Line
	3250 850  3750 850 
Wire Wire Line
	3750 850  3750 900 
Connection ~ 3250 850 
$Comp
L power:GND #PWR?
U 1 1 5E2CEC64
P 3750 1250
F 0 "#PWR?" H 3750 1000 50  0001 C CNN
F 1 "GND" H 3755 1077 50  0001 C CNN
F 2 "" H 3750 1250 50  0001 C CNN
F 3 "" H 3750 1250 50  0001 C CNN
	1    3750 1250
	1    0    0    -1  
$EndComp
Wire Wire Line
	3750 1200 3750 1250
Wire Wire Line
	3750 850  4250 850 
Connection ~ 3750 850 
Connection ~ 4250 850 
$Comp
L Device:D D5
U 1 1 5E2DA1CC
P 3250 1450
F 0 "D5" V 3296 1371 50  0000 R CNN
F 1 "1N4004" V 3205 1371 50  0000 R CNN
F 2 "" H 3250 1450 50  0001 C CNN
F 3 "~" H 3250 1450 50  0001 C CNN
	1    3250 1450
	0    -1   -1   0   
$EndComp
Wire Wire Line
	3250 1250 3250 1300
Connection ~ 3250 1250
Wire Wire Line
	3250 1600 3250 1650
Wire Wire Line
	3250 1950 3250 2700
Wire Wire Line
	3250 2700 7700 2700
Wire Wire Line
	7700 1700 7700 2700
Wire Wire Line
	3750 1550 3750 1500
Wire Wire Line
	3750 1500 4250 1500
Connection ~ 4250 1500
Wire Wire Line
	4250 1500 4250 850 
Wire Wire Line
	3750 1850 3750 1900
$Comp
L power:GND #PWR?
U 1 1 5E2F852F
P 3750 2400
F 0 "#PWR?" H 3750 2150 50  0001 C CNN
F 1 "GND" H 3755 2227 50  0001 C CNN
F 2 "" H 3750 2400 50  0001 C CNN
F 3 "" H 3750 2400 50  0001 C CNN
	1    3750 2400
	1    0    0    -1  
$EndComp
Wire Wire Line
	3750 2300 3750 2400
Wire Wire Line
	5200 2050 5200 1900
Connection ~ 5200 1900
Wire Wire Line
	3750 1900 4000 1900
Wire Wire Line
	4000 1900 4000 2600
Wire Wire Line
	4000 2600 5200 2600
Wire Wire Line
	5200 2600 5200 2350
Connection ~ 3750 1900
Wire Wire Line
	3750 1900 3750 2000
Wire Wire Line
	5200 1900 5950 1900
Wire Wire Line
	5200 2600 6350 2600
Wire Wire Line
	6350 2600 6350 1450
Wire Wire Line
	6350 1450 6500 1450
Connection ~ 5200 2600
Wire Wire Line
	6500 1450 6500 1500
Wire Wire Line
	6850 850  7050 850 
Wire Wire Line
	7050 850  7450 850 
Connection ~ 7050 850 
Wire Wire Line
	7050 900  7050 850 
Wire Wire Line
	4400 850  5350 850 
$Comp
L Switch:SW_DPST SW?
U 1 1 5E4062C2
P 2150 1050
F 0 "SW?" H 2150 1375 50  0000 C CNN
F 1 "Power" H 2150 1284 50  0000 C CNN
F 2 "" H 2150 1050 50  0001 C CNN
F 3 "" H 2150 1050 50  0001 C CNN
	1    2150 1050
	1    0    0    -1  
$EndComp
$Comp
L Device:Fuse F?
U 1 1 5E4063CF
P 1750 950
F 0 "F?" V 1553 950 50  0000 C CNN
F 1 "250VT0.8A" V 1644 950 50  0000 C CNN
F 2 "" V 1680 950 50  0001 C CNN
F 3 "~" H 1750 950 50  0001 C CNN
	1    1750 950 
	0    1    1    0   
$EndComp
Wire Wire Line
	2350 950  2400 950 
Wire Wire Line
	2400 950  2400 850 
Wire Wire Line
	2400 850  2450 850 
Wire Wire Line
	2350 1150 2400 1150
Wire Wire Line
	2400 1150 2400 1250
Wire Wire Line
	2400 1250 2450 1250
Wire Wire Line
	1900 950  1950 950 
$Comp
L Connector:Conn_WallPlug_Earth P?
U 1 1 5E410101
P 1250 1050
F 0 "P?" H 1250 1450 50  0000 C CNN
F 1 "IEC 60320-1 C14" H 1250 1350 50  0000 C CNN
F 2 "" H 1650 1050 50  0001 C CNN
F 3 "~" H 1650 1050 50  0001 C CNN
	1    1250 1050
	1    0    0    -1  
$EndComp
Wire Wire Line
	1550 950  1600 950 
Wire Wire Line
	1550 1150 1950 1150
$Comp
L power:Earth #PWR?
U 1 1 5E41AA49
P 1600 1400
F 0 "#PWR?" H 1600 1150 50  0001 C CNN
F 1 "Earth" H 1600 1250 50  0001 C CNN
F 2 "" H 1600 1400 50  0001 C CNN
F 3 "~" H 1600 1400 50  0001 C CNN
	1    1600 1400
	1    0    0    -1  
$EndComp
Wire Wire Line
	1550 1350 1600 1350
Wire Wire Line
	1600 1350 1600 1400
$Comp
L Connector:Conn_01x01_Female Out+
U 1 1 5E41F02D
P 8100 850
F 0 "Out+" H 8127 830 50  0000 L CNN
F 1 "Conn_01x01_Female" H 8127 785 50  0001 L CNN
F 2 "" H 8100 850 50  0001 C CNN
F 3 "~" H 8100 850 50  0001 C CNN
	1    8100 850 
	1    0    0    -1  
$EndComp
$Comp
L Connector:Conn_01x01_Female Out-
U 1 1 5E41F0BF
P 8100 1250
F 0 "Out-" H 8127 1230 50  0000 L CNN
F 1 "Conn_01x01_Female" H 8127 1185 50  0001 L CNN
F 2 "" H 8100 1250 50  0001 C CNN
F 3 "~" H 8100 1250 50  0001 C CNN
	1    8100 1250
	1    0    0    -1  
$EndComp
Wire Wire Line
	7850 1250 7900 1250
Connection ~ 7850 1250
Wire Wire Line
	7850 1250 7850 1300
Wire Wire Line
	7850 850  7900 850 
Connection ~ 7850 850 
Wire Wire Line
	7450 1250 7850 1250
Wire Wire Line
	7050 1250 7450 1250
Connection ~ 7450 1250
Text Notes 1650 1800 0    50   ~ 0
- Transformer mounted to the Case\n- Three solderpoints for transformer \n   secondary on PCB\n
$EndSCHEMATC
