EESchema Schematic File Version 2
LIBS:power
LIBS:device
LIBS:switches
LIBS:relays
LIBS:motors
LIBS:transistors
LIBS:conn
LIBS:linear
LIBS:regul
LIBS:74xx
LIBS:cmos4000
LIBS:adc-dac
LIBS:memory
LIBS:xilinx
LIBS:microcontrollers
LIBS:dsp
LIBS:microchip
LIBS:analog_switches
LIBS:motorola
LIBS:texas
LIBS:intel
LIBS:audio
LIBS:interface
LIBS:philips
LIBS:display
LIBS:cypress
LIBS:siliconi
LIBS:opto
LIBS:contrib
LIBS:valves
LIBS:mechanical
LIBS:ble-ai4do8
LIBS:ble-ai4do8-cache
EELAYER 25 0
EELAYER END
$Descr A4 11693 8268
encoding utf-8
Sheet 1 1
Title "Bluetooth 5 Low Energy Breakout + AI4/DO8 Module"
Date "2019-03-16"
Rev "r1"
Comp "Copyright (c) 2019 Andreas Messer"
Comment1 ""
Comment2 ""
Comment3 ""
Comment4 ""
$EndDescr
$Comp
L BL651 U104
U 1 1 5C769D20
P 3550 3950
F 0 "U104" H 3550 5150 60  0000 C CNN
F 1 "BL651" H 3900 2650 60  0000 C CNN
F 2 "ble-ai4do8:Laird_BL651" H 3550 5100 60  0001 C CNN
F 3 "" H 3550 5100 60  0001 C CNN
	1    3550 3950
	1    0    0    -1  
$EndComp
$Comp
L Crystal_GND3 Y101
U 1 1 5C769DB1
P 2500 4850
F 0 "Y101" H 2500 5075 50  0000 C CNN
F 1 "32768Hz" H 2500 5000 50  0000 C CNN
F 2 "Crystals:Crystal_AT310_d3.0mm_l10.0mm_Horizontal_1EP_style2" H 2500 4850 50  0001 C CNN
F 3 "" H 2500 4850 50  0001 C CNN
	1    2500 4850
	-1   0    0    -1  
$EndComp
$Comp
L C C107
U 1 1 5C769E2A
P 2650 3100
F 0 "C107" H 2700 3300 50  0000 L CNN
F 1 "1µF" H 2700 3200 50  0000 L CNN
F 2 "Capacitors_SMD:C_0603_HandSoldering" H 2688 2950 50  0001 C CNN
F 3 "" H 2650 3100 50  0001 C CNN
	1    2650 3100
	1    0    0    -1  
$EndComp
$Comp
L C C105
U 1 1 5C769FB2
P 2200 5050
F 0 "C105" H 2225 5150 50  0000 L CNN
F 1 "18pF" H 2225 4950 50  0000 L CNN
F 2 "Capacitors_SMD:C_0603_HandSoldering" H 2238 4900 50  0001 C CNN
F 3 "" H 2200 5050 50  0001 C CNN
	1    2200 5050
	1    0    0    -1  
$EndComp
$Comp
L C C109
U 1 1 5C76A07D
P 2800 5050
F 0 "C109" H 2825 5150 50  0000 L CNN
F 1 "18pF" H 2825 4950 50  0000 L CNN
F 2 "Capacitors_SMD:C_0603_HandSoldering" H 2838 4900 50  0001 C CNN
F 3 "" H 2800 5050 50  0001 C CNN
	1    2800 5050
	1    0    0    -1  
$EndComp
$Comp
L GND #PWR01
U 1 1 5C76A209
P 2500 5300
F 0 "#PWR01" H 2500 5050 50  0001 C CNN
F 1 "GND" H 2500 5150 50  0000 C CNN
F 2 "" H 2500 5300 50  0001 C CNN
F 3 "" H 2500 5300 50  0001 C CNN
	1    2500 5300
	1    0    0    -1  
$EndComp
$Comp
L BTS4130QGA U106
U 1 1 5C7A4A38
P 8800 1950
F 0 "U106" H 9250 1500 60  0000 C CNN
F 1 "BTS4130QGA" H 8800 2000 60  0000 C CNN
F 2 "Housings_SOIC:SO-20_12.8x7.5mm_Pitch1.27mm" H 8800 1950 60  0001 C CNN
F 3 "" H 8800 1950 60  0001 C CNN
	1    8800 1950
	1    0    0    -1  
$EndComp
$Comp
L R R128
U 1 1 5C7A4AE3
P 8700 2650
F 0 "R128" V 8780 2650 50  0000 C CNN
F 1 "150" V 8700 2650 50  0000 C CNN
F 2 "Resistors_SMD:R_0603_HandSoldering" V 8630 2650 50  0001 C CNN
F 3 "" H 8700 2650 50  0001 C CNN
	1    8700 2650
	1    0    0    -1  
$EndComp
$Comp
L R R130
U 1 1 5C7A4BC0
P 8900 2650
F 0 "R130" V 8980 2650 50  0000 C CNN
F 1 "150" V 8900 2650 50  0000 C CNN
F 2 "Resistors_SMD:R_0603_HandSoldering" V 8830 2650 50  0001 C CNN
F 3 "" H 8900 2650 50  0001 C CNN
	1    8900 2650
	1    0    0    -1  
$EndComp
$Comp
L GND #PWR02
U 1 1 5C7A4C6F
P 8800 2900
F 0 "#PWR02" H 8800 2650 50  0001 C CNN
F 1 "GND" H 8800 2750 50  0001 C CNN
F 2 "" H 8800 2900 50  0001 C CNN
F 3 "" H 8800 2900 50  0001 C CNN
	1    8800 2900
	1    0    0    -1  
$EndComp
$Comp
L R R121
U 1 1 5C7A4D4F
P 8050 1550
F 0 "R121" V 8150 1600 50  0000 C CNN
F 1 "100k" V 8050 1550 50  0000 C CNN
F 2 "Resistors_SMD:R_0603_HandSoldering" V 7980 1550 50  0001 C CNN
F 3 "" H 8050 1550 50  0001 C CNN
	1    8050 1550
	1    0    0    -1  
$EndComp
$Comp
L R R119
U 1 1 5C7A4FAA
P 7950 1550
F 0 "R119" V 7850 1600 50  0000 C CNN
F 1 "100k" V 7950 1550 50  0000 C CNN
F 2 "Resistors_SMD:R_0603_HandSoldering" V 7880 1550 50  0001 C CNN
F 3 "" H 7950 1550 50  0001 C CNN
	1    7950 1550
	1    0    0    -1  
$EndComp
$Comp
L R R115
U 1 1 5C7A5060
P 7750 1750
F 0 "R115" V 7650 1750 50  0000 C CNN
F 1 "15k" V 7750 1750 50  0000 C CNN
F 2 "Resistors_SMD:R_0603_HandSoldering" V 7680 1750 50  0001 C CNN
F 3 "" H 7750 1750 50  0001 C CNN
	1    7750 1750
	0    1    1    0   
$EndComp
$Comp
L R R116
U 1 1 5C7A50C1
P 7750 1850
F 0 "R116" V 7900 1850 50  0000 C CNN
F 1 "15k" V 7750 1850 50  0000 C CNN
F 2 "Resistors_SMD:R_0603_HandSoldering" V 7680 1850 50  0001 C CNN
F 3 "" H 7750 1850 50  0001 C CNN
	1    7750 1850
	0    1    1    0   
$EndComp
$Comp
L C C116
U 1 1 5C7A5324
P 8400 1450
F 0 "C116" V 8550 1200 50  0000 L CNN
F 1 "100nF" V 8450 1150 50  0000 L CNN
F 2 "Capacitors_SMD:C_0603_HandSoldering" H 8438 1300 50  0001 C CNN
F 3 "" H 8400 1450 50  0001 C CNN
	1    8400 1450
	0    -1   -1   0   
$EndComp
$Comp
L GND #PWR03
U 1 1 5C7A5452
P 8200 1500
F 0 "#PWR03" H 8200 1250 50  0001 C CNN
F 1 "GND" H 8200 1350 50  0001 C CNN
F 2 "" H 8200 1500 50  0001 C CNN
F 3 "" H 8200 1500 50  0001 C CNN
	1    8200 1500
	1    0    0    -1  
$EndComp
$Comp
L BTS4130QGA U107
U 1 1 5C7A5B3F
P 8800 3650
F 0 "U107" H 9250 3200 60  0000 C CNN
F 1 "BTS4130QGA" H 8800 3700 60  0000 C CNN
F 2 "Housings_SOIC:SO-20_12.8x7.5mm_Pitch1.27mm" H 8800 3650 60  0001 C CNN
F 3 "" H 8800 3650 60  0001 C CNN
	1    8800 3650
	1    0    0    -1  
$EndComp
$Comp
L R R129
U 1 1 5C7A5B45
P 8700 4350
F 0 "R129" V 8780 4350 50  0000 C CNN
F 1 "150" V 8700 4350 50  0000 C CNN
F 2 "Resistors_SMD:R_0603_HandSoldering" V 8630 4350 50  0001 C CNN
F 3 "" H 8700 4350 50  0001 C CNN
	1    8700 4350
	1    0    0    -1  
$EndComp
$Comp
L R R131
U 1 1 5C7A5B4B
P 8900 4350
F 0 "R131" V 8980 4350 50  0000 C CNN
F 1 "150" V 8900 4350 50  0000 C CNN
F 2 "Resistors_SMD:R_0603_HandSoldering" V 8830 4350 50  0001 C CNN
F 3 "" H 8900 4350 50  0001 C CNN
	1    8900 4350
	1    0    0    -1  
$EndComp
$Comp
L GND #PWR04
U 1 1 5C7A5B56
P 8800 4600
F 0 "#PWR04" H 8800 4350 50  0001 C CNN
F 1 "GND" H 8800 4450 50  0001 C CNN
F 2 "" H 8800 4600 50  0001 C CNN
F 3 "" H 8800 4600 50  0001 C CNN
	1    8800 4600
	1    0    0    -1  
$EndComp
$Comp
L R R122
U 1 1 5C7A5B5E
P 8050 3250
F 0 "R122" V 8150 3350 50  0000 C CNN
F 1 "100k" V 8050 3250 50  0000 C CNN
F 2 "Resistors_SMD:R_0603_HandSoldering" V 7980 3250 50  0001 C CNN
F 3 "" H 8050 3250 50  0001 C CNN
	1    8050 3250
	1    0    0    -1  
$EndComp
$Comp
L R R120
U 1 1 5C7A5B64
P 7950 3250
F 0 "R120" V 7850 3350 50  0000 C CNN
F 1 "100k" V 7950 3250 50  0000 C CNN
F 2 "Resistors_SMD:R_0603_HandSoldering" V 7880 3250 50  0001 C CNN
F 3 "" H 7950 3250 50  0001 C CNN
	1    7950 3250
	1    0    0    -1  
$EndComp
$Comp
L R R117
U 1 1 5C7A5B6E
P 7750 3450
F 0 "R117" V 7830 3450 50  0000 C CNN
F 1 "15k" V 7750 3450 50  0000 C CNN
F 2 "Resistors_SMD:R_0603_HandSoldering" V 7680 3450 50  0001 C CNN
F 3 "" H 7750 3450 50  0001 C CNN
	1    7750 3450
	0    -1   -1   0   
$EndComp
$Comp
L R R118
U 1 1 5C7A5B74
P 7750 3550
F 0 "R118" V 7600 3550 50  0000 C CNN
F 1 "15k" V 7750 3550 50  0000 C CNN
F 2 "Resistors_SMD:R_0603_HandSoldering" V 7680 3550 50  0001 C CNN
F 3 "" H 7750 3550 50  0001 C CNN
	1    7750 3550
	0    -1   -1   0   
$EndComp
$Comp
L C C117
U 1 1 5C7A5B7F
P 8400 3150
F 0 "C117" H 8425 3250 50  0000 L CNN
F 1 "100nF" H 8425 3050 50  0000 L CNN
F 2 "Capacitors_SMD:C_0603_HandSoldering" H 8438 3000 50  0001 C CNN
F 3 "" H 8400 3150 50  0001 C CNN
	1    8400 3150
	0    -1   -1   0   
$EndComp
$Comp
L GND #PWR05
U 1 1 5C7A5B85
P 8200 3200
F 0 "#PWR05" H 8200 2950 50  0001 C CNN
F 1 "GND" H 8200 3050 50  0001 C CNN
F 2 "" H 8200 3200 50  0001 C CNN
F 3 "" H 8200 3200 50  0001 C CNN
	1    8200 3200
	1    0    0    -1  
$EndComp
$Comp
L D D107
U 1 1 5C7A69DB
P 9150 850
F 0 "D107" H 9150 1050 50  0000 C CNN
F 1 "1N4001" H 9200 950 50  0000 C CNN
F 2 "Diodes_SMD:D_SMA_Handsoldering" H 9150 850 50  0001 C CNN
F 3 "" H 9150 850 50  0001 C CNN
	1    9150 850 
	1    0    0    -1  
$EndComp
$Comp
L LP2950-3.3_TO252 U105
U 1 1 5C7A6BA3
P 8200 850
F 0 "U105" H 8350 600 50  0000 C CNN
F 1 "LP2950-3.0_TO252" H 7850 1000 50  0000 L CNN
F 2 "TO_SOT_Packages_SMD:TO-252-3_TabPin2" H 8200 1075 50  0001 C CIN
F 3 "" H 8200 800 50  0001 C CNN
	1    8200 850 
	-1   0    0    -1  
$EndComp
$Comp
L CP C114
U 1 1 5C7A7062
P 7750 1050
F 0 "C114" H 7775 1150 50  0000 L CNN
F 1 "10µF" H 7775 950 50  0000 L CNN
F 2 "Capacitors_Tantalum_SMD:CP_Tantalum_Case-D_EIA-7343-31_Hand" H 7788 900 50  0001 C CNN
F 3 "" H 7750 1050 50  0001 C CNN
	1    7750 1050
	1    0    0    -1  
$EndComp
$Comp
L CP C118
U 1 1 5C7A70E4
P 8650 1050
F 0 "C118" H 8675 1150 50  0000 L CNN
F 1 "10µF" H 8675 950 50  0000 L CNN
F 2 "Capacitors_Tantalum_SMD:CP_Tantalum_Case-D_EIA-7343-31_Hand" H 8688 900 50  0001 C CNN
F 3 "" H 8650 1050 50  0001 C CNN
	1    8650 1050
	-1   0    0    -1  
$EndComp
$Comp
L Conn_01x11 J106
U 1 1 5C7A8B1E
P 10600 2850
F 0 "J106" H 10600 3450 50  0000 C CNN
F 1 "Conn_01x11" H 10600 2250 50  0000 C CNN
F 2 "ble-ai4do8:PhoenixContact_PT_1.5-11-3.5-H" H 10600 2850 50  0001 C CNN
F 3 "" H 10600 2850 50  0001 C CNN
	1    10600 2850
	1    0    0    -1  
$EndComp
$Comp
L GND #PWR06
U 1 1 5C7A9E85
P 10300 2950
F 0 "#PWR06" H 10300 2700 50  0001 C CNN
F 1 "GND" H 10300 2800 50  0001 C CNN
F 2 "" H 10300 2950 50  0001 C CNN
F 3 "" H 10300 2950 50  0001 C CNN
	1    10300 2950
	0    1    1    0   
$EndComp
Text Label 9950 4850 0    60   ~ 0
VSUPPLY
$Comp
L LM4120 U101
U 1 1 5C7AB597
P 1450 4750
F 0 "U101" H 1225 4975 50  0000 C CNN
F 1 "LM4132-AMF-2.5" H 1450 4900 50  0000 C CNN
F 2 "TO_SOT_Packages_SMD:SOT-23-5_HandSoldering" H 1450 4800 50  0001 C CIN
F 3 "" H 1450 4750 50  0001 C CNN
	1    1450 4750
	1    0    0    -1  
$EndComp
$Comp
L C C101
U 1 1 5C7AB7CF
P 1000 5050
F 0 "C101" H 1025 5150 50  0000 L CNN
F 1 "1µF" H 1025 4950 50  0000 L CNN
F 2 "Capacitors_SMD:C_0603_HandSoldering" H 1038 4900 50  0001 C CNN
F 3 "" H 1000 5050 50  0001 C CNN
	1    1000 5050
	1    0    0    -1  
$EndComp
$Comp
L R R101
U 1 1 5C7ABAE0
P 800 5050
F 0 "R101" V 880 5050 50  0000 C CNN
F 1 "100k" V 800 5050 50  0000 C CNN
F 2 "Resistors_SMD:R_0603_HandSoldering" V 730 5050 50  0001 C CNN
F 3 "" H 800 5050 50  0001 C CNN
	1    800  5050
	1    0    0    -1  
$EndComp
$Comp
L C C104
U 1 1 5C7ABDA0
P 1900 5050
F 0 "C104" H 1925 5150 50  0000 L CNN
F 1 "100nF" H 1925 4950 50  0000 L CNN
F 2 "Capacitors_SMD:C_0603_HandSoldering" H 1938 4900 50  0001 C CNN
F 3 "" H 1900 5050 50  0001 C CNN
	1    1900 5050
	1    0    0    -1  
$EndComp
$Comp
L GND #PWR07
U 1 1 5C7AC24D
P 1450 5300
F 0 "#PWR07" H 1450 5050 50  0001 C CNN
F 1 "GND" H 1450 5150 50  0001 C CNN
F 2 "" H 1450 5300 50  0001 C CNN
F 3 "" H 1450 5300 50  0001 C CNN
	1    1450 5300
	1    0    0    -1  
$EndComp
Text Label 2200 4450 0    60   ~ 0
VREF_2.5
$Comp
L Conn_02x05_Odd_Even J101
U 1 1 5C7B0767
P 2150 3950
F 0 "J101" H 2200 4250 50  0000 C CNN
F 1 "DEBUG" H 2200 4450 50  0000 C CNN
F 2 "ble-ai4do8:Samtec_FTSH-105-01-F-D-007" H 2150 3950 50  0001 C CNN
F 3 "" H 2150 3950 50  0001 C CNN
	1    2150 3950
	1    0    0    -1  
$EndComp
$Comp
L R R109
U 1 1 5C7B0F35
P 2500 3100
F 0 "R109" V 2400 3100 50  0000 C CNN
F 1 "100k" V 2500 3100 50  0000 C CNN
F 2 "Resistors_SMD:R_0603_HandSoldering" V 2430 3100 50  0001 C CNN
F 3 "" H 2500 3100 50  0001 C CNN
	1    2500 3100
	1    0    0    -1  
$EndComp
$Comp
L GND #PWR08
U 1 1 5C7B18BE
P 2800 3400
F 0 "#PWR08" H 2800 3150 50  0001 C CNN
F 1 "GND" H 2800 3250 50  0001 C CNN
F 2 "" H 2800 3400 50  0001 C CNN
F 3 "" H 2800 3400 50  0001 C CNN
	1    2800 3400
	1    0    0    -1  
$EndComp
$Comp
L GND #PWR09
U 1 1 5C7B1AF7
P 1850 4150
F 0 "#PWR09" H 1850 3900 50  0001 C CNN
F 1 "GND" H 1850 4000 50  0001 C CNN
F 2 "" H 1850 4150 50  0001 C CNN
F 3 "" H 1850 4150 50  0001 C CNN
	1    1850 4150
	0    1    1    0   
$EndComp
$Comp
L D_TVS D105
U 1 1 5C7ABC5F
P 8950 1050
F 0 "D105" H 8950 1150 50  0000 C CNN
F 1 "D_TVS" H 8950 950 50  0000 C CNN
F 2 "Diodes_SMD:D_SMA_Handsoldering" H 8950 1050 50  0001 C CNN
F 3 "" H 8950 1050 50  0001 C CNN
	1    8950 1050
	0    1    1    0   
$EndComp
Text Label 2600 3650 0    60   ~ 0
~RESET~
Text Label 2600 3750 0    60   ~ 0
SWDIO
Text Label 2600 3850 0    60   ~ 0
SWCLK
$Comp
L C C108
U 1 1 5C7AF9DB
P 2650 1800
F 0 "C108" H 2675 1900 50  0000 L CNN
F 1 "1µF" H 2675 1700 50  0000 L CNN
F 2 "Capacitors_SMD:C_0603_HandSoldering" H 2688 1650 50  0001 C CNN
F 3 "" H 2650 1800 50  0001 C CNN
	1    2650 1800
	-1   0    0    -1  
$EndComp
$Comp
L SW_Push SW103
U 1 1 5C7B8F75
P 1250 3200
F 0 "SW103" H 1250 3150 50  0000 C CNN
F 1 "SW_Push" H 1250 3200 50  0001 C CNN
F 2 "Buttons_Switches_SMD:SW_SPST_B3S-1000" H 1250 3400 50  0001 C CNN
F 3 "" H 1250 3400 50  0001 C CNN
	1    1250 3200
	0    1    1    0   
$EndComp
$Comp
L SW_Push SW104
U 1 1 5C7B9335
P 1450 3200
F 0 "SW104" H 1450 3150 50  0000 C CNN
F 1 "SW_Push" H 1450 3200 50  0001 C CNN
F 2 "Buttons_Switches_SMD:SW_SPST_B3S-1000" H 1450 3400 50  0001 C CNN
F 3 "" H 1450 3400 50  0001 C CNN
	1    1450 3200
	0    1    1    0   
$EndComp
$Comp
L SW_Push SW102
U 1 1 5C7B95E9
P 1050 3200
F 0 "SW102" H 1050 3150 50  0000 C CNN
F 1 "SW_Push" H 1050 3200 50  0001 C CNN
F 2 "Buttons_Switches_SMD:SW_SPST_B3S-1000" H 1050 3400 50  0001 C CNN
F 3 "" H 1050 3400 50  0001 C CNN
	1    1050 3200
	0    1    1    0   
$EndComp
$Comp
L SW_Push SW101
U 1 1 5C7B969C
P 850 3200
F 0 "SW101" H 850 3150 50  0000 C CNN
F 1 "SW_Push" H 850 3200 50  0001 C CNN
F 2 "Buttons_Switches_SMD:SW_SPST_B3S-1000" H 850 3400 50  0001 C CNN
F 3 "" H 850 3400 50  0001 C CNN
	1    850  3200
	0    1    1    0   
$EndComp
$Comp
L R R105
U 1 1 5C7B9C98
P 1050 2850
F 0 "R105" V 1130 2850 50  0000 C CNN
F 1 "100k" V 1050 2850 50  0000 C CNN
F 2 "Resistors_SMD:R_0603_HandSoldering" V 980 2850 50  0001 C CNN
F 3 "" H 1050 2850 50  0001 C CNN
	1    1050 2850
	0    -1   -1   0   
$EndComp
$Comp
L R R102
U 1 1 5C7BA14A
P 850 3750
F 0 "R102" V 750 3750 50  0000 C CNN
F 1 "15k" V 850 3750 50  0000 C CNN
F 2 "Resistors_SMD:R_0603_HandSoldering" V 780 3750 50  0001 C CNN
F 3 "" H 850 3750 50  0001 C CNN
	1    850  3750
	-1   0    0    1   
$EndComp
$Comp
L R R107
U 1 1 5C7BA208
P 1150 3550
F 0 "R107" V 1050 3550 50  0000 C CNN
F 1 "15k" V 1150 3550 50  0000 C CNN
F 2 "Resistors_SMD:R_0603_HandSoldering" V 1080 3550 50  0001 C CNN
F 3 "" H 1150 3550 50  0001 C CNN
	1    1150 3550
	0    -1   -1   0   
$EndComp
$Comp
L GND #PWR010
U 1 1 5C7C0098
P 850 3950
F 0 "#PWR010" H 850 3700 50  0001 C CNN
F 1 "GND" H 850 3800 50  0001 C CNN
F 2 "" H 850 3950 50  0001 C CNN
F 3 "" H 850 3950 50  0001 C CNN
	1    850  3950
	1    0    0    -1  
$EndComp
$Comp
L R R108
U 1 1 5C7C1EC9
P 1450 2850
F 0 "R108" V 1530 2850 50  0000 C CNN
F 1 "15k" V 1450 2850 50  0000 C CNN
F 2 "Resistors_SMD:R_0603_HandSoldering" V 1380 2850 50  0001 C CNN
F 3 "" H 1450 2850 50  0001 C CNN
	1    1450 2850
	0    -1   -1   0   
$EndComp
Text Label 2200 4350 0    60   ~ 0
VKEY
$Comp
L R R146
U 1 1 5C7CC26C
P 9900 5050
F 0 "R146" V 9850 4850 50  0000 C CNN
F 1 "100k" V 9900 5050 50  0000 C CNN
F 2 "Resistors_SMD:R_0603_HandSoldering" V 9830 5050 50  0001 C CNN
F 3 "" H 9900 5050 50  0001 C CNN
	1    9900 5050
	0    1    1    0   
$EndComp
$Comp
L R R147
U 1 1 5C7CC3CC
P 9900 5150
F 0 "R147" V 9850 4950 50  0000 C CNN
F 1 "100k" V 9900 5150 50  0000 C CNN
F 2 "Resistors_SMD:R_0603_HandSoldering" V 9830 5150 50  0001 C CNN
F 3 "" H 9900 5150 50  0001 C CNN
	1    9900 5150
	0    1    1    0   
$EndComp
$Comp
L R R148
U 1 1 5C7CC4A1
P 9900 5250
F 0 "R148" V 9850 5050 50  0000 C CNN
F 1 "100k" V 9900 5250 50  0000 C CNN
F 2 "Resistors_SMD:R_0603_HandSoldering" V 9830 5250 50  0001 C CNN
F 3 "" H 9900 5250 50  0001 C CNN
	1    9900 5250
	0    1    1    0   
$EndComp
$Comp
L R R149
U 1 1 5C7CC57B
P 9900 5350
F 0 "R149" V 9850 5150 50  0000 C CNN
F 1 "100k" V 9900 5350 50  0000 C CNN
F 2 "Resistors_SMD:R_0603_HandSoldering" V 9830 5350 50  0001 C CNN
F 3 "" H 9900 5350 50  0001 C CNN
	1    9900 5350
	0    1    1    0   
$EndComp
$Comp
L R R141
U 1 1 5C7CC935
P 9700 5550
F 0 "R141" H 9700 5850 50  0000 C CNN
F 1 "15k" V 9700 5550 50  0000 C CNN
F 2 "Resistors_SMD:R_0603_HandSoldering" V 9630 5550 50  0001 C CNN
F 3 "" H 9700 5550 50  0001 C CNN
	1    9700 5550
	-1   0    0    1   
$EndComp
$Comp
L R R137
U 1 1 5C7CCAB5
P 9600 5550
F 0 "R137" H 9600 5950 50  0000 C CNN
F 1 "15k" V 9600 5550 50  0000 C CNN
F 2 "Resistors_SMD:R_0603_HandSoldering" V 9530 5550 50  0001 C CNN
F 3 "" H 9600 5550 50  0001 C CNN
	1    9600 5550
	-1   0    0    1   
$EndComp
$Comp
L R R134
U 1 1 5C7CCB98
P 9500 5550
F 0 "R134" H 9500 5850 50  0000 C CNN
F 1 "15k" V 9500 5550 50  0000 C CNN
F 2 "Resistors_SMD:R_0603_HandSoldering" V 9430 5550 50  0001 C CNN
F 3 "" H 9500 5550 50  0001 C CNN
	1    9500 5550
	-1   0    0    1   
$EndComp
$Comp
L R R133
U 1 1 5C7CCDA8
P 9400 5550
F 0 "R133" H 9400 5950 50  0000 C CNN
F 1 "15k" V 9400 5550 50  0000 C CNN
F 2 "Resistors_SMD:R_0603_HandSoldering" V 9330 5550 50  0001 C CNN
F 3 "" H 9400 5550 50  0001 C CNN
	1    9400 5550
	-1   0    0    1   
$EndComp
$Comp
L C C103
U 1 1 5C7C49FB
P 1450 3750
F 0 "C103" H 1475 3850 50  0000 L CNN
F 1 "1nF" H 1475 3650 50  0000 L CNN
F 2 "Capacitors_SMD:C_0603_HandSoldering" H 1488 3600 50  0001 C CNN
F 3 "" H 1450 3750 50  0001 C CNN
	1    1450 3750
	-1   0    0    -1  
$EndComp
$Comp
L GND #PWR011
U 1 1 5C7D40D3
P 1450 3950
F 0 "#PWR011" H 1450 3700 50  0001 C CNN
F 1 "GND" H 1450 3800 50  0001 C CNN
F 2 "" H 1450 3950 50  0001 C CNN
F 3 "" H 1450 3950 50  0001 C CNN
	1    1450 3950
	1    0    0    -1  
$EndComp
$Comp
L GND #PWR012
U 1 1 5C7DCD2B
P 8200 1300
F 0 "#PWR012" H 8200 1050 50  0001 C CNN
F 1 "GND" H 8200 1150 50  0001 C CNN
F 2 "" H 8200 1300 50  0001 C CNN
F 3 "" H 8200 1300 50  0001 C CNN
	1    8200 1300
	-1   0    0    -1  
$EndComp
$Comp
L GND #PWR013
U 1 1 5C7DD8B3
P 5650 5200
F 0 "#PWR013" H 5650 4950 50  0001 C CNN
F 1 "GND" H 5650 5050 50  0001 C CNN
F 2 "" H 5650 5200 50  0001 C CNN
F 3 "" H 5650 5200 50  0001 C CNN
	1    5650 5200
	1    0    0    -1  
$EndComp
$Comp
L Conn_01x11_Male J102
U 1 1 5C7E700E
P 5900 3250
F 0 "J102" H 5900 3850 50  0000 C CNN
F 1 "Conn_01x11_Male" H 5900 2650 50  0000 C CNN
F 2 "Pin_Headers:Pin_Header_Straight_1x11_Pitch2.54mm" H 5900 3250 50  0001 C CNN
F 3 "" H 5900 3250 50  0001 C CNN
	1    5900 3250
	-1   0    0    1   
$EndComp
$Comp
L Conn_01x11_Male J103
U 1 1 5C7E72D9
P 5900 4650
F 0 "J103" H 5900 5250 50  0000 C CNN
F 1 "Conn_01x11_Male" H 5900 4050 50  0000 C CNN
F 2 "Pin_Headers:Pin_Header_Straight_1x11_Pitch2.54mm" H 5900 4650 50  0001 C CNN
F 3 "" H 5900 4650 50  0001 C CNN
	1    5900 4650
	-1   0    0    1   
$EndComp
$Comp
L Conn_01x11_Female J104
U 1 1 5C7E8B94
P 6500 3250
F 0 "J104" H 6500 3850 50  0000 C CNN
F 1 "Conn_01x11_Female" H 6500 2650 50  0000 C CNN
F 2 "Socket_Strips:Socket_Strip_Straight_1x11_Pitch2.54mm" H 6500 3250 50  0001 C CNN
F 3 "" H 6500 3250 50  0001 C CNN
	1    6500 3250
	-1   0    0    1   
$EndComp
$Comp
L Conn_01x11_Female J105
U 1 1 5C7E8EB6
P 6500 4650
F 0 "J105" H 6500 5250 50  0000 C CNN
F 1 "Conn_01x11_Female" H 6500 4050 50  0000 C CNN
F 2 "Socket_Strips:Socket_Strip_Straight_1x11_Pitch2.54mm" H 6500 4650 50  0001 C CNN
F 3 "" H 6500 4650 50  0001 C CNN
	1    6500 4650
	-1   0    0    1   
$EndComp
$Comp
L GND #PWR014
U 1 1 5C7E9772
P 6750 5200
F 0 "#PWR014" H 6750 4950 50  0001 C CNN
F 1 "GND" H 6750 5050 50  0001 C CNN
F 2 "" H 6750 5200 50  0001 C CNN
F 3 "" H 6750 5200 50  0001 C CNN
	1    6750 5200
	1    0    0    -1  
$EndComp
$Comp
L R R140
U 1 1 5C7EC4B3
P 9650 4850
F 0 "R140" V 9550 4850 50  0000 C CNN
F 1 "100k" V 9650 4850 50  0000 C CNN
F 2 "Resistors_SMD:R_0603_HandSoldering" V 9580 4850 50  0001 C CNN
F 3 "" H 9650 4850 50  0001 C CNN
	1    9650 4850
	0    1    1    0   
$EndComp
$Comp
L R R132
U 1 1 5C7EC5B6
P 9300 5550
F 0 "R132" H 9300 5850 50  0000 C CNN
F 1 "15k" V 9300 5550 50  0000 C CNN
F 2 "Resistors_SMD:R_0603_HandSoldering" V 9230 5550 50  0001 C CNN
F 3 "" H 9300 5550 50  0001 C CNN
	1    9300 5550
	-1   0    0    1   
$EndComp
$Comp
L C C115
U 1 1 5C7ED67F
P 7900 5550
F 0 "C115" H 7925 5650 50  0000 L CNN
F 1 "1nF" H 7925 5450 50  0000 L CNN
F 2 "Capacitors_SMD:C_0603_HandSoldering" H 7938 5400 50  0001 C CNN
F 3 "" H 7900 5550 50  0001 C CNN
	1    7900 5550
	-1   0    0    -1  
$EndComp
$Comp
L C C113
U 1 1 5C7EDB80
P 7700 5550
F 0 "C113" H 7725 5650 50  0000 L CNN
F 1 "1nF" H 7725 5450 50  0000 L CNN
F 2 "Capacitors_SMD:C_0603_HandSoldering" H 7738 5400 50  0001 C CNN
F 3 "" H 7700 5550 50  0001 C CNN
	1    7700 5550
	-1   0    0    -1  
$EndComp
$Comp
L C C112
U 1 1 5C7EDC90
P 7500 5550
F 0 "C112" H 7525 5650 50  0000 L CNN
F 1 "1nF" H 7525 5450 50  0000 L CNN
F 2 "Capacitors_SMD:C_0603_HandSoldering" H 7538 5400 50  0001 C CNN
F 3 "" H 7500 5550 50  0001 C CNN
	1    7500 5550
	-1   0    0    -1  
$EndComp
$Comp
L C C111
U 1 1 5C7EDDA3
P 7300 5550
F 0 "C111" H 7325 5650 50  0000 L CNN
F 1 "1nF" H 7325 5450 50  0000 L CNN
F 2 "Capacitors_SMD:C_0603_HandSoldering" H 7338 5400 50  0001 C CNN
F 3 "" H 7300 5550 50  0001 C CNN
	1    7300 5550
	-1   0    0    -1  
$EndComp
$Comp
L C C110
U 1 1 5C7EDEB9
P 7100 5550
F 0 "C110" H 7125 5650 50  0000 L CNN
F 1 "1nF" H 7125 5450 50  0000 L CNN
F 2 "Capacitors_SMD:C_0603_HandSoldering" H 7138 5400 50  0001 C CNN
F 3 "" H 7100 5550 50  0001 C CNN
	1    7100 5550
	-1   0    0    -1  
$EndComp
$Comp
L Conn_01x06 J107
U 1 1 5C7F3812
P 10600 5050
F 0 "J107" H 10600 5350 50  0000 C CNN
F 1 "Conn_01x06" H 10600 4650 50  0000 C CNN
F 2 "ble-ai4do8:PhoenixContact_PT_1.5-6-3.5-H" H 10600 5050 50  0001 C CNN
F 3 "" H 10600 5050 50  0001 C CNN
	1    10600 5050
	1    0    0    -1  
$EndComp
$Comp
L GND #PWR015
U 1 1 5C7F518E
P 10300 5400
F 0 "#PWR015" H 10300 5150 50  0001 C CNN
F 1 "GND" H 10300 5250 50  0001 C CNN
F 2 "" H 10300 5400 50  0001 C CNN
F 3 "" H 10300 5400 50  0001 C CNN
	1    10300 5400
	1    0    0    -1  
$EndComp
$Comp
L D_Zener D106
U 1 1 5C7F5EB2
P 9100 5550
F 0 "D106" H 9100 5650 50  0000 C CNN
F 1 "n.p." V 9500 5550 50  0000 C CNN
F 2 "Diodes_SMD:D_SOD-323_HandSoldering" H 9100 5550 50  0001 C CNN
F 3 "" H 9100 5550 50  0001 C CNN
	1    9100 5550
	0    1    1    0   
$EndComp
$Comp
L D_Zener D104
U 1 1 5C7F6C2B
P 8900 5550
F 0 "D104" H 8900 5650 50  0000 C CNN
F 1 "n.p." V 9200 5550 50  0000 C CNN
F 2 "Diodes_SMD:D_SOD-323_HandSoldering" H 8900 5550 50  0001 C CNN
F 3 "" H 8900 5550 50  0001 C CNN
	1    8900 5550
	0    1    1    0   
$EndComp
$Comp
L D_Zener D103
U 1 1 5C7F720B
P 8700 5550
F 0 "D103" H 8700 5650 50  0000 C CNN
F 1 "n.p." V 9100 5550 50  0000 C CNN
F 2 "Diodes_SMD:D_SOD-323_HandSoldering" H 8700 5550 50  0001 C CNN
F 3 "" H 8700 5550 50  0001 C CNN
	1    8700 5550
	0    1    1    0   
$EndComp
$Comp
L D_Zener D102
U 1 1 5C7F731C
P 8500 5550
F 0 "D102" H 8500 5650 50  0000 C CNN
F 1 "n.p." V 8800 5550 50  0000 C CNN
F 2 "Diodes_SMD:D_SOD-323_HandSoldering" H 8500 5550 50  0001 C CNN
F 3 "" H 8500 5550 50  0001 C CNN
	1    8500 5550
	0    1    1    0   
$EndComp
$Comp
L D_Zener D101
U 1 1 5C7F742A
P 8300 5550
F 0 "D101" H 8300 5650 50  0000 C CNN
F 1 "n.p." V 8700 5550 50  0000 C CNN
F 2 "Diodes_SMD:D_SOD-323_HandSoldering" H 8300 5550 50  0001 C CNN
F 3 "" H 8300 5550 50  0001 C CNN
	1    8300 5550
	0    1    1    0   
$EndComp
$Comp
L R R127
U 1 1 5C7F7B4F
P 8100 5350
F 0 "R127" V 8150 5600 50  0000 C CNN
F 1 "15k" V 8100 5350 50  0000 C CNN
F 2 "Resistors_SMD:R_0603_HandSoldering" V 8030 5350 50  0001 C CNN
F 3 "" H 8100 5350 50  0001 C CNN
	1    8100 5350
	0    -1   -1   0   
$EndComp
$Comp
L R R126
U 1 1 5C7F7D41
P 8100 5250
F 0 "R126" V 8150 5500 50  0000 C CNN
F 1 "15k" V 8100 5250 50  0000 C CNN
F 2 "Resistors_SMD:R_0603_HandSoldering" V 8030 5250 50  0001 C CNN
F 3 "" H 8100 5250 50  0001 C CNN
	1    8100 5250
	0    -1   -1   0   
$EndComp
$Comp
L R R125
U 1 1 5C7F7E5A
P 8100 5150
F 0 "R125" V 8150 5400 50  0000 C CNN
F 1 "15k" V 8100 5150 50  0000 C CNN
F 2 "Resistors_SMD:R_0603_HandSoldering" V 8030 5150 50  0001 C CNN
F 3 "" H 8100 5150 50  0001 C CNN
	1    8100 5150
	0    -1   -1   0   
$EndComp
$Comp
L R R124
U 1 1 5C7F7F7A
P 8100 5050
F 0 "R124" V 8150 5300 50  0000 C CNN
F 1 "15k" V 8100 5050 50  0000 C CNN
F 2 "Resistors_SMD:R_0603_HandSoldering" V 8030 5050 50  0001 C CNN
F 3 "" H 8100 5050 50  0001 C CNN
	1    8100 5050
	0    -1   -1   0   
$EndComp
$Comp
L R R123
U 1 1 5C7FF22F
P 8100 4850
F 0 "R123" V 8180 4850 50  0000 C CNN
F 1 "15k" V 8100 4850 50  0000 C CNN
F 2 "Resistors_SMD:R_0603_HandSoldering" V 8030 4850 50  0001 C CNN
F 3 "" H 8100 4850 50  0001 C CNN
	1    8100 4850
	0    -1   -1   0   
$EndComp
$Comp
L R R104
U 1 1 5C804252
P 1050 2700
F 0 "R104" V 1130 2700 50  0000 C CNN
F 1 "100k" V 1050 2700 50  0000 C CNN
F 2 "Resistors_SMD:R_0603_HandSoldering" V 980 2700 50  0001 C CNN
F 3 "" H 1050 2700 50  0001 C CNN
	1    1050 2700
	0    -1   -1   0   
$EndComp
$Comp
L R R144
U 1 1 5C807E28
P 9850 1700
F 0 "R144" V 9850 1300 50  0000 C CNN
F 1 "100k" V 9850 1700 50  0000 C CNN
F 2 "Resistors_SMD:R_0603_HandSoldering" V 9780 1700 50  0001 C CNN
F 3 "" H 9850 1700 50  0001 C CNN
	1    9850 1700
	-1   0    0    1   
$EndComp
$Comp
L R R142
U 1 1 5C8081B6
P 9750 1700
F 0 "R142" V 9750 1300 50  0000 C CNN
F 1 "100k" V 9750 1700 50  0000 C CNN
F 2 "Resistors_SMD:R_0603_HandSoldering" V 9680 1700 50  0001 C CNN
F 3 "" H 9750 1700 50  0001 C CNN
	1    9750 1700
	-1   0    0    1   
$EndComp
$Comp
L R R138
U 1 1 5C8082DD
P 9650 1700
F 0 "R138" V 9650 1300 50  0000 C CNN
F 1 "100k" V 9650 1700 50  0000 C CNN
F 2 "Resistors_SMD:R_0603_HandSoldering" V 9580 1700 50  0001 C CNN
F 3 "" H 9650 1700 50  0001 C CNN
	1    9650 1700
	-1   0    0    1   
$EndComp
$Comp
L R R135
U 1 1 5C80840B
P 9550 1700
F 0 "R135" V 9550 1300 50  0000 C CNN
F 1 "100k" V 9550 1700 50  0000 C CNN
F 2 "Resistors_SMD:R_0603_HandSoldering" V 9480 1700 50  0001 C CNN
F 3 "" H 9550 1700 50  0001 C CNN
	1    9550 1700
	-1   0    0    1   
$EndComp
$Comp
L R R136
U 1 1 5C81237B
P 9550 3400
F 0 "R136" V 9550 3000 50  0000 C CNN
F 1 "100k" V 9550 3400 50  0000 C CNN
F 2 "Resistors_SMD:R_0603_HandSoldering" V 9480 3400 50  0001 C CNN
F 3 "" H 9550 3400 50  0001 C CNN
	1    9550 3400
	-1   0    0    1   
$EndComp
$Comp
L R R139
U 1 1 5C8124DE
P 9650 3400
F 0 "R139" V 9650 3000 50  0000 C CNN
F 1 "100k" V 9650 3400 50  0000 C CNN
F 2 "Resistors_SMD:R_0603_HandSoldering" V 9580 3400 50  0001 C CNN
F 3 "" H 9650 3400 50  0001 C CNN
	1    9650 3400
	-1   0    0    1   
$EndComp
$Comp
L R R143
U 1 1 5C812AF7
P 9750 3400
F 0 "R143" V 9750 3000 50  0000 C CNN
F 1 "100k" V 9750 3400 50  0000 C CNN
F 2 "Resistors_SMD:R_0603_HandSoldering" V 9680 3400 50  0001 C CNN
F 3 "" H 9750 3400 50  0001 C CNN
	1    9750 3400
	-1   0    0    1   
$EndComp
$Comp
L R R145
U 1 1 5C812C30
P 9850 3400
F 0 "R145" V 9850 3000 50  0000 C CNN
F 1 "100k" V 9850 3400 50  0000 C CNN
F 2 "Resistors_SMD:R_0603_HandSoldering" V 9780 3400 50  0001 C CNN
F 3 "" H 9850 3400 50  0001 C CNN
	1    9850 3400
	-1   0    0    1   
$EndComp
$Comp
L GND #PWR016
U 1 1 5C7C12E8
P 8950 1250
F 0 "#PWR016" H 8950 1000 50  0001 C CNN
F 1 "GND" H 8950 1100 50  0001 C CNN
F 2 "" H 8950 1250 50  0001 C CNN
F 3 "" H 8950 1250 50  0001 C CNN
	1    8950 1250
	1    0    0    -1  
$EndComp
$Comp
L 24CW128OT U102
U 1 1 5C7C1FFB
P 1900 1950
F 0 "U102" H 1750 2250 50  0000 C CNN
F 1 "24CW128OT" H 1900 2450 50  0000 C CNN
F 2 "TO_SOT_Packages_SMD:SOT-23-5_HandSoldering" H 1900 2050 50  0001 C CIN
F 3 "" H 1900 2050 50  0001 C CNN
	1    1900 1950
	1    0    0    -1  
$EndComp
$Comp
L C C102
U 1 1 5C7C735A
P 1350 1800
F 0 "C102" H 1250 2200 50  0000 L CNN
F 1 "100nF" H 1250 2100 50  0000 L CNN
F 2 "Capacitors_SMD:C_0603_HandSoldering" H 1388 1650 50  0001 C CNN
F 3 "" H 1350 1800 50  0001 C CNN
	1    1350 1800
	1    0    0    -1  
$EndComp
$Comp
L GND #PWR017
U 1 1 5C7C74C7
P 1350 2000
F 0 "#PWR017" H 1350 1750 50  0001 C CNN
F 1 "GND" H 1350 1850 50  0001 C CNN
F 2 "" H 1350 2000 50  0001 C CNN
F 3 "" H 1350 2000 50  0001 C CNN
	1    1350 2000
	1    0    0    -1  
$EndComp
$Comp
L R R106
U 1 1 5C7C7D89
P 1150 1800
F 0 "R106" V 1200 2000 50  0000 C CNN
F 1 "15k" V 1150 1800 50  0000 C CNN
F 2 "Resistors_SMD:R_0603_HandSoldering" V 1080 1800 50  0001 C CNN
F 3 "" H 1150 1800 50  0001 C CNN
	1    1150 1800
	-1   0    0    1   
$EndComp
$Comp
L R R103
U 1 1 5C7C8267
P 1050 1800
F 0 "R103" V 1100 2000 50  0000 C CNN
F 1 "15k" V 1050 1800 50  0000 C CNN
F 2 "Resistors_SMD:R_0603_HandSoldering" V 980 1800 50  0001 C CNN
F 3 "" H 1050 1800 50  0001 C CNN
	1    1050 1800
	-1   0    0    1   
$EndComp
$Comp
L GND #PWR018
U 1 1 5C7CBDA5
P 1900 2250
F 0 "#PWR018" H 1900 2000 50  0001 C CNN
F 1 "GND" H 1900 2100 50  0001 C CNN
F 2 "" H 1900 2250 50  0001 C CNN
F 3 "" H 1900 2250 50  0001 C CNN
	1    1900 2250
	1    0    0    -1  
$EndComp
$Comp
L L L101
U 1 1 5C7CE3C6
P 9500 850
F 0 "L101" V 9450 850 50  0000 C CNN
F 1 "47µH" V 9575 850 50  0000 C CNN
F 2 "Choke_SMD:Choke_SMD_Wuerth-WE-PD2-Typ-MS" H 9500 850 50  0001 C CNN
F 3 "" H 9500 850 50  0001 C CNN
	1    9500 850 
	0    -1   -1   0   
$EndComp
$Comp
L Polyfuse F101
U 1 1 5C7CF6E0
P 9950 1150
F 0 "F101" V 9850 1250 50  0000 C CNN
F 1 "PTS120660V005" V 10050 1150 50  0000 C CNN
F 2 "Resistors_SMD:R_1206_HandSoldering" H 10000 950 50  0001 L CNN
F 3 "" H 9950 1150 50  0001 C CNN
	1    9950 1150
	1    0    0    -1  
$EndComp
$Comp
L Housing MK101
U 1 1 5C7EA94D
P 1200 6050
F 0 "MK101" H 1350 6050 50  0000 L CNN
F 1 "Housing" H 1350 5975 50  0000 L CNN
F 2 "ble-ai4do8:PhoenixContact_EH_45_F-F-B" H 1250 6100 50  0001 C CNN
F 3 "" H 1250 6100 50  0001 C CNN
	1    1200 6050
	1    0    0    -1  
$EndComp
$Comp
L EA_DOGS104x-A U103
U 1 1 5C7EEF3D
P 3100 1700
F 0 "U103" H 3050 2250 50  0000 C CNN
F 1 "EA_DOGS104x-A" H 2750 2350 50  0000 L CNN
F 2 "Displays:EA_DOGS104X-A" H 3150 1150 50  0001 C CNN
F 3 "" H 2600 1800 50  0001 C CNN
	1    3100 1700
	-1   0    0    -1  
$EndComp
$Comp
L R R112
U 1 1 5C7F168B
P 3800 1600
F 0 "R112" V 3850 1900 50  0000 C CNN
F 1 "150" V 3800 1600 50  0000 C CNN
F 2 "Resistors_SMD:R_0603_HandSoldering" V 3730 1600 50  0001 C CNN
F 3 "" H 3800 1600 50  0001 C CNN
	1    3800 1600
	0    1    -1   0   
$EndComp
$Comp
L R R110
U 1 1 5C7F1C96
P 3800 1400
F 0 "R110" V 3850 1700 50  0000 C CNN
F 1 "150" V 3800 1400 50  0000 C CNN
F 2 "Resistors_SMD:R_0603_HandSoldering" V 3730 1400 50  0001 C CNN
F 3 "" H 3800 1400 50  0001 C CNN
	1    3800 1400
	0    1    -1   0   
$EndComp
$Comp
L GND #PWR019
U 1 1 5C7F25DF
P 2650 2050
F 0 "#PWR019" H 2650 1800 50  0001 C CNN
F 1 "GND" H 2650 1900 50  0001 C CNN
F 2 "" H 2650 2050 50  0001 C CNN
F 3 "" H 2650 2050 50  0001 C CNN
	1    2650 2050
	-1   0    0    -1  
$EndComp
$Comp
L C C106
U 1 1 5C7F3DDC
P 2350 1800
F 0 "C106" H 2375 1900 50  0000 L CNN
F 1 "1µF" H 2375 1700 50  0000 L CNN
F 2 "Capacitors_SMD:C_0603_HandSoldering" H 2388 1650 50  0001 C CNN
F 3 "" H 2350 1800 50  0001 C CNN
	1    2350 1800
	-1   0    0    -1  
$EndComp
$Comp
L GND #PWR020
U 1 1 5C7F49D2
P 2650 1450
F 0 "#PWR020" H 2650 1200 50  0001 C CNN
F 1 "GND" H 2650 1300 50  0001 C CNN
F 2 "" H 2650 1450 50  0001 C CNN
F 3 "" H 2650 1450 50  0001 C CNN
	1    2650 1450
	-1   0    0    -1  
$EndComp
$Comp
L GND #PWR021
U 1 1 5C7F7987
P 3700 2250
F 0 "#PWR021" H 3700 2000 50  0001 C CNN
F 1 "GND" H 3700 2100 50  0001 C CNN
F 2 "" H 3700 2250 50  0001 C CNN
F 3 "" H 3700 2250 50  0001 C CNN
	1    3700 2250
	-1   0    0    -1  
$EndComp
$Comp
L Q_NMOS_GSD Q101
U 1 1 5C7FFBC9
P 4850 1850
F 0 "Q101" H 4550 2050 50  0000 L CNN
F 1 "IRLML2030" H 4550 2000 50  0000 L CNN
F 2 "TO_SOT_Packages_SMD:SOT-23_Handsoldering" H 5050 1950 50  0001 C CNN
F 3 "" H 4850 1850 50  0001 C CNN
	1    4850 1850
	1    0    0    -1  
$EndComp
$Comp
L Q_NMOS_GSD Q102
U 1 1 5C800403
P 5450 1850
F 0 "Q102" H 5150 2050 50  0000 L CNN
F 1 "IRLML2030" H 5150 2000 50  0000 L CNN
F 2 "TO_SOT_Packages_SMD:SOT-23_Handsoldering" H 5650 1950 50  0001 C CNN
F 3 "" H 5450 1850 50  0001 C CNN
	1    5450 1850
	1    0    0    -1  
$EndComp
$Comp
L R R113
U 1 1 5C800575
P 4750 2100
F 0 "R113" V 4830 2100 50  0000 C CNN
F 1 "100k" V 4750 2100 50  0000 C CNN
F 2 "Resistors_SMD:R_0603_HandSoldering" V 4680 2100 50  0001 C CNN
F 3 "" H 4750 2100 50  0001 C CNN
	1    4750 2100
	0    -1   1    0   
$EndComp
$Comp
L R R114
U 1 1 5C800A0E
P 5350 2100
F 0 "R114" V 5430 2100 50  0000 C CNN
F 1 "100k" V 5350 2100 50  0000 C CNN
F 2 "Resistors_SMD:R_0603_HandSoldering" V 5280 2100 50  0001 C CNN
F 3 "" H 5350 2100 50  0001 C CNN
	1    5350 2100
	0    -1   1    0   
$EndComp
$Comp
L GND #PWR022
U 1 1 5C8029B5
P 4950 2150
F 0 "#PWR022" H 4950 1900 50  0001 C CNN
F 1 "GND" H 4950 2000 50  0001 C CNN
F 2 "" H 4950 2150 50  0001 C CNN
F 3 "" H 4950 2150 50  0001 C CNN
	1    4950 2150
	-1   0    0    -1  
$EndComp
$Comp
L GND #PWR023
U 1 1 5C8031D7
P 5550 2150
F 0 "#PWR023" H 5550 1900 50  0001 C CNN
F 1 "GND" H 5550 2000 50  0001 C CNN
F 2 "" H 5550 2150 50  0001 C CNN
F 3 "" H 5550 2150 50  0001 C CNN
	1    5550 2150
	-1   0    0    -1  
$EndComp
Text Notes 2800 2350 0    60   ~ 0
I2C: 0x3C
Text Notes 1950 2250 0    60   ~ 0
I2C: 0x50
$Comp
L R R111
U 1 1 5C803463
P 3800 1500
F 0 "R111" V 3850 1800 50  0000 C CNN
F 1 "n.p." V 3800 1500 50  0000 C CNN
F 2 "Resistors_SMD:R_0603_HandSoldering" V 3730 1500 50  0001 C CNN
F 3 "" H 3800 1500 50  0001 C CNN
	1    3800 1500
	0    1    -1   0   
$EndComp
Wire Wire Line
	2650 2850 2650 2950
Wire Wire Line
	2850 3050 2800 3050
Wire Wire Line
	2800 3050 2800 3400
Wire Wire Line
	2650 3350 2850 3350
Wire Wire Line
	2850 3250 2800 3250
Connection ~ 2800 3250
Wire Wire Line
	2850 3150 2800 3150
Connection ~ 2800 3150
Wire Wire Line
	2650 3350 2650 3250
Connection ~ 2800 3350
Wire Wire Line
	2200 5200 2200 5250
Wire Wire Line
	2200 5250 2800 5250
Wire Wire Line
	2800 5250 2800 5200
Wire Wire Line
	2500 5050 2500 5300
Connection ~ 2500 5250
Wire Wire Line
	2200 4650 2200 4900
Wire Wire Line
	2200 4850 2350 4850
Wire Wire Line
	2850 4650 2200 4650
Connection ~ 2200 4850
Wire Wire Line
	2650 4850 2850 4850
Wire Wire Line
	2800 4850 2800 4900
Connection ~ 2800 4850
Wire Wire Line
	8700 2450 8700 2500
Wire Wire Line
	8900 2450 8900 2500
Wire Wire Line
	8700 2800 8700 2850
Wire Wire Line
	8700 2850 8900 2850
Wire Wire Line
	8900 2850 8900 2800
Wire Wire Line
	8800 2850 8800 2900
Connection ~ 8800 2850
Wire Wire Line
	8050 1700 8050 1750
Wire Wire Line
	7900 1750 8100 1750
Wire Wire Line
	7950 1700 7950 1850
Wire Wire Line
	7900 1850 8100 1850
Connection ~ 8050 1750
Connection ~ 7950 1850
Wire Wire Line
	7950 1400 7950 1350
Wire Wire Line
	7500 1350 8050 1350
Wire Wire Line
	8050 1350 8050 1400
Wire Wire Line
	8700 4150 8700 4200
Wire Wire Line
	8900 4150 8900 4200
Wire Wire Line
	8700 4500 8700 4550
Wire Wire Line
	8700 4550 8900 4550
Wire Wire Line
	8900 4550 8900 4500
Wire Wire Line
	8800 4550 8800 4600
Connection ~ 8800 4550
Wire Wire Line
	8050 3400 8050 3450
Wire Wire Line
	7900 3450 8100 3450
Wire Wire Line
	7950 3400 7950 3550
Wire Wire Line
	7900 3550 8100 3550
Connection ~ 8050 3450
Connection ~ 7950 3550
Wire Wire Line
	7950 3050 7950 3100
Wire Wire Line
	8200 3200 8200 3150
Wire Wire Line
	8200 3150 8250 3150
Wire Wire Line
	9950 3150 8550 3150
Wire Wire Line
	9300 3150 9300 3250
Wire Wire Line
	9200 3250 9200 3150
Connection ~ 9200 3150
Wire Wire Line
	9100 3250 9100 3150
Connection ~ 9100 3150
Wire Wire Line
	9000 3250 9000 3150
Connection ~ 9000 3150
Wire Wire Line
	8900 3250 8900 3150
Connection ~ 8900 3150
Wire Wire Line
	8800 3250 8800 3150
Connection ~ 8800 3150
Wire Wire Line
	8700 3250 8700 3150
Connection ~ 8700 3150
Wire Wire Line
	8600 3250 8600 3150
Connection ~ 8600 3150
Wire Wire Line
	8600 1450 8600 1550
Wire Wire Line
	8200 1500 8200 1450
Wire Wire Line
	8200 1450 8250 1450
Wire Wire Line
	8700 1450 8700 1550
Connection ~ 8600 1450
Wire Wire Line
	8800 1450 8800 1550
Connection ~ 8700 1450
Wire Wire Line
	8900 1450 8900 1550
Connection ~ 8800 1450
Wire Wire Line
	9000 1450 9000 1550
Connection ~ 8900 1450
Wire Wire Line
	9100 1450 9100 1550
Connection ~ 9000 1450
Wire Wire Line
	9200 1450 9200 1550
Connection ~ 9100 1450
Wire Wire Line
	9300 1450 9300 1550
Connection ~ 9200 1450
Wire Wire Line
	8050 3050 8050 3100
Wire Wire Line
	8550 1450 9950 1450
Wire Wire Line
	9950 1300 9950 4850
Connection ~ 9300 1450
Connection ~ 9300 3150
Wire Wire Line
	8650 850  8650 900 
Connection ~ 8650 850 
Wire Wire Line
	8650 1250 8650 1200
Wire Wire Line
	8200 1150 8200 1300
Connection ~ 8200 1250
Connection ~ 7950 1350
Connection ~ 7950 3050
Wire Wire Line
	9500 3950 10350 3950
Wire Wire Line
	9500 3850 10300 3850
Wire Wire Line
	9500 3750 10250 3750
Wire Wire Line
	9500 3650 10200 3650
Wire Wire Line
	9550 1850 9550 2550
Wire Wire Line
	9550 2250 9500 2250
Wire Wire Line
	9500 2150 9650 2150
Wire Wire Line
	9650 1850 9650 2650
Wire Wire Line
	9500 2050 9750 2050
Wire Wire Line
	9750 1850 9750 2750
Wire Wire Line
	9500 1950 9850 1950
Wire Wire Line
	9850 1850 9850 2850
Wire Wire Line
	10400 2450 10350 2450
Wire Wire Line
	10350 2450 10350 2950
Wire Wire Line
	10300 2950 10400 2950
Connection ~ 10350 2950
Wire Wire Line
	9950 2350 10400 2350
Connection ~ 9950 2350
Connection ~ 2650 2850
Wire Wire Line
	1000 4100 1000 4900
Wire Wire Line
	1000 4750 1050 4750
Wire Wire Line
	1850 4750 1900 4750
Wire Wire Line
	1900 4450 1900 4900
Wire Wire Line
	800  5200 800  5250
Wire Wire Line
	800  5250 1900 5250
Wire Wire Line
	1450 5050 1450 5300
Wire Wire Line
	1000 5200 1000 5250
Connection ~ 1000 5250
Wire Wire Line
	1900 5250 1900 5200
Connection ~ 1450 5250
Wire Wire Line
	1050 4850 800  4850
Wire Wire Line
	800  4250 800  4900
Wire Wire Line
	7500 850  7900 850 
Wire Wire Line
	2850 4450 1900 4450
Connection ~ 1900 4750
Wire Wire Line
	2850 4250 800  4250
Connection ~ 800  4850
Connection ~ 1000 4750
Wire Wire Line
	1750 3750 1950 3750
Wire Wire Line
	2500 3650 2850 3650
Wire Wire Line
	850  3400 850  3600
Wire Wire Line
	1050 3000 1050 2950
Wire Wire Line
	1000 3550 850  3550
Wire Wire Line
	1300 3550 1650 3550
Connection ~ 2500 3650
Wire Wire Line
	2500 2850 2500 2950
Connection ~ 2500 2850
Wire Wire Line
	1750 2550 1750 4100
Connection ~ 1750 2850
Wire Wire Line
	1600 2850 2850 2850
Wire Wire Line
	1250 2950 1450 2950
Wire Wire Line
	1250 2700 1250 3000
Wire Wire Line
	850  2850 900  2850
Wire Wire Line
	850  2700 850  3000
Wire Wire Line
	1050 2950 850  2950
Connection ~ 850  3550
Wire Wire Line
	1650 4350 2850 4350
Connection ~ 9950 3150
Wire Wire Line
	9700 5350 9700 5400
Wire Wire Line
	9600 5250 9600 5400
Wire Wire Line
	9500 5150 9500 5400
Wire Wire Line
	9400 5750 9400 5700
Wire Wire Line
	9700 5750 9700 5700
Wire Wire Line
	9600 5750 9600 5700
Connection ~ 9600 5750
Wire Wire Line
	9500 5750 9500 5700
Connection ~ 9500 5750
Wire Wire Line
	7000 1750 7600 1750
Wire Wire Line
	7600 1850 7150 1850
Wire Wire Line
	8100 1950 6950 1950
Wire Wire Line
	8100 2050 6900 2050
Wire Wire Line
	8100 2150 7200 2150
Wire Wire Line
	7250 2250 7250 4350
Connection ~ 9400 5050
Connection ~ 9500 5150
Connection ~ 9600 5250
Connection ~ 9700 5350
Connection ~ 1450 3550
Wire Wire Line
	850  3950 850  3900
Wire Wire Line
	1050 3400 1450 3550
Wire Wire Line
	850  3550 1250 3400
Wire Wire Line
	850  2550 5600 2550
Wire Wire Line
	1450 3900 1450 3950
Wire Wire Line
	1450 3400 1450 3600
Connection ~ 850  2950
Wire Wire Line
	1200 2850 1300 2850
Connection ~ 1250 2950
Wire Wire Line
	1450 2950 1450 3000
Connection ~ 1250 2850
Wire Wire Line
	1650 3550 1650 4350
Wire Wire Line
	5600 3750 5700 3750
Wire Wire Line
	5600 2550 5600 4150
Wire Wire Line
	4800 4450 4800 4750
Wire Wire Line
	4850 4350 4850 4650
Wire Wire Line
	4850 4350 4250 4350
Wire Wire Line
	4750 4250 4750 4850
Wire Wire Line
	4700 4550 4700 4950
Wire Wire Line
	4700 4550 4250 4550
Wire Wire Line
	4250 5050 5700 5050
Wire Wire Line
	4250 5150 5700 5150
Wire Wire Line
	4250 4150 5000 4150
Wire Wire Line
	5000 4150 5000 4450
Wire Wire Line
	5050 4050 5050 4350
Wire Wire Line
	4550 4750 4250 4750
Wire Wire Line
	4250 4850 4600 4850
Wire Wire Line
	5600 4150 5700 4150
Wire Wire Line
	6750 2750 6750 5200
Wire Wire Line
	6800 3750 6700 3750
Wire Wire Line
	7500 4150 6700 4150
Wire Wire Line
	7500 850  7500 4150
Connection ~ 7500 3050
Wire Wire Line
	9800 4850 10400 4850
Wire Wire Line
	8250 4850 9500 4850
Wire Wire Line
	9400 5050 9400 5400
Wire Wire Line
	9300 5400 9300 4850
Wire Wire Line
	9300 5750 9300 5700
Connection ~ 9400 5750
Connection ~ 9300 5750
Connection ~ 9300 4850
Wire Wire Line
	7200 2150 7200 4250
Wire Wire Line
	10050 5050 10400 5050
Wire Wire Line
	10050 5150 10400 5150
Wire Wire Line
	10400 5250 10050 5250
Wire Wire Line
	10050 5350 10400 5350
Connection ~ 9950 4850
Wire Wire Line
	10300 5400 10300 4950
Wire Wire Line
	10300 4950 10400 4950
Wire Wire Line
	8250 5050 9750 5050
Wire Wire Line
	8250 5150 9750 5150
Wire Wire Line
	8250 5250 9750 5250
Wire Wire Line
	8250 5350 9750 5350
Wire Wire Line
	9100 5400 9100 5350
Connection ~ 9100 5350
Wire Wire Line
	8900 5400 8900 5250
Connection ~ 8900 5250
Wire Wire Line
	8700 5400 8700 5150
Connection ~ 8700 5150
Wire Wire Line
	8500 5400 8500 5050
Connection ~ 8500 5050
Wire Wire Line
	8300 5400 8300 4850
Connection ~ 8300 4850
Wire Wire Line
	6900 5350 7950 5350
Wire Wire Line
	7900 5350 7900 5400
Wire Wire Line
	6950 5250 7950 5250
Wire Wire Line
	7700 5250 7700 5400
Wire Wire Line
	7500 5400 7500 5150
Wire Wire Line
	7000 5150 7950 5150
Wire Wire Line
	7050 5050 7950 5050
Wire Wire Line
	7300 5050 7300 5400
Wire Wire Line
	7100 4750 7100 5400
Wire Wire Line
	7100 4850 7950 4850
Wire Wire Line
	7100 5700 7100 5750
Wire Wire Line
	7100 5750 9700 5750
Wire Wire Line
	8300 5700 8300 5800
Connection ~ 8300 5750
Wire Wire Line
	8500 5700 8500 5750
Connection ~ 8500 5750
Wire Wire Line
	8700 5700 8700 5750
Connection ~ 8700 5750
Wire Wire Line
	8900 5700 8900 5750
Connection ~ 8900 5750
Wire Wire Line
	9100 5700 9100 5750
Connection ~ 9100 5750
Wire Wire Line
	7900 5700 7900 5750
Connection ~ 7900 5750
Wire Wire Line
	7700 5700 7700 5750
Connection ~ 7700 5750
Wire Wire Line
	7500 5700 7500 5750
Connection ~ 7500 5750
Wire Wire Line
	7300 5700 7300 5750
Connection ~ 7300 5750
Connection ~ 7900 5350
Connection ~ 7700 5250
Connection ~ 7500 5150
Connection ~ 7300 5050
Connection ~ 7100 4850
Wire Wire Line
	850  2700 900  2700
Connection ~ 850  2850
Wire Wire Line
	1200 2700 1250 2700
Wire Wire Line
	9550 1450 9550 1550
Wire Wire Line
	9650 1450 9650 1550
Connection ~ 9550 1450
Wire Wire Line
	9750 1450 9750 1550
Connection ~ 9650 1450
Wire Wire Line
	9850 1450 9850 1550
Connection ~ 9750 1450
Connection ~ 9850 1950
Connection ~ 9750 2050
Connection ~ 9650 2150
Connection ~ 9550 2250
Wire Wire Line
	10300 3850 10300 3150
Wire Wire Line
	10350 3950 10350 3050
Wire Wire Line
	10250 3750 10250 3250
Wire Wire Line
	10200 3650 10200 3350
Wire Wire Line
	7250 2250 8100 2250
Wire Wire Line
	7500 3050 8050 3050
Wire Wire Line
	8100 3750 7000 3750
Connection ~ 9850 1450
Wire Wire Line
	9850 3250 9850 3150
Connection ~ 9850 3150
Wire Wire Line
	9750 3250 9750 3150
Connection ~ 9750 3150
Wire Wire Line
	9650 3250 9650 3150
Connection ~ 9650 3150
Wire Wire Line
	9550 3250 9550 3150
Connection ~ 9550 3150
Wire Wire Line
	9550 3550 9550 3650
Connection ~ 9550 3650
Wire Wire Line
	9650 3550 9650 3750
Connection ~ 9650 3750
Wire Wire Line
	9750 3550 9750 3850
Connection ~ 9750 3850
Wire Wire Line
	9850 3550 9850 3950
Connection ~ 9850 3950
Connection ~ 9950 1450
Wire Wire Line
	7750 1250 8650 1250
Wire Wire Line
	8950 1200 8950 1250
Wire Wire Line
	8950 850  8950 900 
Connection ~ 8950 850 
Wire Wire Line
	9350 850  9300 850 
Wire Wire Line
	8500 850  9000 850 
Wire Wire Line
	7750 1250 7750 1200
Wire Wire Line
	7750 900  7750 850 
Connection ~ 7750 850 
Connection ~ 5600 3750
Wire Wire Line
	1150 2400 4350 2400
Wire Wire Line
	1050 2450 4300 2450
Wire Wire Line
	1900 1550 1900 1600
Wire Wire Line
	2350 1550 850  1550
Wire Wire Line
	1600 1850 1550 1850
Wire Wire Line
	1550 1850 1550 2400
Wire Wire Line
	1600 1750 1500 1750
Wire Wire Line
	1500 1750 1500 2450
Wire Wire Line
	1350 1950 1350 2000
Wire Wire Line
	1350 1550 1350 1650
Connection ~ 1900 1550
Wire Wire Line
	1050 1650 1050 1550
Connection ~ 1350 1550
Wire Wire Line
	1150 1650 1150 1550
Connection ~ 1150 1550
Wire Wire Line
	1150 1950 1150 2400
Connection ~ 1550 2400
Wire Wire Line
	1050 1950 1050 2450
Connection ~ 1500 2450
Connection ~ 1050 1550
Connection ~ 1750 2550
Wire Wire Line
	1900 2200 1900 2250
Wire Wire Line
	9650 850  9950 850 
Wire Wire Line
	9950 850  9950 1000
Wire Wire Line
	4250 4050 5050 4050
Wire Wire Line
	4250 2850 5700 2850
Wire Wire Line
	3650 1500 3600 1500
Wire Wire Line
	2700 1600 2650 1600
Wire Wire Line
	2650 1600 2650 1650
Wire Wire Line
	2650 1950 2650 2050
Wire Wire Line
	2350 2000 2700 2000
Connection ~ 2650 2000
Wire Wire Line
	2350 2000 2350 1950
Wire Wire Line
	2700 1300 2350 1300
Wire Wire Line
	2350 1200 2350 1650
Wire Wire Line
	2700 1400 2650 1400
Wire Wire Line
	2650 1400 2650 1450
Wire Wire Line
	3650 1400 3600 1400
Wire Wire Line
	3600 2000 3650 2000
Wire Wire Line
	3650 2000 3650 2100
Wire Wire Line
	3600 2100 4000 2100
Wire Wire Line
	3700 1800 3700 2250
Wire Wire Line
	3700 1800 3600 1800
Wire Wire Line
	3600 2200 3700 2200
Connection ~ 3700 2200
Connection ~ 2350 1550
Wire Wire Line
	3600 1300 3650 1300
Wire Wire Line
	3650 1300 3650 1200
Wire Wire Line
	2350 1200 4000 1200
Connection ~ 2350 1300
Wire Wire Line
	3600 1900 4050 1900
Wire Wire Line
	4050 1900 4050 2450
Connection ~ 4050 2450
Wire Wire Line
	4000 2100 4000 2400
Connection ~ 4000 2400
Connection ~ 3650 2100
Wire Wire Line
	850  1550 850  2550
Wire Wire Line
	3600 1700 4400 1700
Wire Wire Line
	4400 1700 4400 4650
Wire Wire Line
	4400 4650 4250 4650
Wire Wire Line
	5150 1850 5250 1850
Wire Wire Line
	4550 1850 4650 1850
Wire Wire Line
	5550 2050 5550 2150
Wire Wire Line
	4950 2050 4950 2150
Wire Wire Line
	3950 1400 5550 1400
Wire Wire Line
	5550 1400 5550 1650
Wire Wire Line
	4550 1850 4550 4750
Wire Wire Line
	4550 2100 4600 2100
Wire Wire Line
	5150 1850 5150 2350
Wire Wire Line
	5150 2100 5200 2100
Wire Wire Line
	5500 2100 5550 2100
Connection ~ 5550 2100
Wire Wire Line
	4900 2100 4950 2100
Connection ~ 4950 2100
Connection ~ 4550 2100
Wire Wire Line
	4600 4850 4600 2350
Wire Wire Line
	4600 2350 5150 2350
Connection ~ 5150 2100
Wire Wire Line
	3600 1600 3650 1600
Wire Wire Line
	3950 1600 4950 1600
Wire Wire Line
	4950 1600 4950 1650
Wire Wire Line
	3950 1500 4000 1500
Wire Wire Line
	4000 1500 4000 1200
Connection ~ 3650 1200
Wire Wire Line
	4700 4950 5700 4950
Wire Wire Line
	4750 4850 5700 4850
Wire Wire Line
	6700 5150 6900 5150
Wire Wire Line
	6900 5150 6900 5350
Wire Wire Line
	6700 5050 6950 5050
Wire Wire Line
	6950 5050 6950 5250
Wire Wire Line
	6700 4950 7000 4950
Wire Wire Line
	7000 4950 7000 5150
Wire Wire Line
	6700 4850 7050 4850
Wire Wire Line
	7050 4850 7050 5050
Wire Wire Line
	7100 4750 6700 4750
Wire Wire Line
	4250 3650 5700 3650
Wire Wire Line
	4250 3550 5700 3550
Wire Wire Line
	4250 3450 5700 3450
Wire Wire Line
	4250 3350 5700 3350
Wire Wire Line
	4250 3250 5700 3250
Wire Wire Line
	4250 3150 5700 3150
Wire Wire Line
	4250 3050 5700 3050
Wire Wire Line
	4250 2950 5700 2950
Wire Wire Line
	5700 2750 5650 2750
Wire Wire Line
	5650 2750 5650 5200
Wire Wire Line
	6750 2750 6700 2750
Wire Wire Line
	2500 4150 2450 4150
Connection ~ 1750 3750
Wire Wire Line
	1750 4100 1000 4100
Wire Wire Line
	1900 3950 1950 3950
Wire Wire Line
	1850 4150 1950 4150
Connection ~ 1900 3950
Connection ~ 1900 4150
Wire Wire Line
	2450 3850 2850 3850
Wire Wire Line
	2450 3750 2850 3750
Wire Wire Line
	1950 3850 1900 3850
Wire Wire Line
	1900 3850 1900 4150
NoConn ~ 1950 4050
NoConn ~ 2450 4050
NoConn ~ 2450 3950
Wire Wire Line
	2500 3250 2500 4150
$Comp
L GND #PWR024
U 1 1 5C81C037
P 8300 5800
F 0 "#PWR024" H 8300 5550 50  0001 C CNN
F 1 "GND" H 8300 5650 50  0001 C CNN
F 2 "" H 8300 5800 50  0001 C CNN
F 3 "" H 8300 5800 50  0001 C CNN
	1    8300 5800
	1    0    0    -1  
$EndComp
Wire Wire Line
	9850 2850 10400 2850
Wire Wire Line
	9750 2750 10400 2750
Wire Wire Line
	9650 2650 10400 2650
Wire Wire Line
	9550 2550 10400 2550
Wire Wire Line
	10350 3050 10400 3050
Wire Wire Line
	10300 3150 10400 3150
Wire Wire Line
	10250 3250 10400 3250
Wire Wire Line
	10200 3350 10400 3350
Connection ~ 7500 1350
Wire Wire Line
	6800 3750 6800 4150
Connection ~ 6800 4150
Text Label 7500 850  0    60   ~ 0
V3.0
Text Label 10000 2550 0    60   ~ 0
DO0
Text Label 10000 2650 0    60   ~ 0
DO1
Text Label 10000 2750 0    60   ~ 0
DO2
Text Label 10000 2850 0    60   ~ 0
DO3
Text Label 10000 3950 0    60   ~ 0
DO4
Text Label 10000 3850 0    60   ~ 0
DO5
Text Label 10000 3750 0    60   ~ 0
DO6
Text Label 10000 3650 0    60   ~ 0
DO7
Wire Wire Line
	6700 3650 7000 3650
Wire Wire Line
	7000 3650 7000 3750
Wire Wire Line
	6700 3550 7050 3550
Wire Wire Line
	7050 3550 7050 3650
Wire Wire Line
	7050 3650 8100 3650
Wire Wire Line
	7600 3550 7450 3550
Wire Wire Line
	6950 3850 8100 3850
Wire Wire Line
	6900 3950 8100 3950
Wire Wire Line
	7600 3450 6700 3450
Wire Wire Line
	7450 3550 7450 3350
Wire Wire Line
	7450 3350 6700 3350
Wire Wire Line
	6950 3850 6950 3250
Wire Wire Line
	6950 3250 6700 3250
Wire Wire Line
	6900 3950 6900 3150
Wire Wire Line
	6900 3150 6700 3150
Wire Wire Line
	7000 1750 7000 3050
Wire Wire Line
	7000 3050 6700 3050
Wire Wire Line
	6950 1950 6950 2950
Wire Wire Line
	6950 2950 6700 2950
Wire Wire Line
	6900 2050 6900 2850
Wire Wire Line
	6900 2850 6700 2850
Wire Wire Line
	7150 1850 7150 4450
Wire Wire Line
	7150 4450 6700 4450
Wire Wire Line
	5100 4250 5700 4250
Wire Wire Line
	5050 4350 5700 4350
Wire Wire Line
	5000 4450 5700 4450
Wire Wire Line
	5650 4550 5700 4550
Connection ~ 5650 4550
Wire Wire Line
	6700 4550 6750 4550
Connection ~ 6750 4550
Wire Wire Line
	7200 4250 6700 4250
Wire Wire Line
	7250 4350 6700 4350
Wire Wire Line
	4800 4750 5700 4750
Wire Wire Line
	4850 4650 5700 4650
Wire Wire Line
	5100 4250 5100 3950
Wire Wire Line
	5100 3950 4250 3950
Wire Wire Line
	4300 2450 4300 3750
Wire Wire Line
	4300 3750 4250 3750
Wire Wire Line
	4350 2400 4350 3850
Wire Wire Line
	4350 3850 4250 3850
Wire Wire Line
	4750 4250 4250 4250
Wire Wire Line
	4800 4450 4250 4450
NoConn ~ 2850 4050
NoConn ~ 2850 4150
NoConn ~ 4250 4950
NoConn ~ 6700 4650
$EndSCHEMATC
