(export (version D)
  (design
    (source /home/andi/Projekte/Elektronik/bastelino-esp32-s2/hardware/bastelino-esp32-s2.sch)
    (date "Do 18 Feb 2021 20:43:35 CET")
    (tool "Eeschema 5.0.2+dfsg1-1")
    (sheet (number 1) (name /) (tstamps /)
      (title_block
        (title "Bastelino ESP32-S2")
        (company "(c) 2021 Andreas Messer")
        (rev r1)
        (date 2021-02-18)
        (source bastelino-esp32-s2.sch)
        (comment (number 1) (value "This work is licensed under a Creative Commons Attribution 4.0 International License."))
        (comment (number 2) (value ""))
        (comment (number 3) (value ""))
        (comment (number 4) (value "")))))
  (components
    (comp (ref L1)
      (value "2.2uH 1.2A")
      (footprint Inductors:Inductor_Abracon_ASPI-3012S)
      (datasheet ~)
      (fields
        (field (name MPN) DJNR3015-2R2)
        (field (name Manufacturer) Sumida))
      (libsource (lib Device) (part L) (description Inductor))
      (sheetpath (names /) (tstamps /))
      (tstamp 602064E6))
    (comp (ref R8)
      (value 430k)
      (footprint Resistors_SMD:R_0603)
      (datasheet ~)
      (libsource (lib Device) (part R) (description Resistor))
      (sheetpath (names /) (tstamps /))
      (tstamp 6020684C))
    (comp (ref R7)
      (value 100k)
      (footprint Resistors_SMD:R_0603)
      (datasheet ~)
      (libsource (lib Device) (part R) (description Resistor))
      (sheetpath (names /) (tstamps /))
      (tstamp 60207B57))
    (comp (ref U2)
      (value MIC2033-12AYM6)
      (footprint TO_SOT_Packages_SMD:SOT-23-6)
      (libsource (lib ProjectSymbols) (part MIC2033-xxxxM6) (description ""))
      (sheetpath (names /) (tstamps /))
      (tstamp 6020C53F))
    (comp (ref R2)
      (value 10k)
      (footprint Resistors_SMD:R_0603)
      (datasheet ~)
      (libsource (lib Device) (part R) (description Resistor))
      (sheetpath (names /) (tstamps /))
      (tstamp 6020C60B))
    (comp (ref C4)
      (value 100nF)
      (footprint Capacitors_SMD:C_0603)
      (datasheet ~)
      (libsource (lib Device) (part C) (description "Unpolarized capacitor"))
      (sheetpath (names /) (tstamps /))
      (tstamp 6020CFCB))
    (comp (ref C1)
      (value 1uF)
      (footprint Capacitors_SMD:C_0603)
      (datasheet ~)
      (libsource (lib Device) (part C) (description "Unpolarized capacitor"))
      (sheetpath (names /) (tstamps /))
      (tstamp 602253D4))
    (comp (ref R3)
      (value 10k)
      (footprint Resistors_SMD:R_0603)
      (datasheet ~)
      (libsource (lib Device) (part R) (description Resistor))
      (sheetpath (names /) (tstamps /))
      (tstamp 6022707B))
    (comp (ref C10)
      (value 22pF)
      (footprint Capacitors_SMD:C_0603)
      (datasheet ~)
      (libsource (lib Device) (part C) (description "Unpolarized capacitor"))
      (sheetpath (names /) (tstamps /))
      (tstamp 6022D9BC))
    (comp (ref C3)
      (value 100nF)
      (footprint Capacitors_SMD:C_0603)
      (datasheet ~)
      (libsource (lib Device) (part C) (description "Unpolarized capacitor"))
      (sheetpath (names /) (tstamps /))
      (tstamp 602360F1))
    (comp (ref J1)
      (value USB_B_Micro)
      (footprint Connect:USB_Micro-B)
      (datasheet ~)
      (libsource (lib Connector) (part USB_B_Micro) (description "USB Micro Type B connector"))
      (sheetpath (names /) (tstamps /))
      (tstamp 60239838))
    (comp (ref R1)
      (value 100k)
      (footprint Resistors_SMD:R_0603)
      (datasheet ~)
      (libsource (lib Device) (part R) (description Resistor))
      (sheetpath (names /) (tstamps /))
      (tstamp 60244DB4))
    (comp (ref C2)
      (value 100nF)
      (footprint Capacitors_SMD:C_0603)
      (datasheet ~)
      (libsource (lib Device) (part C) (description "Unpolarized capacitor"))
      (sheetpath (names /) (tstamps /))
      (tstamp 60244E18))
    (comp (ref U6)
      (value ESP32-S2-WROOM)
      (footprint ProjectFootprints:Espressif_ESP32-S2-WROOM)
      (libsource (lib ProjectSymbols) (part ESP32-S2-WROOM) (description ""))
      (sheetpath (names /) (tstamps /))
      (tstamp 602053DB))
    (comp (ref C11)
      (value 10uF)
      (footprint Capacitors_SMD:C_0805)
      (datasheet ~)
      (libsource (lib Device) (part C) (description "Unpolarized capacitor"))
      (sheetpath (names /) (tstamps /))
      (tstamp 60205543))
    (comp (ref C8)
      (value 10uF)
      (footprint Capacitors_SMD:C_0805)
      (datasheet ~)
      (libsource (lib Device) (part C) (description "Unpolarized capacitor"))
      (sheetpath (names /) (tstamps /))
      (tstamp 6020558D))
    (comp (ref C13)
      (value 1uF)
      (footprint Capacitors_SMD:C_0603)
      (datasheet ~)
      (libsource (lib Device) (part C) (description "Unpolarized capacitor"))
      (sheetpath (names /) (tstamps /))
      (tstamp 60207148))
    (comp (ref R17)
      (value 10k)
      (footprint Resistors_SMD:R_0603)
      (datasheet ~)
      (libsource (lib Device) (part R) (description Resistor))
      (sheetpath (names /) (tstamps /))
      (tstamp 6023BA2E))
    (comp (ref R14)
      (value 10k)
      (footprint Resistors_SMD:R_0603)
      (datasheet ~)
      (libsource (lib Device) (part R) (description Resistor))
      (sheetpath (names /) (tstamps /))
      (tstamp 60269BDE))
    (comp (ref R16)
      (value 10k)
      (footprint Resistors_SMD:R_0603)
      (datasheet ~)
      (libsource (lib Device) (part R) (description Resistor))
      (sheetpath (names /) (tstamps /))
      (tstamp 60269C3A))
    (comp (ref R10)
      (value 10k)
      (footprint Resistors_SMD:R_0603)
      (datasheet ~)
      (libsource (lib Device) (part R) (description Resistor))
      (sheetpath (names /) (tstamps /))
      (tstamp 60269C78))
    (comp (ref U5)
      (value CH552G)
      (footprint Housings_SOIC:SOIC-16_3.9x9.9mm_Pitch1.27mm)
      (libsource (lib ProjectSymbols) (part CH552G) (description ""))
      (sheetpath (names /) (tstamps /))
      (tstamp 602211E1))
    (comp (ref C7)
      (value 1uF)
      (footprint Capacitors_SMD:C_0603)
      (datasheet ~)
      (libsource (lib Device) (part C) (description "Unpolarized capacitor"))
      (sheetpath (names /) (tstamps /))
      (tstamp 60226F43))
    (comp (ref C9)
      (value 100nF)
      (footprint Capacitors_SMD:C_0603)
      (datasheet ~)
      (libsource (lib Device) (part C) (description "Unpolarized capacitor"))
      (sheetpath (names /) (tstamps /))
      (tstamp 6023E0B4))
    (comp (ref R4)
      (value 10k)
      (footprint Resistors_SMD:R_0603)
      (datasheet ~)
      (libsource (lib Device) (part R) (description Resistor))
      (sheetpath (names /) (tstamps /))
      (tstamp 6024B934))
    (comp (ref JP1)
      (value BOOT)
      (footprint Pin_Headers:Pin_Header_Straight_1x02_Pitch2.54mm)
      (datasheet ~)
      (libsource (lib Device) (part Jumper_NC_Small) (description "Jumper, normally closed, small symbol"))
      (sheetpath (names /) (tstamps /))
      (tstamp 6024F083))
    (comp (ref U3)
      (value 74HC4050)
      (footprint Housings_SOIC:SOIC-16_3.9x9.9mm_Pitch1.27mm)
      (datasheet http://www.intersil.com/content/dam/intersil/documents/cd40/cd4050bms.pdf)
      (libsource (lib 4xxx) (part 4050) (description "Hex Buffer"))
      (sheetpath (names /) (tstamps /))
      (tstamp 60278CBE))
    (comp (ref R15)
      (value 100R)
      (footprint Resistors_SMD:R_0603)
      (datasheet ~)
      (libsource (lib Device) (part R) (description Resistor))
      (sheetpath (names /) (tstamps /))
      (tstamp 6036EDD3))
    (comp (ref R11)
      (value 100R)
      (footprint Resistors_SMD:R_0603)
      (datasheet ~)
      (libsource (lib Device) (part R) (description Resistor))
      (sheetpath (names /) (tstamps /))
      (tstamp 60379D22))
    (comp (ref R12)
      (value 100R)
      (footprint Resistors_SMD:R_0603)
      (datasheet ~)
      (libsource (lib Device) (part R) (description Resistor))
      (sheetpath (names /) (tstamps /))
      (tstamp 6039F2FD))
    (comp (ref R13)
      (value 100R)
      (footprint Resistors_SMD:R_0603)
      (datasheet ~)
      (libsource (lib Device) (part R) (description Resistor))
      (sheetpath (names /) (tstamps /))
      (tstamp 603AA2C6))
    (comp (ref R18)
      (value 100R)
      (footprint Resistors_SMD:R_0603)
      (datasheet ~)
      (libsource (lib Device) (part R) (description Resistor))
      (sheetpath (names /) (tstamps /))
      (tstamp 603CDA0A))
    (comp (ref Q1)
      (value BC847)
      (footprint TO_SOT_Packages_SMD:SOT-23)
      (datasheet ~)
      (libsource (lib Device) (part Q_NPN_BEC) (description "NPN transistor, base/emitter/collector"))
      (sheetpath (names /) (tstamps /))
      (tstamp 604BD740))
    (comp (ref C14)
      (value 100nF)
      (footprint Capacitors_SMD:C_0603)
      (datasheet ~)
      (libsource (lib Device) (part C) (description "Unpolarized capacitor"))
      (sheetpath (names /) (tstamps /))
      (tstamp 604BD8BC))
    (comp (ref A1)
      (value Arduino_UNO_R3)
      (footprint ProjectFootprints:Arduino_UNO_R3_WithMountingHoles)
      (datasheet https://www.arduino.cc/en/Main/arduinoBoardUno)
      (libsource (lib MCU_Module) (part Arduino_UNO_R3) (description "Arduino UNO Microcontroller Module, release 3"))
      (sheetpath (names /) (tstamps /))
      (tstamp 609A44A8))
    (comp (ref C6)
      (value 100nF)
      (footprint Capacitors_SMD:C_0603)
      (datasheet ~)
      (libsource (lib Device) (part C) (description "Unpolarized capacitor"))
      (sheetpath (names /) (tstamps /))
      (tstamp 60F295A8))
    (comp (ref SW1)
      (value RESET)
      (footprint Buttons_Switches_SMD:SW_SPST_FSMSM)
      (libsource (lib Switch) (part SW_Push) (description "Push button switch, generic, two pins"))
      (sheetpath (names /) (tstamps /))
      (tstamp 610F78F0))
    (comp (ref J3)
      (value SDCARD)
      (footprint Pin_Headers:Pin_Header_Straight_1x04_Pitch2.54mm)
      (datasheet ~)
      (libsource (lib Connector) (part Conn_01x04_Female) (description "Generic connector, single row, 01x04, script generated (kicad-library-utils/schlib/autogen/connector/)"))
      (sheetpath (names /) (tstamps /))
      (tstamp 611D649B))
    (comp (ref J2)
      (value I2S)
      (footprint Pin_Headers:Pin_Header_Straight_1x04_Pitch2.54mm)
      (datasheet ~)
      (libsource (lib Connector) (part Conn_01x04_Female) (description "Generic connector, single row, 01x04, script generated (kicad-library-utils/schlib/autogen/connector/)"))
      (sheetpath (names /) (tstamps /))
      (tstamp 611D6617))
    (comp (ref C12)
      (value 100uF)
      (footprint Capacitors_Tantalum_SMD:CP_Tantalum_Case-B_EIA-3528-21_Reflow)
      (datasheet ~)
      (libsource (lib Device) (part CP) (description "Polarized capacitor"))
      (sheetpath (names /) (tstamps /))
      (tstamp 6135D8AF))
    (comp (ref R6)
      (value 10k)
      (footprint Resistors_SMD:R_0603)
      (datasheet ~)
      (libsource (lib Device) (part R) (description Resistor))
      (sheetpath (names /) (tstamps /))
      (tstamp 613E626B))
    (comp (ref R5)
      (value 10k)
      (footprint Resistors_SMD:R_0603)
      (datasheet ~)
      (libsource (lib Device) (part R) (description Resistor))
      (sheetpath (names /) (tstamps /))
      (tstamp 613FCE77))
    (comp (ref D1)
      (value LED)
      (footprint LEDs:LED_0805)
      (datasheet ~)
      (libsource (lib Device) (part LED) (description "Light emitting diode"))
      (sheetpath (names /) (tstamps /))
      (tstamp 6024403C))
    (comp (ref R9)
      (value 1k)
      (footprint Resistors_SMD:R_0603)
      (datasheet ~)
      (libsource (lib Device) (part R) (description Resistor))
      (sheetpath (names /) (tstamps /))
      (tstamp 602444D2))
    (comp (ref U4)
      (value AP3401KTTR-G1)
      (footprint TO_SOT_Packages_SMD:SOT-23-6)
      (libsource (lib ProjectSymbols) (part AP3401KTTR-G1) (description ""))
      (sheetpath (names /) (tstamps /))
      (tstamp 602DC4A9))
    (comp (ref C5)
      (value 100nF)
      (footprint Capacitors_SMD:C_0603)
      (datasheet ~)
      (libsource (lib Device) (part C) (description "Unpolarized capacitor"))
      (sheetpath (names /) (tstamps /))
      (tstamp 60440E9D))
    (comp (ref U1)
      (value USBLC6-2SC6Y)
      (footprint TO_SOT_Packages_SMD:SOT-23-6)
      (libsource (lib ProjectSymbols) (part USBLC6-2SC6Y) (description ""))
      (sheetpath (names /) (tstamps /))
      (tstamp 607A167E))
    (comp (ref C15)
      (value 1uF)
      (footprint Capacitors_SMD:C_0603)
      (datasheet ~)
      (libsource (lib Device) (part C) (description "Unpolarized capacitor"))
      (sheetpath (names /) (tstamps /))
      (tstamp 60354569)))
  (libparts
    (libpart (lib 4xxx) (part 4050)
      (description "Hex Buffer")
      (docs http://www.intersil.com/content/dam/intersil/documents/cd40/cd4050bms.pdf)
      (footprints
        (fp DIP?16*))
      (fields
        (field (name Reference) U)
        (field (name Value) 4050))
      (pins
        (pin (num 1) (name VCC) (type power_in))
        (pin (num 2) (name ~) (type output))
        (pin (num 3) (name ~) (type input))
        (pin (num 4) (name ~) (type output))
        (pin (num 5) (name ~) (type input))
        (pin (num 6) (name ~) (type output))
        (pin (num 7) (name ~) (type input))
        (pin (num 8) (name VSS) (type power_in))
        (pin (num 9) (name ~) (type input))
        (pin (num 10) (name ~) (type output))
        (pin (num 11) (name ~) (type input))
        (pin (num 12) (name ~) (type output))
        (pin (num 14) (name ~) (type input))
        (pin (num 15) (name ~) (type output))))
    (libpart (lib Connector) (part Conn_01x04_Female)
      (description "Generic connector, single row, 01x04, script generated (kicad-library-utils/schlib/autogen/connector/)")
      (docs ~)
      (footprints
        (fp Connector*:*_1x??_*))
      (fields
        (field (name Reference) J)
        (field (name Value) Conn_01x04_Female))
      (pins
        (pin (num 1) (name Pin_1) (type passive))
        (pin (num 2) (name Pin_2) (type passive))
        (pin (num 3) (name Pin_3) (type passive))
        (pin (num 4) (name Pin_4) (type passive))))
    (libpart (lib Connector) (part USB_B_Micro)
      (aliases
        (alias USB_B_Mini))
      (description "USB Micro Type B connector")
      (docs ~)
      (footprints
        (fp USB*))
      (fields
        (field (name Reference) J)
        (field (name Value) USB_B_Micro))
      (pins
        (pin (num 1) (name VBUS) (type power_out))
        (pin (num 2) (name D-) (type passive))
        (pin (num 3) (name D+) (type passive))
        (pin (num 4) (name ID) (type passive))
        (pin (num 5) (name GND) (type power_out))
        (pin (num 6) (name Shield) (type passive))))
    (libpart (lib Device) (part C)
      (description "Unpolarized capacitor")
      (docs ~)
      (footprints
        (fp C_*))
      (fields
        (field (name Reference) C)
        (field (name Value) C))
      (pins
        (pin (num 1) (name ~) (type passive))
        (pin (num 2) (name ~) (type passive))))
    (libpart (lib Device) (part CP)
      (description "Polarized capacitor")
      (docs ~)
      (footprints
        (fp CP_*))
      (fields
        (field (name Reference) C)
        (field (name Value) CP))
      (pins
        (pin (num 1) (name ~) (type passive))
        (pin (num 2) (name ~) (type passive))))
    (libpart (lib Device) (part Jumper_NC_Small)
      (description "Jumper, normally closed, small symbol")
      (docs ~)
      (fields
        (field (name Reference) JP)
        (field (name Value) Jumper_NC_Small))
      (pins
        (pin (num 1) (name 1) (type passive))
        (pin (num 2) (name 2) (type passive))))
    (libpart (lib Device) (part L)
      (description Inductor)
      (docs ~)
      (footprints
        (fp Choke_*)
        (fp *Coil*)
        (fp Inductor_*)
        (fp L_*))
      (fields
        (field (name Reference) L)
        (field (name Value) L))
      (pins
        (pin (num 1) (name 1) (type passive))
        (pin (num 2) (name 2) (type passive))))
    (libpart (lib Device) (part LED)
      (description "Light emitting diode")
      (docs ~)
      (footprints
        (fp LED*)
        (fp LED_SMD:*)
        (fp LED_THT:*))
      (fields
        (field (name Reference) D)
        (field (name Value) LED))
      (pins
        (pin (num 1) (name K) (type passive))
        (pin (num 2) (name A) (type passive))))
    (libpart (lib Device) (part Q_NPN_BEC)
      (description "NPN transistor, base/emitter/collector")
      (docs ~)
      (fields
        (field (name Reference) Q)
        (field (name Value) Q_NPN_BEC))
      (pins
        (pin (num 1) (name B) (type input))
        (pin (num 2) (name E) (type passive))
        (pin (num 3) (name C) (type passive))))
    (libpart (lib Device) (part R)
      (description Resistor)
      (docs ~)
      (footprints
        (fp R_*))
      (fields
        (field (name Reference) R)
        (field (name Value) R))
      (pins
        (pin (num 1) (name ~) (type passive))
        (pin (num 2) (name ~) (type passive))))
    (libpart (lib MCU_Module) (part Arduino_UNO_R3)
      (description "Arduino UNO Microcontroller Module, release 3")
      (docs https://www.arduino.cc/en/Main/arduinoBoardUno)
      (footprints
        (fp Arduino*UNO*R3*))
      (fields
        (field (name Reference) A)
        (field (name Value) Arduino_UNO_R3)
        (field (name Footprint) Module:Arduino_UNO_R3))
      (pins
        (pin (num 1) (name NC) (type NotConnected))
        (pin (num 2) (name IOREF) (type output))
        (pin (num 3) (name RESET) (type input))
        (pin (num 4) (name 3V3) (type power_out))
        (pin (num 5) (name +5V) (type power_out))
        (pin (num 6) (name GND) (type power_in))
        (pin (num 7) (name GND) (type power_in))
        (pin (num 8) (name VIN) (type power_in))
        (pin (num 9) (name A0) (type BiDi))
        (pin (num 10) (name A1) (type BiDi))
        (pin (num 11) (name A2) (type BiDi))
        (pin (num 12) (name A3) (type BiDi))
        (pin (num 13) (name A4/SDA) (type BiDi))
        (pin (num 14) (name A5/SCL) (type BiDi))
        (pin (num 15) (name D0/RX) (type BiDi))
        (pin (num 16) (name D1/TX) (type BiDi))
        (pin (num 17) (name D2) (type BiDi))
        (pin (num 18) (name D3) (type BiDi))
        (pin (num 19) (name D4) (type BiDi))
        (pin (num 20) (name D5) (type BiDi))
        (pin (num 21) (name D6) (type BiDi))
        (pin (num 22) (name D7) (type BiDi))
        (pin (num 23) (name D8) (type BiDi))
        (pin (num 24) (name D9) (type BiDi))
        (pin (num 25) (name D10) (type BiDi))
        (pin (num 26) (name D11) (type BiDi))
        (pin (num 27) (name D12) (type BiDi))
        (pin (num 28) (name D13) (type BiDi))
        (pin (num 29) (name GND) (type power_in))
        (pin (num 30) (name AREF) (type input))
        (pin (num 31) (name SDA) (type BiDi))
        (pin (num 32) (name SCL) (type BiDi))))
    (libpart (lib ProjectSymbols) (part AP3401KTTR-G1)
      (fields
        (field (name Reference) U)
        (field (name Value) AP3401KTTR-G1))
      (pins
        (pin (num 1) (name EN) (type input))
        (pin (num 2) (name GND) (type power_in))
        (pin (num 3) (name LX) (type output))
        (pin (num 4) (name VIN) (type power_in))
        (pin (num 5) (name PG) (type openCol))
        (pin (num 6) (name FB) (type passive))))
    (libpart (lib ProjectSymbols) (part CH552G)
      (fields
        (field (name Reference) U)
        (field (name Value) CH552G))
      (pins
        (pin (num 1) (name VBUS1/P3.2) (type passive))
        (pin (num 2) (name P1.4) (type passive))
        (pin (num 3) (name P1.5) (type passive))
        (pin (num 4) (name P1.6) (type passive))
        (pin (num 5) (name P1.7) (type passive))
        (pin (num 6) (name RST) (type passive))
        (pin (num 7) (name TXD/P3.1) (type passive))
        (pin (num 8) (name RXD/P3.0) (type passive))
        (pin (num 9) (name VBUS2/P1.1) (type passive))
        (pin (num 10) (name P3.3) (type passive))
        (pin (num 11) (name P3.4) (type passive))
        (pin (num 12) (name P3.6/UDP) (type BiDi))
        (pin (num 13) (name P3.7/UDM) (type BiDi))
        (pin (num 14) (name GND) (type power_in))
        (pin (num 15) (name VCC) (type power_in))
        (pin (num 16) (name V33) (type BiDi))))
    (libpart (lib ProjectSymbols) (part ESP32-S2-WROOM)
      (fields
        (field (name Reference) U)
        (field (name Value) ESP32-S2-WROOM))
      (pins
        (pin (num 1) (name GND) (type power_in))
        (pin (num 2) (name 3V3) (type power_in))
        (pin (num 3) (name IO0) (type unspc))
        (pin (num 4) (name IO1) (type unspc))
        (pin (num 5) (name IO2) (type unspc))
        (pin (num 6) (name IO3) (type unspc))
        (pin (num 7) (name IO4) (type unspc))
        (pin (num 8) (name IO5) (type unspc))
        (pin (num 9) (name IO6) (type unspc))
        (pin (num 10) (name IO7) (type unspc))
        (pin (num 11) (name IO8) (type unspc))
        (pin (num 12) (name IO9) (type unspc))
        (pin (num 13) (name IO10) (type unspc))
        (pin (num 14) (name IO11) (type unspc))
        (pin (num 15) (name IO12) (type unspc))
        (pin (num 16) (name IO13) (type unspc))
        (pin (num 17) (name IO14) (type unspc))
        (pin (num 18) (name IO15) (type unspc))
        (pin (num 19) (name IO16) (type unspc))
        (pin (num 20) (name IO17) (type unspc))
        (pin (num 21) (name IO18) (type unspc))
        (pin (num 22) (name D-/IO19) (type unspc))
        (pin (num 23) (name D+/IO20) (type unspc))
        (pin (num 24) (name IO21) (type unspc))
        (pin (num 25) (name IO26) (type unspc))
        (pin (num 26) (name GND) (type power_in))
        (pin (num 27) (name IO33) (type unspc))
        (pin (num 28) (name IO34) (type unspc))
        (pin (num 29) (name IO35) (type unspc))
        (pin (num 30) (name IO36) (type unspc))
        (pin (num 31) (name IO37) (type unspc))
        (pin (num 32) (name IO38) (type unspc))
        (pin (num 33) (name IO39/MTCK) (type unspc))
        (pin (num 34) (name IO40/MTDO) (type unspc))
        (pin (num 35) (name IO41/MTDI) (type unspc))
        (pin (num 36) (name IO42/MTMS) (type unspc))
        (pin (num 37) (name TXD0) (type unspc))
        (pin (num 38) (name RXD0) (type unspc))
        (pin (num 39) (name IO45) (type unspc))
        (pin (num 40) (name IO46) (type unspc))
        (pin (num 41) (name EN) (type passive))
        (pin (num 42) (name GND) (type power_in))
        (pin (num 43) (name GND/EP) (type power_in))))
    (libpart (lib ProjectSymbols) (part MIC2033-xxxxM6)
      (fields
        (field (name Reference) U)
        (field (name Value) MIC2033-xxxxM6))
      (pins
        (pin (num 1) (name VIN) (type input))
        (pin (num 2) (name GND) (type power_in))
        (pin (num 3) (name EN) (type input))
        (pin (num 4) (name ~FAULT~) (type openCol))
        (pin (num 5) (name CSLEW) (type passive))
        (pin (num 6) (name VOUT) (type power_out))))
    (libpart (lib ProjectSymbols) (part USBLC6-2SC6Y)
      (fields
        (field (name Reference) U)
        (field (name Value) USBLC6-2SC6Y))
      (pins
        (pin (num 1) (name I/O1) (type BiDi))
        (pin (num 2) (name GND) (type passive))
        (pin (num 3) (name I/O2) (type BiDi))
        (pin (num 4) (name ~) (type BiDi))
        (pin (num 5) (name VBUS) (type passive))
        (pin (num 6) (name ~) (type BiDi))))
    (libpart (lib Switch) (part SW_Push)
      (description "Push button switch, generic, two pins")
      (fields
        (field (name Reference) SW)
        (field (name Value) SW_Push))
      (pins
        (pin (num 1) (name 1) (type passive))
        (pin (num 2) (name 2) (type passive)))))
  (libraries
    (library (logical 4xxx)
      (uri /usr/share/kicad/library/4xxx.lib))
    (library (logical Connector)
      (uri /usr/share/kicad/library/Connector.lib))
    (library (logical Device)
      (uri /usr/share/kicad/library/Device.lib))
    (library (logical MCU_Module)
      (uri /usr/share/kicad/library/MCU_Module.lib))
    (library (logical ProjectSymbols)
      (uri /home/andi/Projekte/Elektronik/bastelino-esp32-s2/hardware/ProjectSymbols.lib))
    (library (logical Switch)
      (uri /usr/share/kicad/library/Switch.lib)))
  (nets
    (net (code 1) (name /D0)
      (node (ref A1) (pin 15))
      (node (ref U6) (pin 10)))
    (net (code 2) (name /D1)
      (node (ref A1) (pin 16))
      (node (ref U6) (pin 11)))
    (net (code 3) (name /D13)
      (node (ref U6) (pin 25))
      (node (ref A1) (pin 28)))
    (net (code 4) (name /D12)
      (node (ref U6) (pin 24))
      (node (ref A1) (pin 27)))
    (net (code 5) (name /D11_USBP)
      (node (ref U6) (pin 23))
      (node (ref A1) (pin 26)))
    (net (code 6) (name /D9)
      (node (ref A1) (pin 24))
      (node (ref U6) (pin 19)))
    (net (code 7) (name VSYS_5V)
      (node (ref U2) (pin 6))
      (node (ref A1) (pin 5))
      (node (ref C6) (pin 1))
      (node (ref U4) (pin 1))
      (node (ref C15) (pin 2))
      (node (ref SW1) (pin 2))
      (node (ref U4) (pin 4))
      (node (ref C8) (pin 1))
      (node (ref D1) (pin 2))
      (node (ref C7) (pin 2))
      (node (ref U5) (pin 15)))
    (net (code 8) (name /D8)
      (node (ref A1) (pin 23))
      (node (ref U6) (pin 18)))
    (net (code 9) (name /D10_USBN)
      (node (ref A1) (pin 25))
      (node (ref U6) (pin 22)))
    (net (code 10) (name /D7_FSPI_WP)
      (node (ref A1) (pin 22))
      (node (ref U6) (pin 17)))
    (net (code 11) (name /D6_FSPI_MISO)
      (node (ref A1) (pin 21))
      (node (ref U6) (pin 16)))
    (net (code 12) (name /D5_FSPI_CLK)
      (node (ref A1) (pin 20))
      (node (ref U6) (pin 15)))
    (net (code 13) (name /D4_FSPI_MOSI)
      (node (ref U6) (pin 14))
      (node (ref A1) (pin 19)))
    (net (code 14) (name /D3_FSPI_CS0)
      (node (ref U6) (pin 13))
      (node (ref A1) (pin 18)))
    (net (code 15) (name /D2_FSPI_HOLD)
      (node (ref U6) (pin 12))
      (node (ref A1) (pin 17)))
    (net (code 16) (name "Net-(R11-Pad1)")
      (node (ref U6) (pin 35))
      (node (ref R11) (pin 1)))
    (net (code 17) (name "Net-(U3-Pad9)")
      (node (ref U5) (pin 9))
      (node (ref U3) (pin 9)))
    (net (code 18) (name "Net-(J1-Pad3)")
      (node (ref J1) (pin 3))
      (node (ref U1) (pin 6)))
    (net (code 19) (name "Net-(J1-Pad2)")
      (node (ref J1) (pin 2))
      (node (ref U1) (pin 4)))
    (net (code 20) (name "Net-(R10-Pad1)")
      (node (ref R10) (pin 1))
      (node (ref U3) (pin 2)))
    (net (code 21) (name "Net-(U1-Pad3)")
      (node (ref U5) (pin 13))
      (node (ref U1) (pin 3)))
    (net (code 22) (name "Net-(R17-Pad2)")
      (node (ref R17) (pin 2))
      (node (ref U6) (pin 3)))
    (net (code 23) (name "Net-(R17-Pad1)")
      (node (ref R17) (pin 1))
      (node (ref U3) (pin 10)))
    (net (code 24) (name "Net-(R12-Pad1)")
      (node (ref U6) (pin 36))
      (node (ref R12) (pin 1)))
    (net (code 25) (name "Net-(R18-Pad1)")
      (node (ref U6) (pin 34))
      (node (ref R18) (pin 1)))
    (net (code 26) (name "Net-(R15-Pad2)")
      (node (ref R15) (pin 2))
      (node (ref U3) (pin 6)))
    (net (code 27) (name "Net-(U3-Pad7)")
      (node (ref U5) (pin 5))
      (node (ref U3) (pin 7)))
    (net (code 28) (name "Net-(Q1-Pad1)")
      (node (ref R10) (pin 2))
      (node (ref Q1) (pin 1)))
    (net (code 29) (name "Net-(A1-Pad30)")
      (node (ref A1) (pin 30)))
    (net (code 30) (name GND)
      (node (ref C13) (pin 1))
      (node (ref C8) (pin 2))
      (node (ref U6) (pin 26))
      (node (ref C7) (pin 1))
      (node (ref R16) (pin 1))
      (node (ref C12) (pin 2))
      (node (ref U6) (pin 1))
      (node (ref R14) (pin 1))
      (node (ref J1) (pin 5))
      (node (ref C11) (pin 2))
      (node (ref C9) (pin 1))
      (node (ref R1) (pin 1))
      (node (ref C2) (pin 2))
      (node (ref U6) (pin 42))
      (node (ref U6) (pin 43))
      (node (ref C1) (pin 1))
      (node (ref Q1) (pin 2))
      (node (ref C14) (pin 1))
      (node (ref R7) (pin 2))
      (node (ref U5) (pin 14))
      (node (ref U2) (pin 2))
      (node (ref R3) (pin 1))
      (node (ref C3) (pin 2))
      (node (ref A1) (pin 29))
      (node (ref C5) (pin 1))
      (node (ref U1) (pin 2))
      (node (ref C15) (pin 1))
      (node (ref U4) (pin 2))
      (node (ref U3) (pin 8))
      (node (ref A1) (pin 7))
      (node (ref A1) (pin 6)))
    (net (code 31) (name "Net-(A1-Pad8)")
      (node (ref A1) (pin 8)))
    (net (code 32) (name /A0)
      (node (ref U6) (pin 9))
      (node (ref A1) (pin 9)))
    (net (code 33) (name /A4)
      (node (ref U6) (pin 5))
      (node (ref A1) (pin 13)))
    (net (code 34) (name "Net-(A1-Pad1)")
      (node (ref A1) (pin 1)))
    (net (code 35) (name /A1)
      (node (ref A1) (pin 10))
      (node (ref U6) (pin 8)))
    (net (code 36) (name /A2)
      (node (ref A1) (pin 11))
      (node (ref U6) (pin 7)))
    (net (code 37) (name /A3)
      (node (ref A1) (pin 12))
      (node (ref U6) (pin 6)))
    (net (code 38) (name /A5)
      (node (ref A1) (pin 14))
      (node (ref U6) (pin 4)))
    (net (code 39) (name "Net-(U4-Pad5)")
      (node (ref U4) (pin 5)))
    (net (code 40) (name "Net-(D1-Pad1)")
      (node (ref R9) (pin 2))
      (node (ref D1) (pin 1)))
    (net (code 41) (name "Net-(R9-Pad1)")
      (node (ref U5) (pin 11))
      (node (ref R9) (pin 1)))
    (net (code 42) (name "Net-(U3-Pad3)")
      (node (ref U5) (pin 10))
      (node (ref U3) (pin 3)))
    (net (code 43) (name "Net-(A1-Pad3)")
      (node (ref A1) (pin 3))
      (node (ref U5) (pin 1)))
    (net (code 44) (name "Net-(R12-Pad2)")
      (node (ref U3) (pin 12))
      (node (ref R12) (pin 2)))
    (net (code 45) (name /I2S_DOUT)
      (node (ref R16) (pin 2))
      (node (ref U6) (pin 40))
      (node (ref J2) (pin 1)))
    (net (code 46) (name /SD_CS)
      (node (ref J3) (pin 1))
      (node (ref U6) (pin 29)))
    (net (code 47) (name /SD_MISO)
      (node (ref U6) (pin 31))
      (node (ref J3) (pin 3)))
    (net (code 48) (name /SD_MOSI)
      (node (ref J3) (pin 2))
      (node (ref U6) (pin 30)))
    (net (code 49) (name "Net-(C6-Pad2)")
      (node (ref U5) (pin 6))
      (node (ref C6) (pin 2))
      (node (ref SW1) (pin 1)))
    (net (code 50) (name /SDA)
      (node (ref A1) (pin 31))
      (node (ref R6) (pin 1))
      (node (ref U6) (pin 20)))
    (net (code 51) (name /SCL)
      (node (ref U6) (pin 21))
      (node (ref R5) (pin 1))
      (node (ref A1) (pin 32)))
    (net (code 52) (name VSYS_3.3V)
      (node (ref A1) (pin 4))
      (node (ref C5) (pin 2))
      (node (ref A1) (pin 2))
      (node (ref C12) (pin 1))
      (node (ref U3) (pin 1))
      (node (ref R8) (pin 1))
      (node (ref U6) (pin 2))
      (node (ref C13) (pin 2))
      (node (ref L1) (pin 2))
      (node (ref R6) (pin 2))
      (node (ref R5) (pin 2))
      (node (ref C10) (pin 1))
      (node (ref C11) (pin 1)))
    (net (code 53) (name /SD_CLK)
      (node (ref J3) (pin 4))
      (node (ref U6) (pin 32)))
    (net (code 54) (name /I2S_DIN)
      (node (ref J2) (pin 4))
      (node (ref U6) (pin 28)))
    (net (code 55) (name /I2S_BCLK)
      (node (ref U6) (pin 27))
      (node (ref J2) (pin 3)))
    (net (code 56) (name /I2S_WS)
      (node (ref J2) (pin 2))
      (node (ref R14) (pin 2))
      (node (ref U6) (pin 39)))
    (net (code 58) (name "Net-(J1-Pad4)")
      (node (ref J1) (pin 4)))
    (net (code 59) (name "Net-(C2-Pad1)")
      (node (ref C2) (pin 1))
      (node (ref J1) (pin 6))
      (node (ref R1) (pin 2)))
    (net (code 60) (name "Net-(C4-Pad1)")
      (node (ref U2) (pin 5))
      (node (ref C4) (pin 1)))
    (net (code 61) (name "Net-(U5-Pad8)")
      (node (ref U6) (pin 37))
      (node (ref U5) (pin 8)))
    (net (code 62) (name "Net-(R13-Pad1)")
      (node (ref U6) (pin 38))
      (node (ref R13) (pin 1)))
    (net (code 63) (name "Net-(L1-Pad1)")
      (node (ref L1) (pin 1))
      (node (ref U4) (pin 3)))
    (net (code 64) (name "Net-(C10-Pad2)")
      (node (ref C10) (pin 2))
      (node (ref R7) (pin 1))
      (node (ref U4) (pin 6))
      (node (ref R8) (pin 2)))
    (net (code 65) (name "Net-(C3-Pad1)")
      (node (ref R2) (pin 1))
      (node (ref U2) (pin 4))
      (node (ref U2) (pin 3))
      (node (ref C3) (pin 1))
      (node (ref R3) (pin 2)))
    (net (code 66) (name "Net-(C1-Pad2)")
      (node (ref J1) (pin 1))
      (node (ref C4) (pin 2))
      (node (ref R2) (pin 2))
      (node (ref U1) (pin 5))
      (node (ref C1) (pin 2))
      (node (ref U2) (pin 1)))
    (net (code 67) (name "Net-(R11-Pad2)")
      (node (ref R11) (pin 2))
      (node (ref U3) (pin 4)))
    (net (code 68) (name "Net-(U3-Pad11)")
      (node (ref U3) (pin 11))
      (node (ref U5) (pin 2)))
    (net (code 69) (name "Net-(R15-Pad1)")
      (node (ref R15) (pin 1))
      (node (ref U6) (pin 33)))
    (net (code 70) (name "Net-(R13-Pad2)")
      (node (ref R13) (pin 2))
      (node (ref U3) (pin 15)))
    (net (code 71) (name "Net-(C9-Pad2)")
      (node (ref U5) (pin 16))
      (node (ref R4) (pin 2))
      (node (ref C9) (pin 2)))
    (net (code 72) (name "Net-(JP1-Pad1)")
      (node (ref R4) (pin 1))
      (node (ref JP1) (pin 1)))
    (net (code 73) (name "Net-(JP1-Pad2)")
      (node (ref U5) (pin 12))
      (node (ref U1) (pin 1))
      (node (ref JP1) (pin 2)))
    (net (code 74) (name "Net-(R18-Pad2)")
      (node (ref R18) (pin 2))
      (node (ref U5) (pin 4)))
    (net (code 75) (name "Net-(U3-Pad5)")
      (node (ref U3) (pin 5))
      (node (ref U5) (pin 3)))
    (net (code 76) (name "Net-(C14-Pad2)")
      (node (ref U6) (pin 41))
      (node (ref Q1) (pin 3))
      (node (ref C14) (pin 2)))
    (net (code 77) (name "Net-(U3-Pad14)")
      (node (ref U5) (pin 7))
      (node (ref U3) (pin 14)))))