EESchema Schematic File Version 4
LIBS:bastelino-esp32-s2-cache
EELAYER 26 0
EELAYER END
$Descr A4 11693 8268
encoding utf-8
Sheet 1 1
Title "Bastelino ESP32-S2"
Date "2021-02-18"
Rev "r1"
Comp "(c) 2021 Andreas Messer"
Comment1 "This work is licensed under a Creative Commons Attribution 4.0 International License."
Comment2 ""
Comment3 ""
Comment4 ""
$EndDescr
Wire Wire Line
	4900 2850 4850 2850
Wire Wire Line
	4850 2850 4850 2950
Wire Wire Line
	4850 2950 4900 2950
Wire Wire Line
	4850 2850 4700 2850
Wire Wire Line
	4700 2850 4700 2900
Connection ~ 4850 2850
$Comp
L Device:L L1
U 1 1 602064E6
P 5900 2850
F 0 "L1" V 6050 2850 50  0000 C CNN
F 1 "2.2uH 1.2A" V 5950 2850 50  0000 C TNN
F 2 "Inductors:Inductor_Abracon_ASPI-3012S" H 5900 2850 50  0001 C CNN
F 3 "~" H 5900 2850 50  0001 C CNN
F 4 "DJNR3015-2R2" H 5900 2850 50  0001 C CNN "MPN"
F 5 "Sumida" H 5900 2850 50  0001 C CNN "Manufacturer"
	1    5900 2850
	0    -1   -1   0   
$EndComp
Wire Wire Line
	5700 2850 5750 2850
Wire Wire Line
	6600 2900 6600 2850
Connection ~ 6600 2850
$Comp
L Device:R R8
U 1 1 6020684C
P 6100 3050
F 0 "R8" H 6050 3100 50  0000 R CNN
F 1 "430k" H 6050 3000 50  0000 R BNN
F 2 "Resistors_SMD:R_0603" V 6030 3050 50  0001 C CNN
F 3 "~" H 6100 3050 50  0001 C CNN
	1    6100 3050
	1    0    0    -1  
$EndComp
Wire Wire Line
	6050 2850 6100 2850
Wire Wire Line
	6100 2850 6100 2900
Wire Wire Line
	6300 2850 6600 2850
Wire Wire Line
	5700 3250 6100 3250
Wire Wire Line
	6100 3250 6100 3200
Wire Wire Line
	6100 2850 6300 2850
Wire Wire Line
	6300 2850 6300 2900
Connection ~ 6100 2850
Wire Wire Line
	6300 3200 6300 3250
Wire Wire Line
	6300 3250 6100 3250
Connection ~ 6100 3250
Connection ~ 6300 2850
$Comp
L Device:R R7
U 1 1 60207B57
P 5900 3450
F 0 "R7" V 5750 3450 50  0000 C CNN
F 1 "100k" V 5850 3450 50  0000 C BNN
F 2 "Resistors_SMD:R_0603" V 5830 3450 50  0001 C CNN
F 3 "~" H 5900 3450 50  0001 C CNN
	1    5900 3450
	0    1    1    0   
$EndComp
Wire Wire Line
	6100 3250 6100 3450
Wire Wire Line
	6100 3450 6050 3450
Wire Wire Line
	5300 3450 5750 3450
Wire Wire Line
	6600 3550 5750 3550
Wire Wire Line
	5750 3550 5300 3450
Connection ~ 5300 3450
Wire Wire Line
	4900 3250 4850 3250
Wire Wire Line
	4850 3250 4850 3450
Wire Wire Line
	4850 3450 5300 3450
Wire Wire Line
	4700 3200 4700 3550
Wire Wire Line
	4700 3550 5300 3450
$Comp
L power:GND #PWR010
U 1 1 60209700
P 5300 3500
F 0 "#PWR010" H 5300 3250 50  0001 C CNN
F 1 "GND" H 5305 3327 50  0001 C CNN
F 2 "" H 5300 3500 50  0001 C CNN
F 3 "" H 5300 3500 50  0001 C CNN
	1    5300 3500
	1    0    0    -1  
$EndComp
Wire Wire Line
	5300 3450 5300 3500
$Comp
L ProjectSymbols:MIC2033-xxxxM6 U2
U 1 1 6020C53F
P 3950 3050
F 0 "U2" H 3950 3400 50  0000 C BNN
F 1 "MIC2033-12AYM6" H 3950 3350 50  0000 C CNN
F 2 "TO_SOT_Packages_SMD:SOT-23-6" H 3950 3050 50  0001 C CNN
F 3 "" H 3950 3050 50  0001 C CNN
	1    3950 3050
	1    0    0    -1  
$EndComp
$Comp
L Device:R R2
U 1 1 6020C60B
P 3000 3050
F 0 "R2" H 2950 3100 50  0000 R CNN
F 1 "10k" H 2950 3150 50  0000 R BNN
F 2 "Resistors_SMD:R_0603" V 2930 3050 50  0001 C CNN
F 3 "~" H 3000 3050 50  0001 C CNN
	1    3000 3050
	-1   0    0    1   
$EndComp
$Comp
L Device:C C4
U 1 1 6020CFCB
P 3350 3050
F 0 "C4" V 3200 3100 50  0000 L CNN
F 1 "100nF" V 3300 3100 50  0000 L BNN
F 2 "Capacitors_SMD:C_0603" H 3388 2900 50  0001 C CNN
F 3 "~" H 3350 3050 50  0001 C CNN
	1    3350 3050
	0    1    1    0   
$EndComp
Wire Wire Line
	3000 3250 3000 3300
Wire Wire Line
	3000 3200 3000 3250
Connection ~ 3000 3250
Wire Wire Line
	3000 2850 3000 2900
$Comp
L power:GND #PWR06
U 1 1 60211EE5
P 4450 3400
F 0 "#PWR06" H 4450 3150 50  0001 C CNN
F 1 "GND" H 4455 3227 50  0001 C CNN
F 2 "" H 4450 3400 50  0001 C CNN
F 3 "" H 4450 3400 50  0001 C CNN
	1    4450 3400
	1    0    0    -1  
$EndComp
$Comp
L power:GND #PWR02
U 1 1 60213463
P 3000 3650
F 0 "#PWR02" H 3000 3400 50  0001 C CNN
F 1 "GND" H 3005 3477 50  0001 C CNN
F 2 "" H 3000 3650 50  0001 C CNN
F 3 "" H 3000 3650 50  0001 C CNN
	1    3000 3650
	1    0    0    -1  
$EndComp
Wire Wire Line
	4350 3350 4450 3350
Wire Wire Line
	3000 3600 3000 3650
$Comp
L Device:C C1
U 1 1 602253D4
P 2800 3050
F 0 "C1" H 2700 3100 50  0000 R CNN
F 1 "1uF" H 2700 3000 50  0000 R BNN
F 2 "Capacitors_SMD:C_0603" H 2838 2900 50  0001 C CNN
F 3 "~" H 2800 3050 50  0001 C CNN
	1    2800 3050
	1    0    0    1   
$EndComp
$Comp
L power:GND #PWR01
U 1 1 602261F3
P 2800 3250
F 0 "#PWR01" H 2800 3000 50  0001 C CNN
F 1 "GND" H 2805 3077 50  0001 C CNN
F 2 "" H 2800 3250 50  0001 C CNN
F 3 "" H 2800 3250 50  0001 C CNN
	1    2800 3250
	1    0    0    -1  
$EndComp
$Comp
L Device:R R3
U 1 1 6022707B
P 3000 3450
F 0 "R3" H 2950 3400 50  0000 R CNN
F 1 "10k" H 2950 3450 50  0000 R BNN
F 2 "Resistors_SMD:R_0603" V 2930 3450 50  0001 C CNN
F 3 "~" H 3000 3450 50  0001 C CNN
	1    3000 3450
	-1   0    0    1   
$EndComp
Text GLabel 4600 2700 2    50   Output ~ 0
VSYS_5V
Text GLabel 6650 2700 2    50   Output ~ 0
VSYS_3.3V
$Comp
L Device:C C10
U 1 1 6022D9BC
P 6300 3050
F 0 "C10" H 6300 3000 50  0000 L TNN
F 1 "22pF" H 6300 2900 50  0000 L CNN
F 2 "Capacitors_SMD:C_0603" H 6338 2900 50  0001 C CNN
F 3 "~" H 6300 3050 50  0001 C CNN
	1    6300 3050
	1    0    0    -1  
$EndComp
Wire Wire Line
	3000 3250 3300 3250
Wire Wire Line
	3500 3350 3550 3350
Wire Wire Line
	3000 2850 3150 2850
Wire Wire Line
	3500 3350 3500 3250
Connection ~ 3500 3250
Wire Wire Line
	3500 3250 3550 3250
$Comp
L Device:C C3
U 1 1 602360F1
P 3300 3450
F 0 "C3" H 3400 3500 50  0000 L TNN
F 1 "100nF" H 3400 3400 50  0000 L CNN
F 2 "Capacitors_SMD:C_0603" H 3338 3300 50  0001 C CNN
F 3 "~" H 3300 3450 50  0001 C CNN
	1    3300 3450
	1    0    0    -1  
$EndComp
$Comp
L power:GND #PWR04
U 1 1 6023618B
P 3300 3650
F 0 "#PWR04" H 3300 3400 50  0001 C CNN
F 1 "GND" H 3305 3477 50  0001 C CNN
F 2 "" H 3300 3650 50  0001 C CNN
F 3 "" H 3300 3650 50  0001 C CNN
	1    3300 3650
	1    0    0    -1  
$EndComp
Wire Wire Line
	3300 3600 3300 3650
Wire Wire Line
	3300 3300 3300 3250
Wire Wire Line
	3300 3250 3500 3250
$Comp
L Connector:USB_B_Micro J1
U 1 1 60239838
P 2700 4350
F 0 "J1" H 2700 4750 50  0000 C CNN
F 1 "USB_B_Micro" H 2700 4700 50  0000 C CNN
F 2 "Connect:USB_Micro-B" H 2850 4300 50  0001 C CNN
F 3 "~" H 2850 4300 50  0001 C CNN
	1    2700 4350
	1    0    0    -1  
$EndComp
$Comp
L power:GND #PWR03
U 1 1 602399A9
P 3100 5200
F 0 "#PWR03" H 3100 4950 50  0001 C CNN
F 1 "GND" H 3105 5027 50  0001 C CNN
F 2 "" H 3100 5200 50  0001 C CNN
F 3 "" H 3100 5200 50  0001 C CNN
	1    3100 5200
	1    0    0    -1  
$EndComp
Connection ~ 3300 3250
Wire Wire Line
	3500 3050 3550 3050
Wire Wire Line
	3200 3050 3150 3050
Wire Wire Line
	3150 3050 3150 2850
Connection ~ 3150 2850
Wire Wire Line
	3150 2850 3550 2850
$Comp
L Device:R R1
U 1 1 60244DB4
P 2800 5150
F 0 "R1" V 2900 5150 50  0000 C CNN
F 1 "100k" V 3000 5150 50  0000 C BNN
F 2 "Resistors_SMD:R_0603" V 2730 5150 50  0001 C CNN
F 3 "~" H 2800 5150 50  0001 C CNN
	1    2800 5150
	0    1    1    0   
$EndComp
$Comp
L Device:C C2
U 1 1 60244E18
P 2800 4950
F 0 "C2" V 2850 4900 50  0000 R CNN
F 1 "100nF" V 2750 4900 50  0000 R CNN
F 2 "Capacitors_SMD:C_0603" H 2838 4800 50  0001 C CNN
F 3 "~" H 2800 4950 50  0001 C CNN
	1    2800 4950
	0    -1   -1   0   
$EndComp
Wire Wire Line
	2950 5150 3100 5150
Wire Wire Line
	2950 4950 3100 4950
Connection ~ 3000 2850
NoConn ~ 3000 4550
Wire Wire Line
	2600 4950 2650 4950
Wire Wire Line
	2600 4750 2600 4950
Connection ~ 2600 4950
Wire Wire Line
	2600 4950 2600 5150
Wire Wire Line
	2600 5150 2650 5150
Wire Wire Line
	2700 4750 2700 4800
Wire Wire Line
	3100 4950 3100 5150
Wire Wire Line
	2700 4800 3100 4800
Wire Wire Line
	3100 4800 3100 4950
Connection ~ 3100 4950
Wire Wire Line
	3100 5150 3100 5200
Connection ~ 3100 5150
$Comp
L ProjectSymbols:ESP32-S2-WROOM U6
U 1 1 602053DB
P 9250 3950
F 0 "U6" H 9250 5400 50  0000 C BNN
F 1 "ESP32-S2-WROOM" H 9250 5350 50  0000 C CNN
F 2 "ProjectFootprints:Espressif_ESP32-S2-WROOM" H 9250 5050 50  0001 C CNN
F 3 "" H 9250 5050 50  0001 C CNN
	1    9250 3950
	1    0    0    -1  
$EndComp
$Comp
L Device:C C11
U 1 1 60205543
P 6600 3050
F 0 "C11" H 6600 3000 50  0000 L TNN
F 1 "10uF" H 6600 2900 50  0000 L CNN
F 2 "Capacitors_SMD:C_0805" H 6638 2900 50  0001 C CNN
F 3 "~" H 6600 3050 50  0001 C CNN
	1    6600 3050
	1    0    0    -1  
$EndComp
$Comp
L Device:C C8
U 1 1 6020558D
P 4700 3050
F 0 "C8" H 4700 2950 50  0000 R CNN
F 1 "10uF" H 4700 2850 50  0000 R BNN
F 2 "Capacitors_SMD:C_0805" H 4738 2900 50  0001 C CNN
F 3 "~" H 4700 3050 50  0001 C CNN
	1    4700 3050
	1    0    0    -1  
$EndComp
$Comp
L Device:C C13
U 1 1 60207148
P 7800 2850
F 0 "C13" H 7800 2550 50  0000 C TNN
F 1 "1uF" H 7800 2600 50  0000 C CNN
F 2 "Capacitors_SMD:C_0603" H 7838 2700 50  0001 C CNN
F 3 "~" H 7800 2850 50  0001 C CNN
	1    7800 2850
	1    0    0    1   
$EndComp
Wire Wire Line
	7800 2650 7800 2700
$Comp
L power:GND #PWR013
U 1 1 60214019
P 7800 3050
F 0 "#PWR013" H 7800 2800 50  0001 C CNN
F 1 "GND" H 7805 2877 50  0001 C CNN
F 2 "" H 7800 3050 50  0001 C CNN
F 3 "" H 7800 3050 50  0001 C CNN
	1    7800 3050
	1    0    0    -1  
$EndComp
Wire Wire Line
	7800 3000 7800 3050
Connection ~ 7800 2650
$Comp
L Device:R R17
U 1 1 6023BA2E
P 8300 3050
F 0 "R17" V 8200 2950 50  0000 C CNN
F 1 "10k" V 8150 2950 50  0000 C BNN
F 2 "Resistors_SMD:R_0603" V 8230 3050 50  0001 C CNN
F 3 "~" H 8300 3050 50  0001 C CNN
	1    8300 3050
	0    -1   -1   0   
$EndComp
$Comp
L power:GND #PWR016
U 1 1 6024858E
P 8500 5400
F 0 "#PWR016" H 8500 5150 50  0001 C CNN
F 1 "GND" H 8505 5227 50  0001 C CNN
F 2 "" H 8500 5400 50  0001 C CNN
F 3 "" H 8500 5400 50  0001 C CNN
	1    8500 5400
	1    0    0    -1  
$EndComp
Wire Wire Line
	8550 5050 8500 5050
Wire Wire Line
	8500 5050 8500 5150
Wire Wire Line
	8550 5350 8500 5350
Connection ~ 8500 5350
Wire Wire Line
	8500 5350 8500 5400
Wire Wire Line
	8550 5250 8500 5250
Connection ~ 8500 5250
Wire Wire Line
	8500 5250 8500 5350
Wire Wire Line
	8550 5150 8500 5150
Connection ~ 8500 5150
Wire Wire Line
	8500 5150 8500 5250
Text Label 9950 3150 0    50   ~ 0
A0
Text Label 9950 3050 0    50   ~ 0
A1
Text Label 9950 2950 0    50   ~ 0
A2
Text Label 9950 2850 0    50   ~ 0
A3
Text Label 9950 2750 0    50   ~ 0
A4
Text Label 9950 2650 0    50   ~ 0
A5
Text Label 9950 3350 0    50   ~ 0
D1
Text Label 9950 3250 0    50   ~ 0
D0
Text Label 9950 3550 0    50   ~ 0
D3_FSPI_CS0
Text Label 9950 3650 0    50   ~ 0
D4_FSPI_MOSI
Text Label 9950 3750 0    50   ~ 0
D5_FSPI_CLK
Text Label 9950 3850 0    50   ~ 0
D6_FSPI_MISO
Text Label 9950 3450 0    50   ~ 0
D2_FSPI_HOLD
Text Label 9950 3950 0    50   ~ 0
D7_FSPI_WP
Text Label 9950 4850 0    50   ~ 0
I2S_BCLK
Text Label 8150 2850 0    50   ~ 0
I2S_WS
Text Label 9950 4950 0    50   ~ 0
I2S_DIN
Text Label 8150 2950 0    50   ~ 0
I2S_DOUT
Text Label 9950 5050 0    50   ~ 0
SD_CS
Text Label 9950 5250 0    50   ~ 0
SD_MISO
Text Label 9950 5150 0    50   ~ 0
SD_MOSI
Text Label 9950 5350 0    50   ~ 0
SD_CLK
Text Label 9950 4750 0    50   ~ 0
D13
Text Label 9950 4650 0    50   ~ 0
D12
Text Label 9950 4150 0    50   ~ 0
D9
Text Label 9950 4050 0    50   ~ 0
D8
Text Label 9950 4450 0    50   ~ 0
D10_USBN
Text Label 9950 4550 0    50   ~ 0
D11_USBP
Text Label 9950 4250 0    50   ~ 0
SDA
Text Label 9950 4350 0    50   ~ 0
SCL
$Comp
L Device:R R14
U 1 1 60269BDE
P 8000 3250
F 0 "R14" H 8100 3200 50  0000 L CNN
F 1 "10k" H 8100 3250 50  0000 L BNN
F 2 "Resistors_SMD:R_0603" V 7930 3250 50  0001 C CNN
F 3 "~" H 8000 3250 50  0001 C CNN
	1    8000 3250
	-1   0    0    1   
$EndComp
$Comp
L Device:R R16
U 1 1 60269C3A
P 8100 3250
F 0 "R16" H 8050 3200 50  0000 R CNN
F 1 "10k" H 8050 3250 50  0000 R BNN
F 2 "Resistors_SMD:R_0603" V 8030 3250 50  0001 C CNN
F 3 "~" H 8100 3250 50  0001 C CNN
	1    8100 3250
	-1   0    0    1   
$EndComp
$Comp
L Device:R R10
U 1 1 60269C78
P 7800 3650
F 0 "R10" V 7950 3650 50  0000 C CNN
F 1 "10k" V 7850 3650 50  0000 C TNN
F 2 "Resistors_SMD:R_0603" V 7730 3650 50  0001 C CNN
F 3 "~" H 7800 3650 50  0001 C CNN
	1    7800 3650
	0    -1   -1   0   
$EndComp
$Comp
L power:GND #PWR014
U 1 1 60272D7C
P 8050 3500
F 0 "#PWR014" H 8050 3250 50  0001 C CNN
F 1 "GND" H 8055 3327 50  0001 C CNN
F 2 "" H 8050 3500 50  0001 C CNN
F 3 "" H 8050 3500 50  0001 C CNN
	1    8050 3500
	1    0    0    -1  
$EndComp
$Comp
L ProjectSymbols:CH552G U5
U 1 1 602211E1
P 5650 4250
F 0 "U5" H 5650 4750 50  0000 C CNN
F 1 "CH552G" H 5650 4350 50  0000 C CNN
F 2 "Housings_SOIC:SOIC-16_3.9x9.9mm_Pitch1.27mm" H 5650 4250 50  0001 C CNN
F 3 "" H 5650 4250 50  0001 C CNN
	1    5650 4250
	1    0    0    -1  
$EndComp
$Comp
L Device:C C7
U 1 1 60226F43
P 4450 4050
F 0 "C7" H 4450 3900 50  0000 R CNN
F 1 "1uF" H 4450 3950 50  0000 R BNN
F 2 "Capacitors_SMD:C_0603" H 4488 3900 50  0001 C CNN
F 3 "~" H 4450 4050 50  0001 C CNN
	1    4450 4050
	1    0    0    1   
$EndComp
$Comp
L power:GND #PWR07
U 1 1 602270CE
P 4450 4250
F 0 "#PWR07" H 4450 4000 50  0001 C CNN
F 1 "GND" H 4455 4077 50  0001 C CNN
F 2 "" H 4450 4250 50  0001 C CNN
F 3 "" H 4450 4250 50  0001 C CNN
	1    4450 4250
	1    0    0    -1  
$EndComp
Wire Wire Line
	4450 4200 4450 4250
Wire Wire Line
	4450 3850 4450 3900
$Comp
L power:GND #PWR09
U 1 1 60230913
P 4850 4400
F 0 "#PWR09" H 4850 4150 50  0001 C CNN
F 1 "GND" H 4855 4227 50  0001 C CNN
F 2 "" H 4850 4400 50  0001 C CNN
F 3 "" H 4850 4400 50  0001 C CNN
	1    4850 4400
	1    0    0    -1  
$EndComp
$Comp
L Device:C C9
U 1 1 6023E0B4
P 4850 4150
F 0 "C9" H 4850 3750 50  0000 C CNN
F 1 "100nF" H 4850 3850 50  0000 C TNN
F 2 "Capacitors_SMD:C_0603" H 4888 4000 50  0001 C CNN
F 3 "~" H 4850 4150 50  0001 C CNN
	1    4850 4150
	-1   0    0    1   
$EndComp
Wire Wire Line
	4450 3850 5000 3850
Wire Wire Line
	4850 3950 4850 4000
Wire Wire Line
	4850 3950 5050 3950
$Comp
L Device:R R4
U 1 1 6024B934
P 4650 4150
F 0 "R4" H 4650 3750 50  0000 C CNN
F 1 "10k" H 4650 3850 50  0000 C TNN
F 2 "Resistors_SMD:R_0603" V 4580 4150 50  0001 C CNN
F 3 "~" H 4650 4150 50  0001 C CNN
	1    4650 4150
	-1   0    0    1   
$EndComp
Wire Wire Line
	4850 3950 4650 3950
Wire Wire Line
	4650 3950 4650 4000
Connection ~ 4850 3950
$Comp
L Device:Jumper_NC_Small JP1
U 1 1 6024F083
P 4650 4450
F 0 "JP1" V 4600 4400 50  0000 R CNN
F 1 "BOOT" V 4700 4400 50  0000 R CNN
F 2 "Pin_Headers:Pin_Header_Straight_1x02_Pitch2.54mm" H 4650 4450 50  0001 C CNN
F 3 "~" H 4650 4450 50  0001 C CNN
	1    4650 4450
	0    1    1    0   
$EndComp
Wire Wire Line
	5050 4350 4850 4350
Wire Wire Line
	4850 4350 4850 4400
Wire Wire Line
	4850 4350 4850 4300
Connection ~ 4850 4350
Wire Wire Line
	5050 4650 4650 4650
Wire Wire Line
	4650 4650 4650 4550
Wire Wire Line
	4650 4300 4650 4350
Text GLabel 3900 3850 0    50   Input ~ 0
VSYS_5V
Wire Wire Line
	3900 3850 3950 3850
Connection ~ 4450 3850
$Comp
L 4xxx:4050 U3
U 4 1 60278CBE
P 7500 3350
F 0 "U3" H 7550 3500 50  0000 C CNN
F 1 "74HC4050" H 7450 2850 50  0000 C CNN
F 2 "Housings_SOIC:SOIC-16_3.9x9.9mm_Pitch1.27mm" H 7500 3350 50  0001 C CNN
F 3 "http://www.intersil.com/content/dam/intersil/documents/cd40/cd4050bms.pdf" H 7500 3350 50  0001 C CNN
	4    7500 3350
	1    0    0    -1  
$EndComp
$Comp
L 4xxx:4050 U3
U 5 1 6027955B
P 7500 4850
F 0 "U3" H 7500 5000 50  0000 C CNN
F 1 "74HC4050" H 7500 4850 50  0001 C CNN
F 2 "Housings_SOIC:SOIC-16_3.9x9.9mm_Pitch1.27mm" H 7500 4850 50  0001 C CNN
F 3 "http://www.intersil.com/content/dam/intersil/documents/cd40/cd4050bms.pdf" H 7500 4850 50  0001 C CNN
	5    7500 4850
	1    0    0    -1  
$EndComp
$Comp
L 4xxx:4050 U3
U 6 1 6027D494
P 7300 5250
F 0 "U3" H 7300 5400 50  0000 C CNN
F 1 "74HC4050" H 7300 5250 50  0001 C CNN
F 2 "Housings_SOIC:SOIC-16_3.9x9.9mm_Pitch1.27mm" H 7300 5250 50  0001 C CNN
F 3 "http://www.intersil.com/content/dam/intersil/documents/cd40/cd4050bms.pdf" H 7300 5250 50  0001 C CNN
	6    7300 5250
	1    0    0    -1  
$EndComp
Wire Wire Line
	7800 4150 7850 4150
$Comp
L Device:R R15
U 1 1 6036EDD3
P 8000 4150
F 0 "R15" V 7850 4150 50  0000 C CNN
F 1 "100R" V 7950 4150 50  0000 C BNN
F 2 "Resistors_SMD:R_0603" V 7930 4150 50  0001 C CNN
F 3 "~" H 8000 4150 50  0001 C CNN
	1    8000 4150
	0    1    1    0   
$EndComp
$Comp
L Device:R R11
U 1 1 60379D22
P 7900 4450
F 0 "R11" V 7750 4450 50  0000 C CNN
F 1 "100R" V 7850 4450 50  0000 C BNN
F 2 "Resistors_SMD:R_0603" V 7830 4450 50  0001 C CNN
F 3 "~" H 7900 4450 50  0001 C CNN
	1    7900 4450
	0    1    1    0   
$EndComp
Wire Wire Line
	7600 4450 7750 4450
$Comp
L Device:R R12
U 1 1 6039F2FD
P 8000 4850
F 0 "R12" V 7850 4850 50  0000 C CNN
F 1 "100R" V 7950 4850 50  0000 C BNN
F 2 "Resistors_SMD:R_0603" V 7930 4850 50  0001 C CNN
F 3 "~" H 8000 4850 50  0001 C CNN
	1    8000 4850
	0    1    1    0   
$EndComp
Wire Wire Line
	8200 4450 8200 4850
$Comp
L Device:R R13
U 1 1 603AA2C6
P 7900 5250
F 0 "R13" V 7750 5250 50  0000 C CNN
F 1 "100R" V 7850 5250 50  0000 C BNN
F 2 "Resistors_SMD:R_0603" V 7830 5250 50  0001 C CNN
F 3 "~" H 7900 5250 50  0001 C CNN
	1    7900 5250
	0    1    1    0   
$EndComp
Wire Wire Line
	8550 4850 8400 4850
Wire Wire Line
	8400 4850 8400 5250
Wire Wire Line
	8400 5250 8050 5250
$Comp
L Device:R R18
U 1 1 603CDA0A
P 8350 4250
F 0 "R18" V 8150 4250 50  0000 C BNN
F 1 "100R" V 8200 4250 50  0000 C CNN
F 2 "Resistors_SMD:R_0603" V 8280 4250 50  0001 C CNN
F 3 "~" H 8350 4250 50  0001 C CNN
	1    8350 4250
	0    1    1    0   
$EndComp
Wire Wire Line
	6750 4350 6750 5050
Wire Wire Line
	8200 4250 8150 4250
Wire Wire Line
	8150 4250 8150 4650
Wire Wire Line
	7750 5250 7600 5250
Wire Wire Line
	7200 4850 6850 4850
Wire Wire Line
	6850 4850 6850 3950
Wire Wire Line
	8550 4750 8300 4750
Wire Wire Line
	8300 4750 8300 5050
Wire Wire Line
	6250 4450 6700 4450
Wire Wire Line
	6700 4450 6700 5250
Wire Wire Line
	6700 5250 7000 5250
Wire Wire Line
	6250 4350 6750 4350
Wire Wire Line
	6250 4250 7100 4250
Wire Wire Line
	6250 3950 6850 3950
$Comp
L 4xxx:4050 U3
U 2 1 60385A67
P 7300 4450
F 0 "U3" H 7200 4650 50  0000 C CNN
F 1 "74HC4050" H 7300 4450 50  0001 C CNN
F 2 "Housings_SOIC:SOIC-16_3.9x9.9mm_Pitch1.27mm" H 7300 4450 50  0001 C CNN
F 3 "http://www.intersil.com/content/dam/intersil/documents/cd40/cd4050bms.pdf" H 7300 4450 50  0001 C CNN
	2    7300 4450
	1    0    0    -1  
$EndComp
$Comp
L 4xxx:4050 U3
U 1 1 60393E7A
P 7300 3650
F 0 "U3" H 7200 3850 50  0000 C CNN
F 1 "74HC4050" H 7300 3450 50  0001 C CNN
F 2 "Housings_SOIC:SOIC-16_3.9x9.9mm_Pitch1.27mm" H 7300 3650 50  0001 C CNN
F 3 "http://www.intersil.com/content/dam/intersil/documents/cd40/cd4050bms.pdf" H 7300 3650 50  0001 C CNN
	1    7300 3650
	1    0    0    -1  
$EndComp
Wire Wire Line
	8100 3400 8100 3450
Wire Wire Line
	8000 3400 8000 3450
Wire Wire Line
	8000 3450 8050 3450
Wire Wire Line
	8050 3450 8050 3500
Wire Wire Line
	8050 3450 8100 3450
Connection ~ 8050 3450
Wire Wire Line
	8150 4150 8550 4150
Wire Wire Line
	6250 4050 6950 4050
Wire Wire Line
	7000 4450 6950 4450
Wire Wire Line
	6950 4450 6950 4050
$Comp
L Device:Q_NPN_BEC Q1
U 1 1 604BD740
P 8200 3650
F 0 "Q1" H 8200 3500 50  0000 R BNN
F 1 "BC847" H 8200 3450 50  0000 R CNN
F 2 "TO_SOT_Packages_SMD:SOT-23" H 8400 3750 50  0001 C CNN
F 3 "~" H 8200 3650 50  0001 C CNN
	1    8200 3650
	1    0    0    -1  
$EndComp
$Comp
L Device:C C14
U 1 1 604BD8BC
P 8500 3650
F 0 "C14" H 8500 3500 50  0000 R CNN
F 1 "100nF" H 8500 3600 50  0000 R TNN
F 2 "Capacitors_SMD:C_0603" H 8538 3500 50  0001 C CNN
F 3 "~" H 8500 3650 50  0001 C CNN
	1    8500 3650
	-1   0    0    1   
$EndComp
Wire Wire Line
	8500 3400 8300 3400
Wire Wire Line
	8300 3400 8300 3450
Connection ~ 8500 3400
Wire Wire Line
	8500 3400 8500 3500
Wire Wire Line
	8300 3850 8300 3900
Wire Wire Line
	8300 3900 8500 3900
Wire Wire Line
	8500 3900 8500 3800
Wire Wire Line
	8500 2750 8550 2750
Wire Wire Line
	8450 3050 8550 3050
Wire Wire Line
	7900 3050 7900 3350
Wire Wire Line
	7800 3350 7900 3350
Wire Wire Line
	7900 3050 8150 3050
Wire Wire Line
	8100 3100 8100 2950
Wire Wire Line
	8100 2950 8550 2950
Wire Wire Line
	8000 3100 8000 2850
Wire Wire Line
	8500 2750 8500 3400
$Comp
L power:GND #PWR015
U 1 1 6052FBFE
P 8500 3950
F 0 "#PWR015" H 8500 3700 50  0001 C CNN
F 1 "GND" H 8505 3777 50  0001 C CNN
F 2 "" H 8500 3950 50  0001 C CNN
F 3 "" H 8500 3950 50  0001 C CNN
	1    8500 3950
	1    0    0    -1  
$EndComp
Wire Wire Line
	7800 2650 8550 2650
Wire Wire Line
	8200 4450 8550 4450
Wire Wire Line
	8500 4250 8550 4250
$Comp
L 4xxx:4050 U3
U 3 1 6058DDB6
P 7500 4150
F 0 "U3" H 7500 4300 50  0000 C CNN
F 1 "74HC4050" H 7500 4376 50  0001 C CNN
F 2 "Housings_SOIC:SOIC-16_3.9x9.9mm_Pitch1.27mm" H 7500 4150 50  0001 C CNN
F 3 "http://www.intersil.com/content/dam/intersil/documents/cd40/cd4050bms.pdf" H 7500 4150 50  0001 C CNN
	3    7500 4150
	1    0    0    -1  
$EndComp
Wire Wire Line
	7100 4250 7100 4150
Wire Wire Line
	7100 4150 7200 4150
Wire Wire Line
	8500 3900 8500 3950
Connection ~ 8500 3900
Wire Wire Line
	7950 3650 8000 3650
Wire Wire Line
	7600 3650 7650 3650
Wire Wire Line
	8200 4850 8150 4850
Wire Wire Line
	8100 4350 8550 4350
Wire Wire Line
	8050 4450 8100 4450
Wire Wire Line
	8100 4350 8100 4450
Wire Wire Line
	6800 3350 7200 3350
Wire Wire Line
	3850 4750 5050 4750
Connection ~ 4650 4650
Wire Wire Line
	3000 4150 3050 4150
Wire Wire Line
	3000 4350 3100 4350
Wire Wire Line
	3000 4450 3100 4450
Wire Wire Line
	2800 3200 2800 3250
Wire Wire Line
	3000 2850 2800 2850
Wire Wire Line
	2800 2850 2800 2900
Wire Wire Line
	2800 2850 2550 2850
Wire Wire Line
	2550 3850 3050 3850
Wire Wire Line
	3050 3850 3050 4150
Connection ~ 2800 2850
Connection ~ 3050 4150
Wire Wire Line
	3850 4450 3700 4450
Wire Wire Line
	3850 4450 3850 4750
Wire Wire Line
	3700 4350 3900 4350
Wire Wire Line
	3900 4350 3900 4650
Wire Wire Line
	3900 4650 4650 4650
Connection ~ 4700 2850
Wire Wire Line
	4450 3350 4450 3400
Wire Wire Line
	2550 2850 2550 3850
$Comp
L MCU_Module:Arduino_UNO_R3 A1
U 1 1 609A44A8
P 5600 6250
F 0 "A1" H 5950 7200 50  0000 C CNN
F 1 "Arduino_UNO_R3" V 5600 6250 50  0000 C CNN
F 2 "ProjectFootprints:Arduino_UNO_R3_WithMountingHoles" H 5750 5200 50  0001 L CNN
F 3 "https://www.arduino.cc/en/Main/arduinoBoardUno" H 5400 7300 50  0001 C CNN
	1    5600 6250
	-1   0    0    -1  
$EndComp
Entry Wire Line
	8000 2500 8100 2400
Entry Wire Line
	8100 2500 8200 2400
Wire Wire Line
	8000 2850 8000 2500
Connection ~ 8000 2850
Wire Wire Line
	8100 2950 8100 2850
Connection ~ 8100 2950
Wire Wire Line
	8100 2850 8100 2500
Entry Wire Line
	10450 2650 10550 2750
Entry Wire Line
	10450 3350 10550 3450
Entry Wire Line
	10450 3450 10550 3550
Entry Wire Line
	10450 3550 10550 3650
Entry Wire Line
	10450 3650 10550 3750
Entry Wire Line
	10450 3750 10550 3850
Entry Wire Line
	10450 3850 10550 3950
Entry Wire Line
	10450 3950 10550 4050
Entry Wire Line
	10450 4050 10550 4150
Entry Wire Line
	10450 4150 10550 4250
Entry Wire Line
	10450 4250 10550 4350
Entry Wire Line
	10450 4350 10550 4450
Entry Wire Line
	10450 4450 10550 4550
Entry Wire Line
	10450 4550 10550 4650
Entry Wire Line
	10450 4650 10550 4750
Entry Wire Line
	10450 4750 10550 4850
Entry Wire Line
	10450 4850 10550 4950
Entry Wire Line
	10450 4950 10550 5050
Entry Wire Line
	10450 5050 10550 5150
Entry Wire Line
	10450 5150 10550 5250
Entry Wire Line
	10450 5250 10550 5350
Entry Wire Line
	10450 5350 10550 5450
Entry Wire Line
	10450 3250 10550 3350
Entry Wire Line
	10450 3150 10550 3250
Entry Wire Line
	10450 3050 10550 3150
Entry Wire Line
	10450 2950 10550 3050
Entry Wire Line
	10450 2850 10550 2950
Entry Wire Line
	10450 2750 10550 2850
Wire Wire Line
	9950 2650 10450 2650
Wire Wire Line
	10450 2750 9950 2750
Wire Wire Line
	9950 2850 10450 2850
Wire Wire Line
	10450 2950 9950 2950
Wire Wire Line
	9950 3050 10450 3050
Wire Wire Line
	10450 3150 9950 3150
Wire Wire Line
	9950 3250 10450 3250
Wire Wire Line
	10450 3350 9950 3350
Wire Wire Line
	9950 3450 10450 3450
Wire Wire Line
	10450 3550 9950 3550
Wire Wire Line
	9950 3650 10450 3650
Wire Wire Line
	10450 3750 9950 3750
Wire Wire Line
	9950 3850 10450 3850
Wire Wire Line
	10450 3950 9950 3950
Wire Wire Line
	9950 4050 10450 4050
Wire Wire Line
	10450 4150 9950 4150
Wire Wire Line
	9950 4250 10450 4250
Wire Wire Line
	10450 4350 9950 4350
Wire Wire Line
	9950 4450 10450 4450
Wire Wire Line
	10450 4550 9950 4550
Wire Wire Line
	10450 4750 9950 4750
Wire Wire Line
	9950 4850 10450 4850
Wire Wire Line
	10450 4950 9950 4950
Wire Wire Line
	9950 5050 10450 5050
Wire Wire Line
	10450 5150 9950 5150
Wire Wire Line
	9950 5250 10450 5250
Wire Wire Line
	10450 5350 9950 5350
Wire Wire Line
	8150 4650 6900 4650
Wire Wire Line
	6900 4650 6900 4150
Wire Wire Line
	6900 4150 6250 4150
Text Label 5100 6250 2    50   ~ 0
A0
Text Label 5100 6350 2    50   ~ 0
A1
Text Label 5100 6550 2    50   ~ 0
A3
Text Label 5100 6650 2    50   ~ 0
A4
Text Label 5100 6450 2    50   ~ 0
A2
Text Label 5100 6750 2    50   ~ 0
A5
Text Label 6100 5650 0    50   ~ 0
D0
Text Label 6100 5750 0    50   ~ 0
D1
Wire Wire Line
	6600 6950 6100 6950
Wire Wire Line
	6100 6850 6600 6850
Wire Wire Line
	6600 6750 6100 6750
Wire Wire Line
	6100 6650 6600 6650
Wire Wire Line
	6600 6550 6100 6550
Wire Wire Line
	6100 6450 6600 6450
Wire Wire Line
	6600 6350 6100 6350
Wire Wire Line
	6100 6250 6600 6250
Wire Wire Line
	6600 6150 6100 6150
Wire Wire Line
	6100 6050 6600 6050
Wire Wire Line
	6600 5950 6100 5950
Wire Wire Line
	6100 5850 6600 5850
Wire Wire Line
	6600 5750 6100 5750
Text Label 6100 6750 0    50   ~ 0
D11_USBP
Text Label 6100 6650 0    50   ~ 0
D10_USBN
Text Label 6100 6850 0    50   ~ 0
D12
Text Label 6100 6950 0    50   ~ 0
D13
Text Label 6100 6350 0    50   ~ 0
D7_FSPI_WP
Text Label 6100 5850 0    50   ~ 0
D2_FSPI_HOLD
Text Label 6100 6250 0    50   ~ 0
D6_FSPI_MISO
Text Label 6100 6150 0    50   ~ 0
D5_FSPI_CLK
Text Label 6100 6050 0    50   ~ 0
D4_FSPI_MOSI
Text Label 6100 5950 0    50   ~ 0
D3_FSPI_CS0
Text Label 6100 6450 0    50   ~ 0
D8
Text Label 6100 6550 0    50   ~ 0
D9
Wire Wire Line
	9950 4650 10450 4650
Text Label 5100 6950 2    50   ~ 0
SDA
Text Label 5100 7050 2    50   ~ 0
SCL
Wire Wire Line
	6100 5650 6600 5650
Text GLabel 3900 4950 0    50   Input ~ 0
VSYS_5V
Text GLabel 3900 5050 0    50   Input ~ 0
VSYS_3.3V
Wire Wire Line
	5500 5050 5500 5250
Wire Wire Line
	3900 4950 5400 4950
Wire Wire Line
	5400 4950 5400 5250
Wire Wire Line
	5100 5850 4950 5850
Wire Wire Line
	4950 5850 4950 5050
Wire Wire Line
	4950 5050 5500 5050
$Comp
L power:GND #PWR011
U 1 1 60E1B61A
P 5600 7450
F 0 "#PWR011" H 5600 7200 50  0001 C CNN
F 1 "GND" H 5605 7277 50  0001 C CNN
F 2 "" H 5600 7450 50  0001 C CNN
F 3 "" H 5600 7450 50  0001 C CNN
	1    5600 7450
	1    0    0    -1  
$EndComp
Wire Wire Line
	5600 7350 5600 7400
Wire Wire Line
	5700 7350 5700 7400
Wire Wire Line
	5700 7400 5600 7400
Connection ~ 5600 7400
Wire Wire Line
	5600 7400 5600 7450
Wire Wire Line
	5500 7350 5500 7400
Wire Wire Line
	5500 7400 5600 7400
Entry Wire Line
	6600 5650 6700 5550
Entry Wire Line
	6600 5750 6700 5650
Entry Wire Line
	4550 6350 4650 6250
Entry Wire Line
	4550 6450 4650 6350
Entry Wire Line
	4550 6550 4650 6450
Entry Wire Line
	4550 6650 4650 6550
Entry Wire Line
	4550 6750 4650 6650
Entry Wire Line
	4550 6850 4650 6750
Entry Wire Line
	4550 7050 4650 6950
Entry Wire Line
	4550 7150 4650 7050
Wire Wire Line
	5100 6250 4650 6250
Wire Wire Line
	4650 6350 5100 6350
Wire Wire Line
	4650 6450 5100 6450
Wire Wire Line
	4650 6550 5100 6550
Wire Wire Line
	4650 6650 5100 6650
Wire Wire Line
	4650 6750 5100 6750
Wire Wire Line
	5100 6950 4850 6950
Wire Wire Line
	4650 7050 4750 7050
Wire Bus Line
	4550 7600 6700 7600
Wire Bus Line
	10550 5550 6700 5550
Entry Wire Line
	6600 5850 6700 5750
Entry Wire Line
	6600 5950 6700 5850
Entry Wire Line
	6600 6050 6700 5950
Entry Wire Line
	6600 6150 6700 6050
Entry Wire Line
	6600 6250 6700 6150
Entry Wire Line
	6600 6350 6700 6250
Entry Wire Line
	6600 6450 6700 6350
Entry Wire Line
	6600 6550 6700 6450
Entry Wire Line
	6600 6650 6700 6550
Entry Wire Line
	6600 6750 6700 6650
Entry Wire Line
	6600 6850 6700 6750
Entry Wire Line
	6600 6950 6700 6850
$Comp
L Device:C C6
U 1 1 60F295A8
P 4150 4100
F 0 "C6" H 4150 4050 50  0000 L TNN
F 1 "100nF" H 4150 3950 50  0000 L CNN
F 2 "Capacitors_SMD:C_0603" H 4188 3950 50  0001 C CNN
F 3 "~" H 4150 4100 50  0001 C CNN
	1    4150 4100
	1    0    0    -1  
$EndComp
Wire Wire Line
	5000 4050 5050 4050
Wire Wire Line
	5050 5200 5050 5650
Wire Wire Line
	5050 5650 5100 5650
Wire Wire Line
	5000 4050 5000 4600
Wire Wire Line
	5000 4600 4150 4600
Wire Wire Line
	4150 4600 4150 4350
Wire Wire Line
	4150 3950 4150 3850
Connection ~ 4150 3850
Wire Wire Line
	4150 3850 4450 3850
$Comp
L Switch:SW_Push SW1
U 1 1 610F78F0
P 3950 4100
F 0 "SW1" V 4050 4200 50  0000 L TNN
F 1 "RESET" V 4000 4200 50  0000 L CNN
F 2 "Buttons_Switches_SMD:SW_SPST_FSMSM" H 3950 4300 50  0001 C CNN
F 3 "" H 3950 4300 50  0001 C CNN
	1    3950 4100
	0    -1   -1   0   
$EndComp
Wire Wire Line
	3950 3900 3950 3850
Connection ~ 3950 3850
Wire Wire Line
	3950 3850 4150 3850
Wire Wire Line
	3950 4300 3950 4350
Wire Wire Line
	3950 4350 4150 4350
Connection ~ 4150 4350
Wire Wire Line
	4150 4350 4150 4250
$Comp
L Connector:Conn_01x04_Female J3
U 1 1 611D649B
P 4200 7050
F 0 "J3" H 4227 7026 50  0000 L CNN
F 1 "SDCARD" H 4227 6935 50  0001 L CNN
F 2 "Pin_Headers:Pin_Header_Straight_1x04_Pitch2.54mm" H 4200 7050 50  0001 C CNN
F 3 "~" H 4200 7050 50  0001 C CNN
	1    4200 7050
	1    0    0    -1  
$EndComp
$Comp
L Connector:Conn_01x04_Female J2
U 1 1 611D6617
P 4200 6350
F 0 "J2" H 4227 6326 50  0000 L CNN
F 1 "I2S" H 4227 6235 50  0001 L CNN
F 2 "Pin_Headers:Pin_Header_Straight_1x04_Pitch2.54mm" H 4200 6350 50  0001 C CNN
F 3 "~" H 4200 6350 50  0001 C CNN
	1    4200 6350
	1    0    0    -1  
$EndComp
Text Label 3650 6950 0    50   ~ 0
SD_CS
Text Label 3650 7150 0    50   ~ 0
SD_MISO
Text Label 3650 7050 0    50   ~ 0
SD_MOSI
Text Label 3650 7250 0    50   ~ 0
SD_CLK
Wire Wire Line
	3650 6950 4000 6950
Wire Wire Line
	4000 7050 3650 7050
Wire Wire Line
	3650 7150 4000 7150
Wire Wire Line
	4000 7250 3650 7250
Text Label 3650 6550 0    50   ~ 0
I2S_DIN
Text Label 3650 6450 0    50   ~ 0
I2S_BCLK
Text Label 3650 6350 0    50   ~ 0
I2S_WS
Text Label 3650 6250 0    50   ~ 0
I2S_DOUT
Wire Wire Line
	3650 6250 4000 6250
Wire Wire Line
	4000 6350 3650 6350
Wire Wire Line
	3650 6450 4000 6450
Wire Wire Line
	4000 6550 3650 6550
Entry Wire Line
	3550 6350 3650 6250
Entry Wire Line
	3550 6450 3650 6350
Entry Wire Line
	3550 6550 3650 6450
Entry Wire Line
	3550 6650 3650 6550
Entry Wire Line
	3550 7050 3650 6950
Entry Wire Line
	3550 7150 3650 7050
Entry Wire Line
	3550 7250 3650 7150
Entry Wire Line
	3550 7350 3650 7250
Wire Bus Line
	3550 7600 4550 7600
Connection ~ 4550 7600
$Comp
L Device:CP C12
U 1 1 6135D8AF
P 7500 2850
F 0 "C12" H 7500 3150 50  0000 C BNN
F 1 "100uF" H 7500 3100 50  0000 C CNN
F 2 "Capacitors_Tantalum_SMD:CP_Tantalum_Case-B_EIA-3528-21_Reflow" H 7538 2700 50  0001 C CNN
F 3 "~" H 7500 2850 50  0001 C CNN
	1    7500 2850
	1    0    0    -1  
$EndComp
$Comp
L power:GND #PWR012
U 1 1 6135E31D
P 7500 3050
F 0 "#PWR012" H 7500 2800 50  0001 C CNN
F 1 "GND" H 7505 2877 50  0001 C CNN
F 2 "" H 7500 3050 50  0001 C CNN
F 3 "" H 7500 3050 50  0001 C CNN
	1    7500 3050
	1    0    0    -1  
$EndComp
Wire Wire Line
	7500 3000 7500 3050
Wire Wire Line
	7500 2700 7500 2650
Wire Wire Line
	6600 2700 6600 2850
NoConn ~ 5100 6050
$Comp
L Device:R R6
U 1 1 613E626B
P 4850 6050
F 0 "R6" H 4750 6000 50  0000 C CNN
F 1 "10k" H 4800 6100 50  0000 R TNN
F 2 "Resistors_SMD:R_0603" V 4780 6050 50  0001 C CNN
F 3 "~" H 4850 6050 50  0001 C CNN
	1    4850 6050
	-1   0    0    1   
$EndComp
$Comp
L Device:R R5
U 1 1 613FCE77
P 4750 6050
F 0 "R5" H 4850 6000 50  0000 C CNN
F 1 "10k" H 4800 6100 50  0000 L TNN
F 2 "Resistors_SMD:R_0603" V 4680 6050 50  0001 C CNN
F 3 "~" H 4750 6050 50  0001 C CNN
	1    4750 6050
	-1   0    0    1   
$EndComp
Wire Wire Line
	4950 5850 4850 5850
Wire Wire Line
	4750 5850 4750 5900
Connection ~ 4950 5850
Wire Wire Line
	4850 5850 4850 5900
Connection ~ 4850 5850
Wire Wire Line
	4850 5850 4750 5850
Wire Wire Line
	4850 6200 4850 6950
Connection ~ 4850 6950
Wire Wire Line
	4850 6950 4650 6950
Wire Wire Line
	4750 6200 4750 7050
Connection ~ 4750 7050
Wire Wire Line
	4750 7050 5100 7050
Connection ~ 4950 5050
Wire Wire Line
	3900 5050 4100 5050
$Comp
L Device:LED D1
U 1 1 6024403C
P 5450 3700
F 0 "D1" H 5450 3550 50  0000 C CNN
F 1 "LED" H 5450 3650 50  0000 C TNN
F 2 "LEDs:LED_0805" H 5450 3700 50  0001 C CNN
F 3 "~" H 5450 3700 50  0001 C CNN
	1    5450 3700
	-1   0    0    1   
$EndComp
$Comp
L Device:R R9
U 1 1 602444D2
P 6100 3700
F 0 "R9" V 5900 3700 50  0000 C CNN
F 1 "1k" V 6050 3700 50  0000 C BNN
F 2 "Resistors_SMD:R_0603" V 6030 3700 50  0001 C CNN
F 3 "~" H 6100 3700 50  0001 C CNN
	1    6100 3700
	0    1    1    0   
$EndComp
Wire Wire Line
	5600 3700 5950 3700
Wire Wire Line
	6250 3700 6350 3700
Wire Wire Line
	5300 3700 5000 3700
Wire Wire Line
	5000 3700 5000 3850
Connection ~ 5000 3850
Wire Wire Line
	5000 3850 5050 3850
Wire Wire Line
	6750 5050 8300 5050
$Comp
L ProjectSymbols:AP3401KTTR-G1 U4
U 1 1 602DC4A9
P 5300 3050
F 0 "U4" H 5300 3475 50  0000 C CNN
F 1 "AP3401KTTR-G1" H 5300 3384 50  0000 C CNN
F 2 "TO_SOT_Packages_SMD:SOT-23-6" H 5300 3050 50  0001 C CNN
F 3 "" H 5300 3050 50  0001 C CNN
	1    5300 3050
	1    0    0    -1  
$EndComp
Wire Wire Line
	6600 3200 6600 3550
$Comp
L 4xxx:4050 U3
U 7 1 603A9DBB
P 4450 5600
F 0 "U3" H 4500 6000 50  0000 L BNN
F 1 "74HC4050" H 4500 5950 50  0000 L CNN
F 2 "Housings_SOIC:SOIC-16_3.9x9.9mm_Pitch1.27mm" H 4450 5600 50  0001 C CNN
F 3 "http://www.intersil.com/content/dam/intersil/documents/cd40/cd4050bms.pdf" H 4450 5600 50  0001 C CNN
	7    4450 5600
	1    0    0    -1  
$EndComp
Wire Wire Line
	4450 5050 4450 5100
Connection ~ 4450 5050
Wire Wire Line
	4450 5050 4950 5050
$Comp
L power:GND #PWR08
U 1 1 603DC13E
P 4450 6150
F 0 "#PWR08" H 4450 5900 50  0001 C CNN
F 1 "GND" H 4455 5977 50  0001 C CNN
F 2 "" H 4450 6150 50  0001 C CNN
F 3 "" H 4450 6150 50  0001 C CNN
	1    4450 6150
	1    0    0    -1  
$EndComp
Wire Wire Line
	4450 6100 4450 6150
$Comp
L Device:C C5
U 1 1 60440E9D
P 4100 5250
F 0 "C5" H 4100 4850 50  0000 C CNN
F 1 "100nF" H 4100 4950 50  0000 C TNN
F 2 "Capacitors_SMD:C_0603" H 4138 5100 50  0001 C CNN
F 3 "~" H 4100 5250 50  0001 C CNN
	1    4100 5250
	-1   0    0    1   
$EndComp
Wire Wire Line
	4100 5050 4100 5100
Connection ~ 4100 5050
Wire Wire Line
	4100 5050 4450 5050
$Comp
L power:GND #PWR05
U 1 1 6045A64B
P 4100 5450
F 0 "#PWR05" H 4100 5200 50  0001 C CNN
F 1 "GND" H 4105 5277 50  0001 C CNN
F 2 "" H 4100 5450 50  0001 C CNN
F 3 "" H 4100 5450 50  0001 C CNN
	1    4100 5450
	1    0    0    -1  
$EndComp
Wire Wire Line
	4100 5400 4100 5450
NoConn ~ 4900 3150
Wire Wire Line
	3050 4150 3750 4150
Wire Wire Line
	3750 4150 3750 4250
Wire Wire Line
	3750 4250 3700 4250
$Comp
L ProjectSymbols:USBLC6-2SC6Y U1
U 1 1 607A167E
P 3400 4450
F 0 "U1" H 3400 4850 50  0000 C BNN
F 1 "USBLC6-2SC6Y" H 3400 4800 50  0000 C CNN
F 2 "TO_SOT_Packages_SMD:SOT-23-6" H 3400 4450 50  0001 C CNN
F 3 "" H 3400 4450 50  0001 C CNN
	1    3400 4450
	-1   0    0    -1  
$EndComp
$Comp
L power:GND #PWR0101
U 1 1 60344569
P 3750 4600
F 0 "#PWR0101" H 3750 4350 50  0001 C CNN
F 1 "GND" H 3755 4427 50  0001 C CNN
F 2 "" H 3750 4600 50  0001 C CNN
F 3 "" H 3750 4600 50  0001 C CNN
	1    3750 4600
	1    0    0    -1  
$EndComp
Wire Wire Line
	3700 4550 3750 4550
Wire Wire Line
	3750 4550 3750 4600
Wire Wire Line
	8000 2850 8550 2850
Wire Wire Line
	7800 4850 7850 4850
Wire Wire Line
	6250 4550 6300 4550
Wire Wire Line
	6300 4550 6300 5200
Wire Wire Line
	5050 5200 6300 5200
Wire Wire Line
	6800 3350 6800 3850
Wire Wire Line
	6800 3850 6250 3850
Wire Wire Line
	6600 3650 6600 4650
Wire Wire Line
	6600 3650 7000 3650
$Comp
L Device:C C15
U 1 1 60354569
P 4450 3050
F 0 "C15" H 4400 3150 50  0000 R CNN
F 1 "1uF" H 4400 3200 50  0000 R BNN
F 2 "Capacitors_SMD:C_0603" H 4488 2900 50  0001 C CNN
F 3 "~" H 4450 3050 50  0001 C CNN
	1    4450 3050
	1    0    0    1   
$EndComp
Wire Wire Line
	4350 2850 4450 2850
Wire Wire Line
	7500 2650 7800 2650
Wire Wire Line
	4450 2850 4450 2900
Connection ~ 4450 2850
Wire Wire Line
	4450 2850 4700 2850
Wire Wire Line
	4450 3200 4450 3350
Connection ~ 4450 3350
Wire Wire Line
	4450 2850 4450 2700
Wire Wire Line
	4450 2700 4600 2700
Wire Wire Line
	6600 2700 6650 2700
Wire Wire Line
	7300 2850 7300 2650
Wire Wire Line
	7300 2650 7500 2650
Wire Wire Line
	6600 2850 7300 2850
Connection ~ 7500 2650
NoConn ~ 5700 5250
Wire Wire Line
	6350 4750 6250 4750
Wire Wire Line
	6350 3700 6350 4750
Wire Wire Line
	6600 4650 6250 4650
Wire Bus Line
	8100 2400 10550 2400
Wire Bus Line
	3550 6350 3550 7600
Wire Bus Line
	4550 6350 4550 7600
Wire Bus Line
	6700 5550 6700 7600
Wire Bus Line
	10550 2400 10550 5550
$EndSCHEMATC
