{
  "engineName": "bizcon-data-search2",
  "endpointBase": "https://enterprise-search-deployment-f7bdf7.ent.us-east-1.aws.found.io",
  "searchKey": "search-241852exv6hd9pnkco5ggr2o",
  "resultFields": [
    "ultimate_parent_company",
    "city",
    "ownership_type",
    "is_headquarters",
    "us_sic_1987_description",
    "naics2017_code",
    "country_region",
    "tradestyle_duns_number",
    "state_or_province",
    "uk_sic_2007_code",
    "revenue",
    "assets",
    "pre_tax_profit",
    "us_8_digit_sic_description",
    "address_line_1",
    "liabilities",
    "business_description",
    "isic_revcode",
    "address_line_3",
    "address_line_2",
    "employees_all_state",
    "fax",
    "a",
    "ticker",
    "b",
    "parent_company",
    "c",
    "us8_digit_sic_code",
    "d",
    "naics_2017_description",
    "e",
    "uk_sic_2007_description",
    "f",
    "g",
    "ultimate_parent_country",
    "dbhooversindustry",
    "isic_revcodedescription",
    "naicode",
    "url",
    "parent_region",
    "tradestyle_number",
    "entity_type",
    "phone",
    "company_name",
    "uc_sic_1987_code",
    "postal_code",
    "employees",
    "id"
  ],
  "sortFields": [

  ],
  "facets": [
    "revenue",
    "employees"
  ],
  "titleField": "company_name"
}
