<svg width="34" height="33" viewBox="0 0 34 33" fill="none" xmlns="http://www.w3.org/2000/svg">
<path d="M26.1 28.4667C26.1 26.0532 25.1413 23.7386 23.4347 22.032C21.7281 20.3254 19.4135 19.3667 17 19.3667C14.5866 19.3667 12.2719 20.3254 10.5654 22.032C8.85877 23.7386 7.90002 26.0532 7.90002 28.4667" stroke="#F10A34" stroke-width="2" stroke-linecap="round" stroke-linejoin="round"/>
<path d="M17 19.3667C20.3505 19.3667 23.0667 16.6505 23.0667 13.3C23.0667 9.94948 20.3505 7.23334 17 7.23334C13.6495 7.23334 10.9333 9.94948 10.9333 13.3C10.9333 16.6505 13.6495 19.3667 17 19.3667Z" stroke="#F10A34" stroke-width="2" stroke-linecap="round" stroke-linejoin="round"/>
<path d="M17 31.5C25.3763 31.5 32.1666 24.7097 32.1666 16.3334C32.1666 7.95703 25.3763 1.16669 17 1.16669C8.62366 1.16669 1.83331 7.95703 1.83331 16.3334C1.83331 24.7097 8.62366 31.5 17 31.5Z" stroke="#F10A34" stroke-width="2" stroke-linecap="round" stroke-linejoin="round"/>
</svg>
