"0",""
"0","# Men in psychology bigrams frequency"
"0","tidy_wiam_bigrams %>%"
"0","  dplyr::filter(assumed_gender == ""man"") %>%"
"0","  dplyr::filter(acad_disc == ""psych"") %>%"
"0","  dplyr::count(word1, word2, sort = TRUE) %>%"
"0","  head(20) %>%"
"0","  kableExtra::kbl(caption = ""Top 20 bigrams used for men psychologists"") %>%"
"0","  kableExtra::kable_classic(full_width = F)"
