{
    "id": "9F6A88DC",
    "path": "/run/user/1000/gvfs/google-drive:host=gmail.com,user=amelie.gourdon/1qYf5k6yFzMWuhuIjODJM9feTHRvv7E4x/1pbMOWXFX2PkHXDEmwstVWV1hMOChyQU2/1BBEbKJw_hb_YjR9H6SrTR5U6OVtchYhh/wiam_webscraping.Rmd",
    "project_path": "1BBEbKJw_hb_YjR9H6SrTR5U6OVtchYhh/wiam_webscraping.Rmd",
    "type": "r_markdown",
    "hash": "768167189",
    "contents": "",
    "dirty": false,
    "created": 1623746054531.0,
    "source_on_save": false,
    "relative_order": 3,
    "properties": {
        "tempName": "Untitled2",
        "source_window_id": "",
        "Source": "Source",
        "cursorPosition": "56,22",
        "scrollLine": "38",
        "last_setup_crc32": "7DE3DD4D57dd2aa4"
    },
    "folds": "",
    "lastKnownWriteTime": 1623749043,
    "encoding": "UTF-8",
    "collab_server": "",
    "source_window": "",
    "last_content_update": 1623749076011,
    "read_only": false,
    "read_only_alternatives": []
}