"0",""
"0","y2y3_1819 <-"
"0","  read_excel(here(""data"", ""y3_1819"", ""level6_clean.xlsx"")) %>%"
"0","  clean_names() %>%"
"0","  select("
"0","    ""ku_id"","
"0","    ""sortname"","
"0","    ""ba5801"","
"0","    ""bh5101"","
"0","    ""bo5501"","
"0","    ""bs5202"","
"0","    ""bh6101"","
"0","    ""bs6201"","
"0","    ""option1"","
"0","    ""option2"""
"0","  ) %>%"
"0","  rename("
"0","    id = ku_id,"
"0","    name = sortname,"
"0","    elec1 = option1,"
"0","    elec2 = option2"
"0","  ) %>%"
"0","  mutate(elec1 = as.numeric(elec1)) %>%"
"0","  mutate(elec2 = as.numeric(elec2)) %>%"
"0","  mutate(lowest_y3 = pmin(bh6101, bs6201, elec1, elec2)) %>%"
"0","  mutate(y3_wmean = (bh6101 + bs6201 + elec1 + elec2 - lowest_y3 / 2) / 3.5) %>%"
"0","  mutate(lowest_y2 = pmin(bh5101, bs5202, bo5501, ba5801)) %>%"
"0","  mutate(y2_wmean = (bh5101 + bs5202 + bo5501 + ba5801 - lowest_y2 / 2) / 3.5) %>%"
"0","  mutate(final = y2_wmean * .2 + y3_wmean * .8) %>%"
"0","  mutate(diff = y3_wmean - y2_wmean)"
"0",""
"0","write_xlsx(y2y3_1819, here(""data"", ""y3_1819"", ""y2y3_1819.xlsx""))"
