<svg xmlns="http://www.w3.org/2000/svg" width="30" height="38" viewBox="0 0 30 38">
  <g id="Group_116" data-name="Group 116" transform="translate(-32 -595)">
    <g id="location" transform="translate(35 595)">
      <path id="Path_140" data-name="Path 140" d="M137.216,63.76V70.5a.393.393,0,0,0,.2.34l5.832,3.367a.393.393,0,0,0,.393,0l5.832-3.367a.393.393,0,0,0,.2-.34V63.76a.393.393,0,0,0-.2-.34l-5.832-3.367a.393.393,0,0,0-.393,0l-5.832,3.367A.393.393,0,0,0,137.216,63.76Zm.786.681,5.046,2.914v5.827L138,70.268Zm5.439,2.233L138.4,63.76l2.13-1.23,5.046,2.914Zm.393,6.508V67.355l5.046-2.914v5.827Zm-.393-12.335,5.046,2.914-2.13,1.23-5.046-2.914Z" transform="translate(-133.169 -56.855)"/>
      <path id="Path_141" data-name="Path 141" d="M281.777,200.841a.393.393,0,0,0-.393,0l-2.688,1.552a.393.393,0,0,0-.2.34v1.816a.393.393,0,0,0,.59.34l2.688-1.552a.393.393,0,0,0,.2-.34v-1.816A.393.393,0,0,0,281.777,200.841Zm-.59,1.929-1.9,1.1v-.908l1.9-1.1Z" transform="translate(-267.048 -190.265)"/>
      <path id="Path_142" data-name="Path 142" d="M70.272,0a10.272,10.272,0,0,0-8.29,16.339l0,0c.024.038,7.337,10.015,7.337,10.015a1.188,1.188,0,0,0,.951.481,1.175,1.175,0,0,0,.948-.484c.027-.033,7.342-10.011,7.342-10.011A10.273,10.273,0,0,0,70.272,0Zm7.656,15.875c-.072.1-7.229,9.862-7.337,10.009l0,0a.392.392,0,0,1-.634,0c-.072-.1-7.239-9.876-7.336-10.009l0,0a9.486,9.486,0,1,1,15.312,0Z" transform="translate(-60)"/>
      <path id="Path_143" data-name="Path 143" d="M98.7,30a8.713,8.713,0,0,0-5.542,1.994.393.393,0,1,0,.5.606,7.913,7.913,0,1,1-1.06,1.059.393.393,0,0,0-.606-.5A8.7,8.7,0,1,0,98.7,30Z" transform="translate(-88.428 -28.428)"/>
    </g>
    <text id="Routing" transform="translate(32 631)" font-size="8" font-family="SegoeUI-Bold, Segoe UI" font-weight="700"><tspan x="0" y="0">الشحنات</tspan></text>
  </g>
</svg>
